{"text_format":"1","workbook":"xlsx","n_sheets":11,"sheets":["Engagés","Poule 1","Poule 2","Poule 3","Poule 4","Poule 5","Poule 6","Poule 7","Poule 8","Résultats de poule","Tableau"],"not_rendered":{"charts":0,"images":37,"macros":1,"external_links":0,"defined_names":2,"comments":0,"pivot_tables":0},"unopened":[],"bounds":{"document_bytes":16777216,"sheet_cells":100000,"rows_first":2000,"rows_last":500,"rows_between":2000,"halvings":0,"cell_chars":16384,"cell_head_chars":4096},"cells_cut":0,"cells_raw":0,"read":"whole","date_system":"1900"}

{"sheet":"Engagés","index":0,"n_rows":37,"n_cols":15,"rows_kept":37,"cut":false,"hidden":false,"merged":[[0,0,2,2],[0,4,0,5],[1,4,1,5],[2,4,2,5],[5,7,5,10],[19,7,19,10],[19,11,19,14],[26,7,26,10],[26,11,26,14],[5,11,5,14],[12,7,12,10],[12,11,12,14]]}
["Championnat par équipe promo Comité de Paris",null,null,"DATE :","2026-03-25"]
[null,null,null,"LIEU :","Stanislas"]
[null,null,null,"CATEGORIE :","BG Promo"]
["Tête de série","ETABLISSEMENT","NOM","PRENOM","SIGLE"]
[]
[1,null,"FEN 1",null,null,null,null,"Poule 1",null,null,null,"Poule 2"]
[2,null,"STAN 1",null,null,null,null,1,{"$f":"VLOOKUP($H7,$A$1:$F$37,3,FALSE)","v":"FEN 1"},{"$f":"VLOOKUP($H7,$A$1:$F$37,4,FALSE)","v":0},{"$f":"VLOOKUP($H7,$A$1:$F$37,5,FALSE)","v":0},2,{"$f":"VLOOKUP($L7,$A$1:$F$37,3,FALSE)","v":"STAN 1"},{"$f":"VLOOKUP($L7,$A$1:$F$37,4,FALSE)","v":0},{"$f":"VLOOKUP($L7,$A$1:$F$37,5,FALSE)","v":0}]
[3,null,"FEN 2",null,null,null,null,15,{"$f":"VLOOKUP($H8,$A$1:$F$37,3,FALSE)","v":"FEN 3"},{"$f":"VLOOKUP($H8,$A$1:$F$37,4,FALSE)","v":0},{"$f":"VLOOKUP($H8,$A$1:$F$37,5,FALSE)","v":0},16,{"$f":"VLOOKUP($L8,$A$1:$F$37,3,FALSE)","v":"STAN 8"},{"$f":"VLOOKUP($L8,$A$1:$F$37,4,FALSE)","v":0},{"$f":"VLOOKUP($L8,$A$1:$F$37,5,FALSE)","v":0}]
[4,null,"STAN 2",null,null,null,null,19,0,0,0,20,0,0,0]
[5,null,"STAN 3",null,null,null,null,null,{"$error":"#N/A"},{"$error":"#N/A"},{"$error":"#N/A"},null,{"$error":"#N/A"},{"$error":"#N/A"},{"$error":"#N/A"}]
[6,null,"ALMA 1"]
[7,null,"BND 1"]
[8,null,"STAN 4",null,null,null,null,"Poule 3",null,null,null,"Poule 4"]
[9,null,"ALMA 2",null,null,null,null,3,{"$f":"VLOOKUP($H14,$A$1:$F$37,3,FALSE)","v":"FEN 2"},{"$f":"VLOOKUP($H14,$A$1:$F$37,4,FALSE)","v":0},{"$f":"VLOOKUP($H14,$A$1:$F$37,5,FALSE)","v":0},4,{"$f":"VLOOKUP($L14,$A$1:$F$37,3,FALSE)","v":"STAN 2"},{"$f":"VLOOKUP($L14,$A$1:$F$37,4,FALSE)","v":0},{"$f":"VLOOKUP($L14,$A$1:$F$37,5,FALSE)","v":0}]
[10,null,"STAN 5",null,null,null,null,13,{"$f":"VLOOKUP($H15,$A$1:$F$37,3,FALSE)","v":"STAN 6"},{"$f":"VLOOKUP($H15,$A$1:$F$37,4,FALSE)","v":0},{"$f":"VLOOKUP($H15,$A$1:$F$37,5,FALSE)","v":0},14,{"$f":"VLOOKUP($L15,$A$1:$F$37,3,FALSE)","v":"STAN 7"},{"$f":"VLOOKUP($L15,$A$1:$F$37,4,FALSE)","v":0},{"$f":"VLOOKUP($L15,$A$1:$F$37,5,FALSE)","v":0}]
[11,null,"SLH 1",null,null,null,null,17,0,0,0,18,0,0,0]
[12,null,"BND 2",null,null,null,null,null,{"$error":"#N/A"},{"$error":"#N/A"},{"$error":"#N/A"},null,{"$error":"#N/A"},{"$error":"#N/A"},{"$error":"#N/A"}]
[13,null,"STAN 6"]
[14,null,"STAN 7"]
[15,null,"FEN 3",null,null,null,null,"Poule 5",null,null,null,"Poule 6"]
[16,null,"STAN 8",null,null,null,null,5,{"$f":"VLOOKUP($H21,$A$1:$F$37,3,FALSE)","v":"STAN 3"},{"$f":"VLOOKUP($H21,$A$1:$F$37,4,FALSE)","v":0},{"$f":"VLOOKUP($H21,$A$1:$F$37,5,FALSE)","v":0},6,{"$f":"VLOOKUP($L21,$A$1:$F$37,3,FALSE)","v":"ALMA 1"},{"$f":"VLOOKUP($L21,$A$1:$F$37,4,FALSE)","v":0},{"$f":"VLOOKUP($L21,$A$1:$F$37,5,FALSE)","v":0}]
[17,null,null,null,null,null,null,11,{"$f":"VLOOKUP($H22,$A$1:$F$37,3,FALSE)","v":"SLH 1"},{"$f":"VLOOKUP($H22,$A$1:$F$37,4,FALSE)","v":0},{"$f":"VLOOKUP($H22,$A$1:$F$37,5,FALSE)","v":0},12,{"$f":"VLOOKUP($L22,$A$1:$F$37,3,FALSE)","v":"BND 2"},{"$f":"VLOOKUP($L22,$A$1:$F$37,4,FALSE)","v":0},{"$f":"VLOOKUP($L22,$A$1:$F$37,5,FALSE)","v":0}]
[18,null,null,null,null,null,null,23,0,0,0,24,0,0,0]
[19,null,null,null,null,null,null,null,{"$error":"#N/A"},{"$error":"#N/A"},{"$error":"#N/A"},null,{"$error":"#N/A"},{"$error":"#N/A"},{"$error":"#N/A"}]
[20]
[21]
[22,null,null,null,null,null,null,"Poule 7",null,null,null,"Poule 8"]
[23,null,null,null,null,null,null,7,{"$f":"VLOOKUP($H28,$A$1:$F$37,3,FALSE)","v":"BND 1"},{"$f":"VLOOKUP($H28,$A$1:$F$37,4,FALSE)","v":0},{"$f":"VLOOKUP($H28,$A$1:$F$37,5,FALSE)","v":0},8,{"$f":"VLOOKUP($L28,$A$1:$F$37,3,FALSE)","v":"STAN 4"},{"$f":"VLOOKUP($L28,$A$1:$F$37,4,FALSE)","v":0},{"$f":"VLOOKUP($L28,$A$1:$F$37,5,FALSE)","v":0}]
[24,null,null,null,null,null,null,9,{"$f":"VLOOKUP($H29,$A$1:$F$37,3,FALSE)","v":"ALMA 2"},{"$f":"VLOOKUP($H29,$A$1:$F$37,4,FALSE)","v":0},{"$f":"VLOOKUP($H29,$A$1:$F$37,5,FALSE)","v":0},10,{"$f":"VLOOKUP($L29,$A$1:$F$37,3,FALSE)","v":"STAN 5"},{"$f":"VLOOKUP($L29,$A$1:$F$37,4,FALSE)","v":0},{"$f":"VLOOKUP($L29,$A$1:$F$37,5,FALSE)","v":0}]
[25,null,null,null,null,null,null,21,0,0,0,22,0,0,0]
[26,null,null,null,null,null,null,null,{"$error":"#N/A"},{"$error":"#N/A"},{"$error":"#N/A"},null,{"$error":"#N/A"},{"$error":"#N/A"},{"$error":"#N/A"}]
[27]
[28]
[29]
[30]
[31]
[32]

{"sheet":"Poule 1","index":1,"n_rows":24,"n_cols":7,"rows_kept":24,"cut":false,"hidden":false,"merged":[[20,4,20,5],[23,0,23,1],[23,2,23,3],[23,4,23,5],[21,0,21,1],[21,2,21,3],[14,0,14,2],[14,3,14,4],[21,4,21,5],[22,0,22,1],[15,0,15,2],[16,0,16,2],[17,0,17,2],[18,0,18,3],[18,4,18,6],[19,0,19,1],[19,2,19,3],[19,4,19,5],[22,2,22,3],[22,4,22,5],[20,0,20,1],[20,2,20,3],[9,0,9,2],[10,0,10,2],[11,0,11,2],[12,0,12,2],[13,0,13,6],[0,0,0,6],[1,0,1,2],[1,3,1,6],[7,0,7,6],[8,0,8,2],[8,3,8,4]]}
["TENNIS DE TABLE"]
["POULE 1",null,null,"TABLE N°"]
[null,"NOM","Prénom","Sigle","Vict","Def","Classement"]
[1,{"$f":"Engagés!I7","v":"FEN 1"},{"$f":"Engagés!J7","v":0},{"$f":"Engagés!K7","v":0},null,null,"1er"]
[15,{"$f":"Engagés!I8","v":"FEN 3"},{"$f":"Engagés!J8","v":0},{"$f":"Engagés!K8","v":0},null,null,"2ème"]
[19,{"$f":"Engagés!I9","v":0},{"$f":"Engagés!J9","v":0},{"$f":"Engagés!K9","v":0}]
[null,{"$f":"Engagés!I10","v":{"$error":"#N/A"}},{"$f":"Engagés!J10","v":{"$error":"#N/A"}},{"$f":"Engagés!K10","v":{"$error":"#N/A"}}]
["Si poule de 4 joueurs alors…"]
["Déroulement",null,null,"Joueurs A contre Joueur B",null,"Vainqueur","Score"]
["Match 1",null,null,{"$f":"B4","v":"FEN 1"},{"$f":"B7","v":{"$error":"#N/A"}}]
["Match 2",null,null,{"$f":"B5","v":"FEN 3"},{"$f":"B6","v":0}]
["Finale vainqueur Match 1 contre vainqueur Match 2",null,null,{"$f":"IF(F10=\"\",\"\",F10)","v":""},{"$f":"IF(F11=\"\",\"\",F11)","v":""}]
["Petite finale entre les deux perdants des matchs 1 et 2",null,null,{"$f":"IF(D12=\"\",\"\",IF(D12=D10,E10,D10))","v":""},{"$f":"IF(E12=\"\",\"\",IF(E12=D11,E11,D11))","v":""}]
["Si poule de 3 joueurs alors…"]
["Déroulement",null,null,"Joueurs A contre Joueur B",null,"Vainqueur","Score"]
["Match 1",null,null,{"$f":"B4","v":"FEN 1"},{"$f":"B6","v":0},"ALMA 1"]
["Match 2",null,null,{"$f":"B5","v":"FEN 3"},{"$f":"B6","v":0},"ALMA 7"]
["Match 3",null,null,{"$f":"B4","v":"FEN 1"},{"$f":"B5","v":"FEN 3"},"ALMA 1"]
["CLASSEMENT",null,null,null,{"$f":"A2","v":"POULE 1"}]
[null,null,"NOM",null,"PRENOM",null,"SIGLE"]
["1er",null,{"$f":"IF($G$4=\"1er\", $B$4,IF($G$5=\"1er\",$B$5,IF($G$6=\"1er\",$B$6,IF($G$7=\"1er\",$B$7,\"\"))))","v":"FEN 1"},null,{"$f":"IF($G$4=\"1er\", $C$4,IF($G$5=\"1er\",$C$5,IF($G$6=\"1er\",$C$6,IF($G$7=\"1er\",$C$7,\"\"))))","v":0},null,{"$f":"IF($G$4=\"1er\", $D$4,IF($G$5=\"1er\",$D$5,IF($G$6=\"1er\",$D$6,IF($G$7=\"1er\",$D$7,\"\"))))","v":0}]
["2ème",null,{"$f":"IF($G$4=\"2ème\", $B$4,IF($G$5=\"2ème\",$B$5,IF($G$6=\"2ème\",$B$6,IF($G$7=\"2ème\",$B$7,\"\"))))","v":"FEN 3"},null,{"$f":"IF($G$4=\"2ème\", $C$4,IF($G$5=\"2ème\",$C$5,IF($G$6=\"2ème\",$C$6,IF($G$7=\"2ème\",$C$7,\"\"))))","v":0},null,{"$f":"IF($G$4=\"2ème\", $D$4,IF($G$5=\"2ème\",$D$5,IF($G$6=\"2ème\",$D$6,IF($G$7=\"2ème\",$D$7,\"\"))))","v":0}]
["3ème",null,{"$f":"IF($G$4=\"3ème\", $B$4,IF($G$5=\"3ème\",$B$5,IF($G$6=\"3ème\",$B$6,IF($G$7=\"3ème\",$B$7,\"\"))))","v":""},null,{"$f":"IF($G$4=\"3ème\", $C$4,IF($G$5=\"3ème\",$C$5,IF($G$6=\"3ème\",$C$6,IF($G$7=\"3ème\",$C$7,\"\"))))","v":""},null,{"$f":"IF($G$4=\"3ème\", $D$4,IF($G$5=\"3ème\",$D$5,IF($G$6=\"3ème\",$D$6,IF($G$7=\"3ème\",$D$7,\"\"))))","v":""}]
["4ème",null,{"$f":"IF($G$4=\"4ème\", $B$4,IF($G$5=\"4ème\",$B$5,IF($G$6=\"4ème\",$B$6,IF($G$7=\"4ème\",$B$7,\"\"))))","v":""},null,{"$f":"IF($G$4=\"4ème\", $C$4,IF($G$5=\"4ème\",$C$5,IF($G$6=\"4ème\",$C$6,IF($G$7=\"4ème\",$C$7,\"\"))))","v":""},null,{"$f":"IF($G$4=\"4ème\", $D$4,IF($G$5=\"4ème\",$D$5,IF($G$6=\"4ème\",$D$6,IF($G$7=\"4ème\",$D$7,\"\"))))","v":""}]

{"sheet":"Poule 2","index":2,"n_rows":24,"n_cols":7,"rows_kept":24,"cut":false,"hidden":false,"merged":[[20,4,20,5],[23,0,23,1],[23,2,23,3],[23,4,23,5],[21,0,21,1],[21,2,21,3],[14,0,14,2],[14,3,14,4],[21,4,21,5],[22,0,22,1],[15,0,15,2],[16,0,16,2],[17,0,17,2],[18,0,18,3],[18,4,18,6],[19,0,19,1],[19,2,19,3],[19,4,19,5],[22,2,22,3],[22,4,22,5],[20,0,20,1],[20,2,20,3],[9,0,9,2],[10,0,10,2],[11,0,11,2],[12,0,12,2],[13,0,13,6],[0,0,0,6],[1,0,1,2],[1,3,1,6],[7,0,7,6],[8,0,8,2],[8,3,8,4]]}
["TENNIS DE TABLE"]
["POULE 2",null,null,"TERRAIN N°"]
[null,"NOM","Prénom","Sigle","Vict","Def","Classement"]
[2,{"$f":"Engagés!M7","v":"STAN 1"},{"$f":"Engagés!N7","v":0},{"$f":"Engagés!O7","v":0},null,null,"1er"]
[16,{"$f":"Engagés!M8","v":"STAN 8"},{"$f":"Engagés!N8","v":0},{"$f":"Engagés!O8","v":0},null,null,"2ème"]
[20,{"$f":"Engagés!M9","v":0},{"$f":"Engagés!N9","v":0},{"$f":"Engagés!O9","v":0}]
[null,{"$f":"Engagés!M10","v":{"$error":"#N/A"}},{"$f":"Engagés!N10","v":{"$error":"#N/A"}},{"$f":"Engagés!O10","v":{"$error":"#N/A"}}]
["Si poule de 4 joueurs alors…"]
["Déroulement",null,null,"Joueurs A contre Joueur B",null,"Vainqueur","Score"]
["Match 1",null,null,{"$f":"B4","v":"STAN 1"},{"$f":"B7","v":{"$error":"#N/A"}},"STAN 1"]
["Match 2",null,null,{"$f":"B5","v":"STAN 8"},{"$f":"B6","v":0},"ALMA 5"]
["Finale vainqueur Match 1 contre vainqueur Match 2",null,null,{"$f":"IF(F10=\"\",\"\",F10)","v":"STAN 1"},{"$f":"IF(F11=\"\",\"\",F11)","v":"ALMA 5"}]
["Petite finale entre les deux perdants des matchs 1 et 2",null,null,{"$f":"IF(D12=\"\",\"\",IF(D12=D10,E10,D10))","v":{"$error":"#N/A"}},{"$f":"IF(E12=\"\",\"\",IF(E12=D11,E11,D11))","v":"STAN 8"}]
["Si poule de 3 joueurs alors…"]
["Déroulement",null,null,"Joueurs A contre Joueur B",null,"Vainqueur","Score"]
["Match 1",null,null,{"$f":"B4","v":"STAN 1"},{"$f":"B6","v":0}]
["Match 2",null,null,{"$f":"B5","v":"STAN 8"},{"$f":"B6","v":0}]
["Match 3",null,null,{"$f":"B4","v":"STAN 1"},{"$f":"B5","v":"STAN 8"}]
["CLASSEMENT",null,null,null,{"$f":"A2","v":"POULE 2"}]
[null,null,"NOM",null,"PRENOM",null,"SIGLE"]
["1er",null,{"$f":"IF($G$4=\"1er\", $B$4,IF($G$5=\"1er\",$B$5,IF($G$6=\"1er\",$B$6,IF($G$7=\"1er\",$B$7,\"\"))))","v":"STAN 1"},null,{"$f":"IF($G$4=\"1er\", $C$4,IF($G$5=\"1er\",$C$5,IF($G$6=\"1er\",$C$6,IF($G$7=\"1er\",$C$7,\"\"))))","v":0},null,{"$f":"IF($G$4=\"1er\", $D$4,IF($G$5=\"1er\",$D$5,IF($G$6=\"1er\",$D$6,IF($G$7=\"1er\",$D$7,\"\"))))","v":0}]
["2ème",null,{"$f":"IF($G$4=\"2ème\", $B$4,IF($G$5=\"2ème\",$B$5,IF($G$6=\"2ème\",$B$6,IF($G$7=\"2ème\",$B$7,\"\"))))","v":"STAN 8"},null,{"$f":"IF($G$4=\"2ème\", $C$4,IF($G$5=\"2ème\",$C$5,IF($G$6=\"2ème\",$C$6,IF($G$7=\"2ème\",$C$7,\"\"))))","v":0},null,{"$f":"IF($G$4=\"2ème\", $D$4,IF($G$5=\"2ème\",$D$5,IF($G$6=\"2ème\",$D$6,IF($G$7=\"2ème\",$D$7,\"\"))))","v":0}]
["3ème",null,{"$f":"IF($G$4=\"3ème\", $B$4,IF($G$5=\"3ème\",$B$5,IF($G$6=\"3ème\",$B$6,IF($G$7=\"3ème\",$B$7,\"\"))))","v":""},null,{"$f":"IF($G$4=\"3ème\", $C$4,IF($G$5=\"3ème\",$C$5,IF($G$6=\"3ème\",$C$6,IF($G$7=\"3ème\",$C$7,\"\"))))","v":""},null,{"$f":"IF($G$4=\"3ème\", $D$4,IF($G$5=\"3ème\",$D$5,IF($G$6=\"3ème\",$D$6,IF($G$7=\"3ème\",$D$7,\"\"))))","v":""}]
["4ème",null,{"$f":"IF($G$4=\"4ème\", $B$4,IF($G$5=\"4ème\",$B$5,IF($G$6=\"4ème\",$B$6,IF($G$7=\"4ème\",$B$7,\"\"))))","v":""},null,{"$f":"IF($G$4=\"4ème\", $C$4,IF($G$5=\"4ème\",$C$5,IF($G$6=\"4ème\",$C$6,IF($G$7=\"4ème\",$C$7,\"\"))))","v":""},null,{"$f":"IF($G$4=\"4ème\", $D$4,IF($G$5=\"4ème\",$D$5,IF($G$6=\"4ème\",$D$6,IF($G$7=\"4ème\",$D$7,\"\"))))","v":""}]

{"sheet":"Poule 3","index":3,"n_rows":24,"n_cols":7,"rows_kept":24,"cut":false,"hidden":false,"merged":[[20,4,20,5],[23,0,23,1],[23,2,23,3],[23,4,23,5],[21,0,21,1],[21,2,21,3],[14,0,14,2],[14,3,14,4],[21,4,21,5],[22,0,22,1],[15,0,15,2],[16,0,16,2],[17,0,17,2],[18,0,18,3],[18,4,18,6],[19,0,19,1],[19,2,19,3],[19,4,19,5],[22,2,22,3],[22,4,22,5],[20,0,20,1],[20,2,20,3],[9,0,9,2],[10,0,10,2],[11,0,11,2],[12,0,12,2],[13,0,13,6],[0,0,0,6],[1,0,1,2],[1,3,1,6],[7,0,7,6],[8,0,8,2],[8,3,8,4]]}
["TENNIS DE TABLE "]
["POULE 3",null,null,"TERRAIN N°"]
[null,"NOM","Prénom","Sigle","Vict","Def","Classement"]
[3,{"$f":"Engagés!I14","v":"FEN 2"},{"$f":"Engagés!J14","v":0},{"$f":"Engagés!K14","v":0},null,null,"1er"]
[13,{"$f":"Engagés!I15","v":"STAN 6"},{"$f":"Engagés!J15","v":0},{"$f":"Engagés!K15","v":0},null,null,"2ème"]
[17,{"$f":"Engagés!I16","v":0},{"$f":"Engagés!J16","v":0},{"$f":"Engagés!K16","v":0}]
[null,{"$f":"Engagés!I17","v":{"$error":"#N/A"}},{"$f":"Engagés!J17","v":{"$error":"#N/A"}},{"$f":"Engagés!K17","v":{"$error":"#N/A"}}]
["Si poule de 4 joueurs alors…"]
["Déroulement",null,null,"Joueurs A contre Joueur B",null,"Vainqueur","Score"]
["Match 1",null,null,{"$f":"B4","v":"FEN 2"},{"$f":"B7","v":{"$error":"#N/A"}},"ALMA 2"]
["Match 2",null,null,{"$f":"B5","v":"STAN 6"},{"$f":"B6","v":0},"ALMA 4"]
["Finale vainqueur Match 1 contre vainqueur Match 2",null,null,{"$f":"IF(F10=\"\",\"\",F10)","v":"ALMA 2"},{"$f":"IF(F11=\"\",\"\",F11)","v":"ALMA 4"}]
["Petite finale entre les deux perdants des matchs 1 et 2",null,null,{"$f":"IF(D12=\"\",\"\",IF(D12=D10,E10,D10))","v":"FEN 2"},{"$f":"IF(E12=\"\",\"\",IF(E12=D11,E11,D11))","v":"STAN 6"}]
["Si poule de 3 joueurs alors…"]
["Déroulement",null,null,"Joueurs A contre Joueur B",null,"Vainqueur","Score"]
["Match 1",null,null,{"$f":"B4","v":"FEN 2"},{"$f":"B6","v":0}]
["Match 2",null,null,{"$f":"B5","v":"STAN 6"},{"$f":"B6","v":0}]
["Match 3",null,null,{"$f":"B4","v":"FEN 2"},{"$f":"B5","v":"STAN 6"}]
["CLASSEMENT",null,null,null,{"$f":"A2","v":"POULE 3"}]
[null,null,"NOM",null,"PRENOM",null,"SIGLE"]
["1er",null,{"$f":"IF($G$4=\"1er\", $B$4,IF($G$5=\"1er\",$B$5,IF($G$6=\"1er\",$B$6,IF($G$7=\"1er\",$B$7,\"\"))))","v":"FEN 2"},null,{"$f":"IF($G$4=\"1er\", $C$4,IF($G$5=\"1er\",$C$5,IF($G$6=\"1er\",$C$6,IF($G$7=\"1er\",$C$7,\"\"))))","v":0},null,{"$f":"IF($G$4=\"1er\", $D$4,IF($G$5=\"1er\",$D$5,IF($G$6=\"1er\",$D$6,IF($G$7=\"1er\",$D$7,\"\"))))","v":0}]
["2ème",null,{"$f":"IF($G$4=\"2ème\", $B$4,IF($G$5=\"2ème\",$B$5,IF($G$6=\"2ème\",$B$6,IF($G$7=\"2ème\",$B$7,\"\"))))","v":"STAN 6"},null,{"$f":"IF($G$4=\"2ème\", $C$4,IF($G$5=\"2ème\",$C$5,IF($G$6=\"2ème\",$C$6,IF($G$7=\"2ème\",$C$7,\"\"))))","v":0},null,{"$f":"IF($G$4=\"2ème\", $D$4,IF($G$5=\"2ème\",$D$5,IF($G$6=\"2ème\",$D$6,IF($G$7=\"2ème\",$D$7,\"\"))))","v":0}]
["3ème",null,{"$f":"IF($G$4=\"3ème\", $B$4,IF($G$5=\"3ème\",$B$5,IF($G$6=\"3ème\",$B$6,IF($G$7=\"3ème\",$B$7,\"\"))))","v":""},null,{"$f":"IF($G$4=\"3ème\", $C$4,IF($G$5=\"3ème\",$C$5,IF($G$6=\"3ème\",$C$6,IF($G$7=\"3ème\",$C$7,\"\"))))","v":""},null,{"$f":"IF($G$4=\"3ème\", $D$4,IF($G$5=\"3ème\",$D$5,IF($G$6=\"3ème\",$D$6,IF($G$7=\"3ème\",$D$7,\"\"))))","v":""}]
["4ème",null,{"$f":"IF($G$4=\"4ème\", $B$4,IF($G$5=\"4ème\",$B$5,IF($G$6=\"4ème\",$B$6,IF($G$7=\"4ème\",$B$7,\"\"))))","v":""},null,{"$f":"IF($G$4=\"4ème\", $C$4,IF($G$5=\"4ème\",$C$5,IF($G$6=\"4ème\",$C$6,IF($G$7=\"4ème\",$C$7,\"\"))))","v":""},null,{"$f":"IF($G$4=\"4ème\", $D$4,IF($G$5=\"4ème\",$D$5,IF($G$6=\"4ème\",$D$6,IF($G$7=\"4ème\",$D$7,\"\"))))","v":""}]

{"sheet":"Poule 4","index":4,"n_rows":24,"n_cols":7,"rows_kept":24,"cut":false,"hidden":false,"merged":[[20,4,20,5],[23,0,23,1],[23,2,23,3],[23,4,23,5],[21,0,21,1],[21,2,21,3],[14,0,14,2],[14,3,14,4],[21,4,21,5],[22,0,22,1],[15,0,15,2],[16,0,16,2],[17,0,17,2],[18,0,18,3],[18,4,18,6],[19,0,19,1],[19,2,19,3],[19,4,19,5],[22,2,22,3],[22,4,22,5],[20,0,20,1],[20,2,20,3],[9,0,9,2],[10,0,10,2],[11,0,11,2],[12,0,12,2],[13,0,13,6],[0,0,0,6],[1,0,1,2],[1,3,1,6],[7,0,7,6],[8,0,8,2],[8,3,8,4]]}
["TENNIS DE TABLE"]
["POULE 4",null,null,"TERRAIN N°"]
[null,"NOM","Prénom","Sigle","Vict","Def","Classement"]
[4,{"$f":"Engagés!M14","v":"STAN 2"},{"$f":"Engagés!N14","v":0},{"$f":"Engagés!O14","v":0},null,null,"1er"]
[14,{"$f":"Engagés!M15","v":"STAN 7"},{"$f":"Engagés!N15","v":0},{"$f":"Engagés!O15","v":0},null,null,"2ème"]
[18,{"$f":"Engagés!M16","v":0},{"$f":"Engagés!N16","v":0},{"$f":"Engagés!O16","v":0}]
[null,{"$f":"Engagés!M17","v":{"$error":"#N/A"}},{"$f":"Engagés!N17","v":{"$error":"#N/A"}},{"$f":"Engagés!O17","v":{"$error":"#N/A"}}]
["Si poule de 4 joueurs alors…"]
["Déroulement",null,null,"Joueurs A contre Joueur B",null,"Vainqueur","Score"]
["Match 1",null,null,{"$f":"B4","v":"STAN 2"},{"$f":"B7","v":{"$error":"#N/A"}},"STAN 2"]
["Match 2",null,null,{"$f":"B5","v":"STAN 7"},{"$f":"B6","v":0},"ALMA 3"]
["Finale vainqueur Match 1 contre vainqueur Match 2",null,null,{"$f":"IF(F10=\"\",\"\",F10)","v":"STAN 2"},{"$f":"IF(F11=\"\",\"\",F11)","v":"ALMA 3"}]
["Petite finale entre les deux perdants des matchs 1 et 2",null,null,{"$f":"IF(D12=\"\",\"\",IF(D12=D10,E10,D10))","v":{"$error":"#N/A"}},{"$f":"IF(E12=\"\",\"\",IF(E12=D11,E11,D11))","v":"STAN 7"}]
["Si poule de 3 joueurs alors…"]
["Déroulement",null,null,"Joueurs A contre Joueur B",null,"Vainqueur","Score"]
["Match 1",null,null,{"$f":"B4","v":"STAN 2"},{"$f":"B6","v":0}]
["Match 2",null,null,{"$f":"B5","v":"STAN 7"},{"$f":"B6","v":0}]
["Match 3",null,null,{"$f":"B4","v":"STAN 2"},{"$f":"B5","v":"STAN 7"}]
["CLASSEMENT",null,null,null,{"$f":"A2","v":"POULE 4"}]
[null,null,"NOM",null,"PRENOM",null,"SIGLE"]
["1er",null,{"$f":"IF($G$4=\"1er\", $B$4,IF($G$5=\"1er\",$B$5,IF($G$6=\"1er\",$B$6,IF($G$7=\"1er\",$B$7,\"\"))))","v":"STAN 2"},null,{"$f":"IF($G$4=\"1er\", $C$4,IF($G$5=\"1er\",$C$5,IF($G$6=\"1er\",$C$6,IF($G$7=\"1er\",$C$7,\"\"))))","v":0},null,{"$f":"IF($G$4=\"1er\", $D$4,IF($G$5=\"1er\",$D$5,IF($G$6=\"1er\",$D$6,IF($G$7=\"1er\",$D$7,\"\"))))","v":0}]
["2ème",null,{"$f":"IF($G$4=\"2ème\", $B$4,IF($G$5=\"2ème\",$B$5,IF($G$6=\"2ème\",$B$6,IF($G$7=\"2ème\",$B$7,\"\"))))","v":"STAN 7"},null,{"$f":"IF($G$4=\"2ème\", $C$4,IF($G$5=\"2ème\",$C$5,IF($G$6=\"2ème\",$C$6,IF($G$7=\"2ème\",$C$7,\"\"))))","v":0},null,{"$f":"IF($G$4=\"2ème\", $D$4,IF($G$5=\"2ème\",$D$5,IF($G$6=\"2ème\",$D$6,IF($G$7=\"2ème\",$D$7,\"\"))))","v":0}]
["3ème",null,{"$f":"IF($G$4=\"3ème\", $B$4,IF($G$5=\"3ème\",$B$5,IF($G$6=\"3ème\",$B$6,IF($G$7=\"3ème\",$B$7,\"\"))))","v":""},null,{"$f":"IF($G$4=\"3ème\", $C$4,IF($G$5=\"3ème\",$C$5,IF($G$6=\"3ème\",$C$6,IF($G$7=\"3ème\",$C$7,\"\"))))","v":""},null,{"$f":"IF($G$4=\"3ème\", $D$4,IF($G$5=\"3ème\",$D$5,IF($G$6=\"3ème\",$D$6,IF($G$7=\"3ème\",$D$7,\"\"))))","v":""}]
["4ème",null,{"$f":"IF($G$4=\"4ème\", $B$4,IF($G$5=\"4ème\",$B$5,IF($G$6=\"4ème\",$B$6,IF($G$7=\"4ème\",$B$7,\"\"))))","v":""},null,{"$f":"IF($G$4=\"4ème\", $C$4,IF($G$5=\"4ème\",$C$5,IF($G$6=\"4ème\",$C$6,IF($G$7=\"4ème\",$C$7,\"\"))))","v":""},null,{"$f":"IF($G$4=\"4ème\", $D$4,IF($G$5=\"4ème\",$D$5,IF($G$6=\"4ème\",$D$6,IF($G$7=\"4ème\",$D$7,\"\"))))","v":""}]

{"sheet":"Poule 5","index":5,"n_rows":24,"n_cols":7,"rows_kept":24,"cut":false,"hidden":false,"merged":[[0,0,0,6],[1,0,1,2],[1,3,1,6],[7,0,7,6],[8,0,8,2],[8,3,8,4],[19,0,19,1],[19,2,19,3],[19,4,19,5],[9,0,9,2],[10,0,10,2],[11,0,11,2],[12,0,12,2],[13,0,13,6],[14,0,14,2],[14,3,14,4],[15,0,15,2],[16,0,16,2],[17,0,17,2],[18,0,18,3],[18,4,18,6],[20,0,20,1],[20,2,20,3],[20,4,20,5],[21,0,21,1],[21,2,21,3],[21,4,21,5],[22,0,22,1],[22,2,22,3],[22,4,22,5],[23,0,23,1],[23,2,23,3],[23,4,23,5]]}
["TENNIS DE TABLE"]
["POULE 5",null,null,"TABLE N°"]
[null,"NOM","Prénom","Sigle","Vict","Def","Classement"]
[5,{"$f":"Engagés!I21","v":"STAN 3"},{"$f":"Engagés!J21","v":0},{"$f":"Engagés!K21","v":0},null,null,"1er"]
[11,{"$f":"Engagés!I22","v":"SLH 1"},{"$f":"Engagés!J22","v":0},{"$f":"Engagés!K22","v":0},null,null,"2ème"]
[23,{"$f":"Engagés!I23","v":0},{"$f":"Engagés!J23","v":0},{"$f":"Engagés!K23","v":0}]
[null,{"$f":"Engagés!I24","v":{"$error":"#N/A"}},{"$f":"Engagés!J24","v":{"$error":"#N/A"}},{"$f":"Engagés!K24","v":{"$error":"#N/A"}}]
["Si poule de 4 joueurs alors…"]
["Déroulement",null,null,"Joueurs A contre Joueur B",null,"Vainqueur","Score"]
["Match 1",null,null,{"$f":"B4","v":"STAN 3"},{"$f":"B7","v":{"$error":"#N/A"}}]
["Match 2",null,null,{"$f":"B5","v":"SLH 1"},{"$f":"B6","v":0}]
["Finale vainqueur Match 1 contre vainqueur Match 2",null,null,{"$f":"IF(F10=\"\",\"\",F10)","v":""},{"$f":"IF(F11=\"\",\"\",F11)","v":""}]
["Petite finale entre les deux perdants des matchs 1 et 2",null,null,{"$f":"IF(D12=\"\",\"\",IF(D12=D10,E10,D10))","v":""},{"$f":"IF(E12=\"\",\"\",IF(E12=D11,E11,D11))","v":""}]
["Si poule de 3 joueurs alors…"]
["Déroulement",null,null,"Joueurs A contre Joueur B",null,"Vainqueur","Score"]
["Match 1",null,null,{"$f":"B4","v":"STAN 3"},{"$f":"B6","v":0}]
["Match 2",null,null,{"$f":"B5","v":"SLH 1"},{"$f":"B6","v":0}]
["Match 3",null,null,{"$f":"B4","v":"STAN 3"},{"$f":"B5","v":"SLH 1"}]
["CLASSEMENT",null,null,null,{"$f":"A2","v":"POULE 5"}]
[null,null,"NOM",null,"PRENOM",null,"SIGLE"]
["1er",null,{"$f":"IF($G$4=\"1er\", $B$4,IF($G$5=\"1er\",$B$5,IF($G$6=\"1er\",$B$6,IF($G$7=\"1er\",$B$7,\"\"))))","v":"STAN 3"},null,{"$f":"IF($G$4=\"1er\", $C$4,IF($G$5=\"1er\",$C$5,IF($G$6=\"1er\",$C$6,IF($G$7=\"1er\",$C$7,\"\"))))","v":0},null,{"$f":"IF($G$4=\"1er\", $D$4,IF($G$5=\"1er\",$D$5,IF($G$6=\"1er\",$D$6,IF($G$7=\"1er\",$D$7,\"\"))))","v":0}]
["2ème",null,{"$f":"IF($G$4=\"2ème\", $B$4,IF($G$5=\"2ème\",$B$5,IF($G$6=\"2ème\",$B$6,IF($G$7=\"2ème\",$B$7,\"\"))))","v":"SLH 1"},null,{"$f":"IF($G$4=\"2ème\", $C$4,IF($G$5=\"2ème\",$C$5,IF($G$6=\"2ème\",$C$6,IF($G$7=\"2ème\",$C$7,\"\"))))","v":0},null,{"$f":"IF($G$4=\"2ème\", $D$4,IF($G$5=\"2ème\",$D$5,IF($G$6=\"2ème\",$D$6,IF($G$7=\"2ème\",$D$7,\"\"))))","v":0}]
["3ème",null,{"$f":"IF($G$4=\"3ème\", $B$4,IF($G$5=\"3ème\",$B$5,IF($G$6=\"3ème\",$B$6,IF($G$7=\"3ème\",$B$7,\"\"))))","v":""},null,{"$f":"IF($G$4=\"3ème\", $C$4,IF($G$5=\"3ème\",$C$5,IF($G$6=\"3ème\",$C$6,IF($G$7=\"3ème\",$C$7,\"\"))))","v":""},null,{"$f":"IF($G$4=\"3ème\", $D$4,IF($G$5=\"3ème\",$D$5,IF($G$6=\"3ème\",$D$6,IF($G$7=\"3ème\",$D$7,\"\"))))","v":""}]
["4ème",null,{"$f":"IF($G$4=\"4ème\", $B$4,IF($G$5=\"4ème\",$B$5,IF($G$6=\"4ème\",$B$6,IF($G$7=\"4ème\",$B$7,\"\"))))","v":""},null,{"$f":"IF($G$4=\"4ème\", $C$4,IF($G$5=\"4ème\",$C$5,IF($G$6=\"4ème\",$C$6,IF($G$7=\"4ème\",$C$7,\"\"))))","v":""},null,{"$f":"IF($G$4=\"4ème\", $D$4,IF($G$5=\"4ème\",$D$5,IF($G$6=\"4ème\",$D$6,IF($G$7=\"4ème\",$D$7,\"\"))))","v":""}]

{"sheet":"Poule 6","index":6,"n_rows":24,"n_cols":7,"rows_kept":24,"cut":false,"hidden":false,"merged":[[0,0,0,6],[1,0,1,2],[1,3,1,6],[7,0,7,6],[8,0,8,2],[8,3,8,4],[19,0,19,1],[19,2,19,3],[19,4,19,5],[9,0,9,2],[10,0,10,2],[11,0,11,2],[12,0,12,2],[13,0,13,6],[14,0,14,2],[14,3,14,4],[15,0,15,2],[16,0,16,2],[17,0,17,2],[18,0,18,3],[18,4,18,6],[20,0,20,1],[20,2,20,3],[20,4,20,5],[21,0,21,1],[21,2,21,3],[21,4,21,5],[22,0,22,1],[22,2,22,3],[22,4,22,5],[23,0,23,1],[23,2,23,3],[23,4,23,5]]}
["TENNIS DE TABLE"]
["POULE 6",null,null,"TABLE N°"]
[null,"NOM","Prénom","Sigle","Vict","Def","Classement"]
[6,{"$f":"Engagés!M21","v":"ALMA 1"},{"$f":"Engagés!N21","v":0},{"$f":"Engagés!O21","v":0},null,null,"1er"]
[12,{"$f":"Engagés!M22","v":"BND 2"},{"$f":"Engagés!N22","v":0},{"$f":"Engagés!O22","v":0},null,null,"2ème"]
[24,{"$f":"Engagés!M23","v":0},{"$f":"Engagés!N23","v":0},{"$f":"Engagés!O23","v":0}]
[null,{"$f":"Engagés!M24","v":{"$error":"#N/A"}},{"$f":"Engagés!N24","v":{"$error":"#N/A"}},{"$f":"Engagés!O24","v":{"$error":"#N/A"}}]
["Si poule de 4 joueurs alors…"]
["Déroulement",null,null,"Joueurs A contre Joueur B",null,"Vainqueur","Score"]
["Match 1",null,null,{"$f":"B4","v":"ALMA 1"},{"$f":"B7","v":{"$error":"#N/A"}}]
["Match 2",null,null,{"$f":"B5","v":"BND 2"},{"$f":"B6","v":0}]
["Finale vainqueur Match 1 contre vainqueur Match 2",null,null,{"$f":"IF(F10=\"\",\"\",F10)","v":""},{"$f":"IF(F11=\"\",\"\",F11)","v":""}]
["Petite finale entre les deux perdants des matchs 1 et 2",null,null,{"$f":"IF(D12=\"\",\"\",IF(D12=D10,E10,D10))","v":""},{"$f":"IF(E12=\"\",\"\",IF(E12=D11,E11,D11))","v":""}]
["Si poule de 3 joueurs alors…"]
["Déroulement",null,null,"Joueurs A contre Joueur B",null,"Vainqueur","Score"]
["Match 1",null,null,{"$f":"B4","v":"ALMA 1"},{"$f":"B6","v":0}]
["Match 2",null,null,{"$f":"B5","v":"BND 2"},{"$f":"B6","v":0}]
["Match 3",null,null,{"$f":"B4","v":"ALMA 1"},{"$f":"B5","v":"BND 2"}]
["CLASSEMENT",null,null,null,{"$f":"A2","v":"POULE 6"}]
[null,null,"NOM",null,"PRENOM",null,"SIGLE"]
["1er",null,{"$f":"IF($G$4=\"1er\", $B$4,IF($G$5=\"1er\",$B$5,IF($G$6=\"1er\",$B$6,IF($G$7=\"1er\",$B$7,\"\"))))","v":"ALMA 1"},null,{"$f":"IF($G$4=\"1er\", $C$4,IF($G$5=\"1er\",$C$5,IF($G$6=\"1er\",$C$6,IF($G$7=\"1er\",$C$7,\"\"))))","v":0},null,{"$f":"IF($G$4=\"1er\", $D$4,IF($G$5=\"1er\",$D$5,IF($G$6=\"1er\",$D$6,IF($G$7=\"1er\",$D$7,\"\"))))","v":0}]
["2ème",null,{"$f":"IF($G$4=\"2ème\", $B$4,IF($G$5=\"2ème\",$B$5,IF($G$6=\"2ème\",$B$6,IF($G$7=\"2ème\",$B$7,\"\"))))","v":"BND 2"},null,{"$f":"IF($G$4=\"2ème\", $C$4,IF($G$5=\"2ème\",$C$5,IF($G$6=\"2ème\",$C$6,IF($G$7=\"2ème\",$C$7,\"\"))))","v":0},null,{"$f":"IF($G$4=\"2ème\", $D$4,IF($G$5=\"2ème\",$D$5,IF($G$6=\"2ème\",$D$6,IF($G$7=\"2ème\",$D$7,\"\"))))","v":0}]
["3ème",null,{"$f":"IF($G$4=\"3ème\", $B$4,IF($G$5=\"3ème\",$B$5,IF($G$6=\"3ème\",$B$6,IF($G$7=\"3ème\",$B$7,\"\"))))","v":""},null,{"$f":"IF($G$4=\"3ème\", $C$4,IF($G$5=\"3ème\",$C$5,IF($G$6=\"3ème\",$C$6,IF($G$7=\"3ème\",$C$7,\"\"))))","v":""},null,{"$f":"IF($G$4=\"3ème\", $D$4,IF($G$5=\"3ème\",$D$5,IF($G$6=\"3ème\",$D$6,IF($G$7=\"3ème\",$D$7,\"\"))))","v":""}]
["4ème",null,{"$f":"IF($G$4=\"4ème\", $B$4,IF($G$5=\"4ème\",$B$5,IF($G$6=\"4ème\",$B$6,IF($G$7=\"4ème\",$B$7,\"\"))))","v":""},null,{"$f":"IF($G$4=\"4ème\", $C$4,IF($G$5=\"4ème\",$C$5,IF($G$6=\"4ème\",$C$6,IF($G$7=\"4ème\",$C$7,\"\"))))","v":""},null,{"$f":"IF($G$4=\"4ème\", $D$4,IF($G$5=\"4ème\",$D$5,IF($G$6=\"4ème\",$D$6,IF($G$7=\"4ème\",$D$7,\"\"))))","v":""}]

{"sheet":"Poule 7","index":7,"n_rows":24,"n_cols":7,"rows_kept":24,"cut":false,"hidden":false,"merged":[[0,0,0,6],[1,0,1,2],[1,3,1,6],[7,0,7,6],[8,0,8,2],[8,3,8,4],[19,0,19,1],[19,2,19,3],[19,4,19,5],[9,0,9,2],[10,0,10,2],[11,0,11,2],[12,0,12,2],[13,0,13,6],[14,0,14,2],[14,3,14,4],[15,0,15,2],[16,0,16,2],[17,0,17,2],[18,0,18,3],[18,4,18,6],[20,0,20,1],[20,2,20,3],[20,4,20,5],[21,0,21,1],[21,2,21,3],[21,4,21,5],[22,0,22,1],[22,2,22,3],[22,4,22,5],[23,0,23,1],[23,2,23,3],[23,4,23,5]]}
["TENNIS DE TABLE"]
["POULE 7",null,null,"TABLE N°"]
[null,"NOM","Prénom","Sigle","Vict","Def","Classement"]
[7,{"$f":"Engagés!I28","v":"BND 1"},{"$f":"Engagés!J28","v":0},{"$f":"Engagés!K28","v":0},null,null,"1er"]
[9,{"$f":"Engagés!I29","v":"ALMA 2"},{"$f":"Engagés!J29","v":0},{"$f":"Engagés!K29","v":0},null,null,"2ème"]
[21,{"$f":"Engagés!I30","v":0},{"$f":"Engagés!J30","v":0},{"$f":"Engagés!K30","v":0}]
[null,{"$f":"Engagés!I31","v":{"$error":"#N/A"}},{"$f":"Engagés!J31","v":{"$error":"#N/A"}},{"$f":"Engagés!K31","v":{"$error":"#N/A"}}]
["Si poule de 4 joueurs alors…"]
["Déroulement",null,null,"Joueurs A contre Joueur B",null,"Vainqueur","Score"]
["Match 1",null,null,{"$f":"B4","v":"BND 1"},{"$f":"B7","v":{"$error":"#N/A"}}]
["Match 2",null,null,{"$f":"B5","v":"ALMA 2"},{"$f":"B6","v":0}]
["Finale vainqueur Match 1 contre vainqueur Match 2",null,null,{"$f":"IF(F10=\"\",\"\",F10)","v":""},{"$f":"IF(F11=\"\",\"\",F11)","v":""}]
["Petite finale entre les deux perdants des matchs 1 et 2",null,null,{"$f":"IF(D12=\"\",\"\",IF(D12=D10,E10,D10))","v":""},{"$f":"IF(E12=\"\",\"\",IF(E12=D11,E11,D11))","v":""}]
["Si poule de 3 joueurs alors…"]
["Déroulement",null,null,"Joueurs A contre Joueur B",null,"Vainqueur","Score"]
["Match 1",null,null,{"$f":"B4","v":"BND 1"},{"$f":"B6","v":0}]
["Match 2",null,null,{"$f":"B5","v":"ALMA 2"},{"$f":"B6","v":0}]
["Match 3",null,null,{"$f":"B4","v":"BND 1"},{"$f":"B5","v":"ALMA 2"}]
["CLASSEMENT",null,null,null,{"$f":"A2","v":"POULE 7"}]
[null,null,"NOM",null,"PRENOM",null,"SIGLE"]
["1er",null,{"$f":"IF($G$4=\"1er\", $B$4,IF($G$5=\"1er\",$B$5,IF($G$6=\"1er\",$B$6,IF($G$7=\"1er\",$B$7,\"\"))))","v":"BND 1"},null,{"$f":"IF($G$4=\"1er\", $C$4,IF($G$5=\"1er\",$C$5,IF($G$6=\"1er\",$C$6,IF($G$7=\"1er\",$C$7,\"\"))))","v":0},null,{"$f":"IF($G$4=\"1er\", $D$4,IF($G$5=\"1er\",$D$5,IF($G$6=\"1er\",$D$6,IF($G$7=\"1er\",$D$7,\"\"))))","v":0}]
["2ème",null,{"$f":"IF($G$4=\"2ème\", $B$4,IF($G$5=\"2ème\",$B$5,IF($G$6=\"2ème\",$B$6,IF($G$7=\"2ème\",$B$7,\"\"))))","v":"ALMA 2"},null,{"$f":"IF($G$4=\"2ème\", $C$4,IF($G$5=\"2ème\",$C$5,IF($G$6=\"2ème\",$C$6,IF($G$7=\"2ème\",$C$7,\"\"))))","v":0},null,{"$f":"IF($G$4=\"2ème\", $D$4,IF($G$5=\"2ème\",$D$5,IF($G$6=\"2ème\",$D$6,IF($G$7=\"2ème\",$D$7,\"\"))))","v":0}]
["3ème",null,{"$f":"IF($G$4=\"3ème\", $B$4,IF($G$5=\"3ème\",$B$5,IF($G$6=\"3ème\",$B$6,IF($G$7=\"3ème\",$B$7,\"\"))))","v":""},null,{"$f":"IF($G$4=\"3ème\", $C$4,IF($G$5=\"3ème\",$C$5,IF($G$6=\"3ème\",$C$6,IF($G$7=\"3ème\",$C$7,\"\"))))","v":""},null,{"$f":"IF($G$4=\"3ème\", $D$4,IF($G$5=\"3ème\",$D$5,IF($G$6=\"3ème\",$D$6,IF($G$7=\"3ème\",$D$7,\"\"))))","v":""}]
["4ème",null,{"$f":"IF($G$4=\"4ème\", $B$4,IF($G$5=\"4ème\",$B$5,IF($G$6=\"4ème\",$B$6,IF($G$7=\"4ème\",$B$7,\"\"))))","v":""},null,{"$f":"IF($G$4=\"4ème\", $C$4,IF($G$5=\"4ème\",$C$5,IF($G$6=\"4ème\",$C$6,IF($G$7=\"4ème\",$C$7,\"\"))))","v":""},null,{"$f":"IF($G$4=\"4ème\", $D$4,IF($G$5=\"4ème\",$D$5,IF($G$6=\"4ème\",$D$6,IF($G$7=\"4ème\",$D$7,\"\"))))","v":""}]

{"sheet":"Poule 8","index":8,"n_rows":24,"n_cols":7,"rows_kept":24,"cut":false,"hidden":false,"merged":[[0,0,0,6],[1,0,1,2],[1,3,1,6],[7,0,7,6],[8,0,8,2],[8,3,8,4],[19,0,19,1],[19,2,19,3],[19,4,19,5],[9,0,9,2],[10,0,10,2],[11,0,11,2],[12,0,12,2],[13,0,13,6],[14,0,14,2],[14,3,14,4],[15,0,15,2],[16,0,16,2],[17,0,17,2],[18,0,18,3],[18,4,18,6],[20,0,20,1],[20,2,20,3],[20,4,20,5],[21,0,21,1],[21,2,21,3],[21,4,21,5],[22,0,22,1],[22,2,22,3],[22,4,22,5],[23,0,23,1],[23,2,23,3],[23,4,23,5]]}
["TENNIS DE TABLE"]
["POULE 8",null,null,"TABLE N°"]
[null,"NOM","Prénom","Sigle","Vict","Def","Classement"]
[8,{"$f":"Engagés!M28","v":"STAN 4"},{"$f":"Engagés!N28","v":0},{"$f":"Engagés!O28","v":0},null,null,"1er"]
[10,{"$f":"Engagés!M29","v":"STAN 5"},{"$f":"Engagés!N29","v":0},{"$f":"Engagés!O29","v":0},null,null,"2ème"]
[22,{"$f":"Engagés!M30","v":0},{"$f":"Engagés!N30","v":0},{"$f":"Engagés!O30","v":0}]
[null,{"$f":"Engagés!M31","v":{"$error":"#N/A"}},{"$f":"Engagés!N31","v":{"$error":"#N/A"}},{"$f":"Engagés!O31","v":{"$error":"#N/A"}}]
["Si poule de 4 joueurs alors…"]
["Déroulement",null,null,"Joueurs A contre Joueur B",null,"Vainqueur","Score"]
["Match 1",null,null,{"$f":"B4","v":"STAN 4"},{"$f":"B7","v":{"$error":"#N/A"}}]
["Match 2",null,null,{"$f":"B5","v":"STAN 5"},{"$f":"B6","v":0}]
["Finale vainqueur Match 1 contre vainqueur Match 2",null,null,{"$f":"IF(F10=\"\",\"\",F10)","v":""},{"$f":"IF(F11=\"\",\"\",F11)","v":""}]
["Petite finale entre les deux perdants des matchs 1 et 2",null,null,{"$f":"IF(D12=\"\",\"\",IF(D12=D10,E10,D10))","v":""},{"$f":"IF(E12=\"\",\"\",IF(E12=D11,E11,D11))","v":""}]
["Si poule de 3 joueurs alors…"]
["Déroulement",null,null,"Joueurs A contre Joueur B",null,"Vainqueur","Score"]
["Match 1",null,null,{"$f":"B4","v":"STAN 4"},{"$f":"B6","v":0}]
["Match 2",null,null,{"$f":"B5","v":"STAN 5"},{"$f":"B6","v":0}]
["Match 3",null,null,{"$f":"B4","v":"STAN 4"},{"$f":"B5","v":"STAN 5"}]
["CLASSEMENT",null,null,null,{"$f":"A2","v":"POULE 8"}]
[null,null,"NOM",null,"PRENOM",null,"SIGLE"]
["1er",null,{"$f":"IF($G$4=\"1er\", $B$4,IF($G$5=\"1er\",$B$5,IF($G$6=\"1er\",$B$6,IF($G$7=\"1er\",$B$7,\"\"))))","v":"STAN 4"},null,{"$f":"IF($G$4=\"1er\", $C$4,IF($G$5=\"1er\",$C$5,IF($G$6=\"1er\",$C$6,IF($G$7=\"1er\",$C$7,\"\"))))","v":0},null,{"$f":"IF($G$4=\"1er\", $D$4,IF($G$5=\"1er\",$D$5,IF($G$6=\"1er\",$D$6,IF($G$7=\"1er\",$D$7,\"\"))))","v":0}]
["2ème",null,{"$f":"IF($G$4=\"2ème\", $B$4,IF($G$5=\"2ème\",$B$5,IF($G$6=\"2ème\",$B$6,IF($G$7=\"2ème\",$B$7,\"\"))))","v":"STAN 5"},null,{"$f":"IF($G$4=\"2ème\", $C$4,IF($G$5=\"2ème\",$C$5,IF($G$6=\"2ème\",$C$6,IF($G$7=\"2ème\",$C$7,\"\"))))","v":0},null,{"$f":"IF($G$4=\"2ème\", $D$4,IF($G$5=\"2ème\",$D$5,IF($G$6=\"2ème\",$D$6,IF($G$7=\"2ème\",$D$7,\"\"))))","v":0}]
["3ème",null,{"$f":"IF($G$4=\"3ème\", $B$4,IF($G$5=\"3ème\",$B$5,IF($G$6=\"3ème\",$B$6,IF($G$7=\"3ème\",$B$7,\"\"))))","v":""},null,{"$f":"IF($G$4=\"3ème\", $C$4,IF($G$5=\"3ème\",$C$5,IF($G$6=\"3ème\",$C$6,IF($G$7=\"3ème\",$C$7,\"\"))))","v":""},null,{"$f":"IF($G$4=\"3ème\", $D$4,IF($G$5=\"3ème\",$D$5,IF($G$6=\"3ème\",$D$6,IF($G$7=\"3ème\",$D$7,\"\"))))","v":""}]
["4ème",null,{"$f":"IF($G$4=\"4ème\", $B$4,IF($G$5=\"4ème\",$B$5,IF($G$6=\"4ème\",$B$6,IF($G$7=\"4ème\",$B$7,\"\"))))","v":""},null,{"$f":"IF($G$4=\"4ème\", $C$4,IF($G$5=\"4ème\",$C$5,IF($G$6=\"4ème\",$C$6,IF($G$7=\"4ème\",$C$7,\"\"))))","v":""},null,{"$f":"IF($G$4=\"4ème\", $D$4,IF($G$5=\"4ème\",$D$5,IF($G$6=\"4ème\",$D$6,IF($G$7=\"4ème\",$D$7,\"\"))))","v":""}]

{"sheet":"Résultats de poule","index":9,"n_rows":11,"n_cols":16,"rows_kept":11,"cut":false,"hidden":false,"merged":[[6,12,6,15],[6,8,6,11],[6,4,6,7],[6,0,6,3],[0,0,0,3],[0,4,0,7],[0,8,0,11],[0,12,0,15]]}
["Poule 1",null,null,null,"Poule 2",null,null,null,"Poule 3",null,null,null,"Poule 4"]
["1er",{"$f":"'Poule 1'!$C21","v":"FEN 1"},{"$f":"'Poule 1'!$E21","v":0},{"$f":"'Poule 1'!$G21","v":0},"1er",{"$f":"'Poule 2'!$C21","v":"STAN 1"},{"$f":"'Poule 2'!$E21","v":0},{"$f":"'Poule 2'!$G21","v":0},"1er",{"$f":"'Poule 3'!$C21","v":"FEN 2"},{"$f":"'Poule 3'!$E21","v":0},{"$f":"'Poule 3'!$G21","v":0},"1er",{"$f":"'Poule 4'!$C21","v":"STAN 2"},{"$f":"'Poule 4'!$E21","v":0},{"$f":"'Poule 4'!$G21","v":0}]
["2ème",{"$f":"'Poule 1'!$C22","v":"FEN 3"},{"$f":"'Poule 1'!$E22","v":0},{"$f":"'Poule 1'!$G22","v":0},"2ème",{"$f":"'Poule 2'!$C22","v":"STAN 8"},{"$f":"'Poule 2'!$E22","v":0},{"$f":"'Poule 2'!$G22","v":0},"2ème",{"$f":"'Poule 3'!$C22","v":"STAN 6"},{"$f":"'Poule 3'!$E22","v":0},{"$f":"'Poule 3'!$G22","v":0},"2ème",{"$f":"'Poule 4'!$C22","v":"STAN 7"},{"$f":"'Poule 4'!$E22","v":0},{"$f":"'Poule 4'!$G22","v":0}]
["3ème",{"$f":"'Poule 1'!$C23","v":""},{"$f":"'Poule 1'!$E23","v":""},{"$f":"'Poule 1'!$G23","v":""},"3ème",{"$f":"'Poule 2'!$C23","v":""},{"$f":"'Poule 2'!$E23","v":""},{"$f":"'Poule 2'!$G23","v":""},"3ème",{"$f":"'Poule 3'!$C23","v":""},{"$f":"'Poule 3'!$E23","v":""},{"$f":"'Poule 3'!$G23","v":""},"3ème",{"$f":"'Poule 4'!$C23","v":""},{"$f":"'Poule 4'!$E23","v":""},{"$f":"'Poule 4'!$G23","v":""}]
["4ème",{"$f":"'Poule 1'!$C24","v":""},{"$f":"'Poule 1'!$E24","v":""},{"$f":"'Poule 1'!$G24","v":""},"4ème",{"$f":"'Poule 2'!$C24","v":""},{"$f":"'Poule 2'!$E24","v":""},{"$f":"'Poule 2'!$G24","v":""},"4ème",{"$f":"'Poule 3'!$C24","v":""},{"$f":"'Poule 3'!$E24","v":""},{"$f":"'Poule 3'!$G24","v":""},"4ème",{"$f":"'Poule 4'!$C24","v":""},{"$f":"'Poule 4'!$E24","v":""},{"$f":"'Poule 4'!$G24","v":""}]
[]
["Poule 5",null,null,null,"Poule 6",null,null,null,"Poule 7",null,null,null,"Poule 8"]
["1er",{"$f":"'Poule 5'!$C21","v":"STAN 3"},{"$f":"'Poule 1'!$E27","v":0},{"$f":"'Poule 1'!$G27","v":0},"1er",{"$f":"'Poule 6'!$C21","v":"ALMA 1"},{"$f":"'Poule 2'!$E27","v":0},{"$f":"'Poule 2'!$G27","v":0},"1er",{"$f":"'Poule 7'!$C21","v":"BND 1"},{"$f":"'Poule 3'!$E27","v":0},{"$f":"'Poule 3'!$G27","v":0},"1er",{"$f":"'Poule 8'!$C21","v":"STAN 4"},{"$f":"'Poule 4'!$E27","v":0},{"$f":"'Poule 4'!$G27","v":0}]
["2ème",{"$f":"'Poule 5'!$C22","v":"SLH 1"},{"$f":"'Poule 1'!$E28","v":0},{"$f":"'Poule 1'!$G28","v":0},"2ème",{"$f":"'Poule 6'!$C22","v":"BND 2"},{"$f":"'Poule 2'!$E28","v":0},{"$f":"'Poule 2'!$G28","v":0},"2ème",{"$f":"'Poule 7'!$C22","v":"ALMA 2"},{"$f":"'Poule 3'!$E28","v":0},{"$f":"'Poule 3'!$G28","v":0},"2ème",{"$f":"'Poule 8'!$C22","v":"STAN 5"},{"$f":"'Poule 4'!$E28","v":0},{"$f":"'Poule 4'!$G28","v":0}]
["3ème",{"$f":"'Poule 5'!$C23","v":""},{"$f":"'Poule 1'!$E29","v":0},{"$f":"'Poule 1'!$G29","v":0},"3ème",{"$f":"'Poule 6'!$C23","v":""},{"$f":"'Poule 2'!$E29","v":0},{"$f":"'Poule 2'!$G29","v":0},"3ème",{"$f":"'Poule 7'!$C23","v":""},{"$f":"'Poule 3'!$E29","v":0},{"$f":"'Poule 3'!$G29","v":0},"3ème",{"$f":"'Poule 8'!$C23","v":""},{"$f":"'Poule 4'!$E29","v":0},{"$f":"'Poule 4'!$G29","v":0}]
["4ème",{"$f":"'Poule 1'!$C30","v":0},{"$f":"'Poule 1'!$E30","v":0},{"$f":"'Poule 1'!$G30","v":0},"4ème",{"$f":"'Poule 2'!$C30","v":0},{"$f":"'Poule 2'!$E30","v":0},{"$f":"'Poule 2'!$G30","v":0},"4ème",{"$f":"'Poule 3'!$C30","v":0},{"$f":"'Poule 3'!$E30","v":0},{"$f":"'Poule 3'!$G30","v":0},"4ème",{"$f":"'Poule 4'!$C30","v":0},{"$f":"'Poule 4'!$E30","v":0},{"$f":"'Poule 4'!$G30","v":0}]

{"sheet":"Tableau","index":10,"n_rows":63,"n_cols":27,"rows_kept":63,"cut":false,"hidden":false,"merged":[[1,0,1,1],[25,16,25,17],[29,19,29,20],[0,12,0,15],[0,16,0,26],[15,25,15,26],[0,0,0,10],[9,19,9,20],[8,6,8,7],[1,6,1,7],[10,16,10,17],[23,19,23,20],[16,22,16,23],[16,6,16,7],[23,6,23,7],[3,16,3,17],[18,16,18,17],[33,0,34,7],[33,8,33,10],[34,8,34,10],[30,4,31,9],[40,2,40,3],[41,2,41,3],[42,2,42,3],[43,2,43,3],[44,2,44,3],[35,2,35,3],[36,2,36,3],[37,2,37,3],[38,2,38,3],[39,2,39,3],[50,2,50,3],[49,2,49,3],[45,2,45,3],[46,2,46,3],[47,2,47,3],[48,2,48,3]]}
["REPECHAGES",null,null,null,null,null,null,null,null,null,null,null,"1er tour de tableau",null,null,null,"Tableau principal"]
[null,null,null,null,null,null,"Perdant 1/4 de finale 2"]
[null,null,null,null,null,"P",{"$f":"IF(S12=\"\",\"\",IF(S12=\"p\",R12,R14))","v":0},{"$f":"IF(S12=\"\",\"\",IF(S12=\"p\",Q12,Q14))","v":"STAN 3"}]
[null,null,null,null,null,null,null,null,null,null,null,null,"1er poule 1",{"$f":"'Résultats de poule'!B2","v":"FEN 1"},{"$f":"'Résultats de poule'!D2","v":0},"V","1/4 de finale 1"]
[null,null,"V",{"$f":"IF(F3=\"\",\"\",IF(F3=\"v\",G3,G6))","v":0},{"$f":"IF(F3=\"\",\"\",IF(F3=\"v\",H3,H6))","v":"STAN 4"},null,null,null,"P",{"$f":"IF(P4=\"\",\"\",IF(P4=\"p\",O4,O5))","v":""},{"$f":"IF(P4=\"\",\"\",IF(P4=\"p\",N4,N5))","v":"STAN 8"},null,"2ème poule 2",{"$f":"'Résultats de poule'!F3","v":"STAN 8"},{"$f":"'Résultats de poule'!P5","v":""},"P",{"$f":"IF(P4=\"\",\"\",IF(P4=\"v\",N4,N5))","v":"FEN 1"},{"$f":"IF(P4=\"\",\"\",IF(P4=\"v\",O4,O5))","v":0},"V"]
[null,null,null,null,null,"V",{"$f":"IF(I5=\"\",\"\",IF(I5=\"v\",J5,J7))","v":0},{"$f":"IF(I5=\"\",\"\",IF(I5=\"v\",K5,K7))","v":"STAN 4"},null,null,null,null,null,null,null,null,null,null,null,{"$f":"IF(S5=\"\",\"\",IF(S5=\"v\",Q5,Q7))","v":"FEN 1"},{"$f":"IF(S5=\"\",\"\",IF(S5=\"v\",R5,R7))","v":0},"P"]
[null,null,null,null,null,null,null,null,"V",{"$f":"IF(P7=\"\",\"\",IF(P7=\"p\",O7,O8))","v":0},{"$f":"IF(P7=\"\",\"\",IF(P7=\"p\",N7,N8))","v":"STAN 4"},null,"2ème poule 7",{"$f":"'Résultats de poule'!J9","v":"ALMA 2"},{"$f":"'Résultats de poule'!H4","v":""},"V",{"$f":"IF(P7=\"\",\"\",IF(P7=\"v\",N7,N8))","v":"ALMA 2"},{"$f":"IF(P7=\"\",\"\",IF(P7=\"v\",O7,O8))","v":""},"P"]
[{"$f":"IF(C5=\"\",\"\",IF(C5=\"v\",D5,D12))","v":0},{"$f":"IF(C5=\"\",\"\",IF(C5=\"v\",E5,E12))","v":"STAN 4"},null,null,null,null,null,null,null,null,null,null,"1er poule 8",{"$f":"'Résultats de poule'!N8","v":"STAN 4"},{"$f":"'Résultats de poule'!L3","v":0},"P"]
[null,null,null,null,null,null,"Perdant 1/4 de finale 1"]
[null,null,null,null,null,"P",{"$f":"IF(S5=\"\",\"\",IF(S5=\"p\",R5,R7))","v":""},{"$f":"IF(S5=\"\",\"\",IF(S5=\"p\",Q5,Q7))","v":"ALMA 2"},null,null,null,null,null,null,null,null,null,null,null,"1/2 finale A",null,null,{"$f":"IF(V6=\"\",\"\",IF(V6=\"v\",T6,T13))","v":"STAN 2"},{"$f":"IF(V6=\"\",\"\",IF(V6=\"v\",U6,U13))","v":0},"P"]
[null,null,null,null,null,null,null,null,null,null,null,null,"1er poule 5",{"$f":"'Résultats de poule'!B8","v":"STAN 3"},{"$f":"'Résultats de poule'!H3","v":0},"V","1/4 de finale 2"]
[null,null,"P",{"$f":"IF(F10=\"\",\"\",IF(F10=\"v\",G10,G13))","v":""},{"$f":"IF(F10=\"\",\"\",IF(F10=\"v\",H10,H13))","v":"STAN 6"},null,null,null,"P",{"$f":"IF(P11=\"\",\"\",IF(P11=\"p\",O11,O12))","v":""},{"$f":"IF(P11=\"\",\"\",IF(P11=\"p\",N11,N12))","v":"BND 2"},null,"2ème poule 6",{"$f":"'Résultats de poule'!F9","v":"BND 2"},{"$f":"'Résultats de poule'!L4","v":""},"P",{"$f":"IF(P11=\"\",\"\",IF(P11=\"v\",N11,N12))","v":"STAN 3"},{"$f":"IF(P11=\"\",\"\",IF(P11=\"v\",O11,O12))","v":0},"P"]
[null,null,null,null,null,"V",{"$f":"IF(I12=\"\",\"\",IF(I12=\"v\",J12,J14))","v":""},{"$f":"IF(I12=\"\",\"\",IF(I12=\"v\",K12,K14))","v":"STAN 6"},null,null,null,null,null,null,null,null,null,null,null,{"$f":"IF(S12=\"\",\"\",IF(S12=\"v\",Q12,Q14))","v":"STAN 2"},{"$f":"IF(S12=\"\",\"\",IF(S12=\"v\",R12,R14))","v":0},"V"]
[null,null,null,null,null,null,null,null,"V",{"$f":"IF(P14=\"\",\"\",IF(P14=\"p\",O14,O15))","v":""},{"$f":"IF(P14=\"\",\"\",IF(P14=\"p\",N14,N15))","v":"STAN 6"},null,"2ème poule 3",{"$f":"'Résultats de poule'!J3","v":"STAN 6"},{"$f":"'Résultats de poule'!D5","v":""},"P",{"$f":"IF(P14=\"\",\"\",IF(P14=\"v\",N14,N15))","v":"STAN 2"},{"$f":"IF(P14=\"\",\"\",IF(P14=\"v\",O14,O15))","v":0},"V"]
[null,null,null,null,null,null,null,null,null,null,null,null,"1er poule 4",{"$f":"'Résultats de poule'!N2","v":"STAN 2"},{"$f":"'Résultats de poule'!P2","v":0},"V"]
[null,null,null,null,null,null,null,null,null,null,null,null,null,null,null,null,null,null,null,null,null,null,null,null,null,"Vainqueur"]
[null,null,null,null,null,null,"Perdant 1/4 de finale 4",null,null,null,null,null,null,null,null,null,null,null,null,null,null,null,"FINALE",null,null,{"$f":"IF(Y10=\"\",\"\",IF(Y10=\"v\",W10,W24))","v":"STAN 1"},{"$f":"IF(Y10=\"\",\"\",IF(Y10=\"v\",X10,X24))","v":0}]
[null,null,null,null,null,"P",{"$f":"IF(S27=\"\",\"\",IF(S27=\"p\",R27,R29))","v":0},{"$f":"IF(S27=\"\",\"\",IF(S27=\"p\",Q27,Q29))","v":"BND 1"}]
[null,null,null,null,null,null,null,null,null,null,null,null,"1er poule 3",{"$f":"'Résultats de poule'!J2","v":"FEN 2"},{"$f":"'Résultats de poule'!L2","v":0},"V","1/4 de finale 3"]
[null,null,"P",{"$f":"IF(F18=\"\",\"\",IF(F18=\"v\",G18,G21))","v":""},{"$f":"IF(F18=\"\",\"\",IF(F18=\"v\",H18,H21))","v":"SLH 1"},null,null,null,"P",{"$f":"IF(P19=\"\",\"\",IF(P19=\"p\",O19,O20))","v":""},{"$f":"IF(P19=\"\",\"\",IF(P19=\"p\",N19,N20))","v":"STAN 7"},null,"2ème poule 4",{"$f":"'Résultats de poule'!N3","v":"STAN 7"},{"$f":"'Résultats de poule'!H5","v":""},"P",{"$f":"IF(P19=\"\",\"\",IF(P19=\"v\",N19,N20))","v":"FEN 2"},{"$f":"IF(P19=\"\",\"\",IF(P19=\"v\",O19,O20))","v":0},"V"]
[null,null,null,null,null,"V",{"$f":"IF(I20=\"\",\"\",IF(I20=\"v\",J20,J22))","v":""},{"$f":"IF(I20=\"\",\"\",IF(I20=\"v\",K20,K22))","v":"SLH 1"},null,null,null,null,null,null,null,null,null,null,null,{"$f":"IF(S20=\"\",\"\",IF(S20=\"v\",Q20,Q22))","v":"FEN 2"},{"$f":"IF(S20=\"\",\"\",IF(S20=\"v\",R20,R22))","v":0},"P"]
[null,null,null,null,null,null,null,null,"V",{"$f":"IF(P22=\"\",\"\",IF(P22=\"p\",O22,O23))","v":""},{"$f":"IF(P22=\"\",\"\",IF(P22=\"p\",N22,N23))","v":"SLH 1"},null,"2ème poule 5",{"$f":"'Résultats de poule'!B9","v":"SLH 1"},{"$f":"'Résultats de poule'!P4","v":""},"P",{"$f":"IF(P22=\"\",\"\",IF(P22=\"v\",N22,N23))","v":"ALMA 1"},{"$f":"IF(P22=\"\",\"\",IF(P22=\"v\",O22,O23))","v":0},"P"]
[null,null,null,null,null,null,null,null,null,null,null,null,"1er poule 6",{"$f":"'Résultats de poule'!F8","v":"ALMA 1"},{"$f":"'Résultats de poule'!D3","v":0},"V"]
[{"$f":"IF(C20=\"\",\"\",IF(C20=\"v\",D20,D27))","v":0},{"$f":"IF(C20=\"\",\"\",IF(C20=\"v\",E20,E27))","v":"ALMA 1"},null,null,null,null,"Perdant 1/4 de finale 3",null,null,null,null,null,null,null,null,null,null,null,null,"1/2 finale B",null,null,{"$f":"IF(V21=\"\",\"\",IF(V21=\"v\",T21,T28))","v":"STAN 1"},{"$f":"IF(V21=\"\",\"\",IF(V21=\"v\",U21,U28))","v":0},"V"]
[null,null,null,null,null,"V",{"$f":"IF(S20=\"\",\"\",IF(S20=\"p\",R20,R22))","v":0},{"$f":"IF(S20=\"\",\"\",IF(S20=\"p\",Q20,Q22))","v":"ALMA 1"}]
[null,null,null,null,null,null,null,null,null,null,null,null,"1er poule 7",{"$f":"'Résultats de poule'!J8","v":"BND 1"},{"$f":"'Résultats de poule'!P3","v":0},"V","1/4 de finale 4"]
[null,null,"V",{"$f":"IF(F25=\"\",\"\",IF(F25=\"v\",G25,G28))","v":0},{"$f":"IF(F25=\"\",\"\",IF(F25=\"v\",H25,H28))","v":"ALMA 1"},null,null,null,"V",{"$f":"IF(P26=\"\",\"\",IF(P26=\"p\",O26,O27))","v":""},{"$f":"IF(P26=\"\",\"\",IF(P26=\"p\",N26,N27))","v":"STAN 5"},null,"2ème poule 8",{"$f":"'Résultats de poule'!N9","v":"STAN 5"},{"$f":"'Résultats de poule'!D4","v":""},"P",{"$f":"IF(P26=\"\",\"\",IF(P26=\"v\",N26,N27))","v":"BND 1"},{"$f":"IF(P26=\"\",\"\",IF(P26=\"v\",O26,O27))","v":0},"P"]
[null,null,null,null,null,"P",{"$f":"IF(I27=\"\",\"\",IF(I27=\"v\",J27,J29))","v":""},{"$f":"IF(I27=\"\",\"\",IF(I27=\"v\",K27,K29))","v":"STAN 5"},null,null,null,null,null,null,null,null,null,null,null,{"$f":"IF(S27=\"\",\"\",IF(S27=\"v\",Q27,Q29))","v":"STAN 1"},{"$f":"IF(S27=\"\",\"\",IF(S27=\"v\",R27,R29))","v":0},"V"]
[null,null,null,null,null,null,null,null,"P",{"$f":"IF(P29=\"\",\"\",IF(P29=\"p\",O29,O30))","v":""},{"$f":"IF(P29=\"\",\"\",IF(P29=\"p\",N29,N30))","v":"FEN 3"},null,"2ème poule 1",{"$f":"'Résultats de poule'!B3","v":"FEN 3"},{"$f":"'Résultats de poule'!L5","v":""},"P",{"$f":"IF(P29=\"\",\"\",IF(P29=\"v\",N29,N30))","v":"STAN 1"},{"$f":"IF(P29=\"\",\"\",IF(P29=\"v\",O29,O30))","v":0},"V"]
[null,null,null,null,null,null,null,null,null,null,null,null,"1er poule 2",{"$f":"'Résultats de poule'!F2","v":"STAN 1"},{"$f":"'Résultats de poule'!H2","v":0},"V",null,null,null,"Place de 3ème/4ème"]
[null,null,null,null,"MATCHS DE CLASSEMENT",null,null,null,null,null,null,null,null,null,null,null,null,null,null,{"$f":"IF(V21=\"\",\"\",IF(V21=\"p\",T21,T28))","v":"FEN 2"},{"$f":"IF(V21=\"\",\"\",IF(V21=\"p\",U21,U28))","v":0},"P"]
[null,null,null,null,null,null,null,null,null,null,null,null,null,null,null,null,null,null,null,null,null,null,{"$f":"IF(V31=\"\",\"\",IF(V31=\"v\",T31,T33))","v":"FEN 1"},{"$f":"IF(V31=\"\",\"\",IF(V31=\"v\",U31,U33))","v":0}]
[null,null,null,null,null,null,null,null,null,null,null,null,null,null,null,null,null,null,null,{"$f":"IF(V6=\"\",\"\",IF(V6=\"p\",T6,T13))","v":"FEN 1"},{"$f":"IF(V6=\"\",\"\",IF(V6=\"p\",U6,U13))","v":0},"V"]
[{"$f":"Engagés!A1","v":"Championnat par équipe promo Comité de Paris"},null,null,null,null,null,null,null,"CATEGORIE",null,null,null,null,"Place de 5-6",null,null,null,null,null,null,null,null,"Place de 7-8"]
[null,null,null,null,null,null,null,null,{"$f":"IF(Engagés!E3=\"\",\"\",Engagés!E3)","v":"BG Promo"},null,null,null,null,{"$f":"B8","v":"STAN 4"},{"$f":"A8","v":0},"P",null,null,null,null,null,null,{"$f":"IF(C5=\"\",\"\",IF(C5=\"p\",E5,E12))","v":"STAN 6"},{"$f":"IF(C5=\"\",\"\",IF(C5=\"p\",D5,D12))","v":""},"V",null,"7ème"]
["1er",{"$f":"IF(Z17=\"\",\"\",Z17)","v":"STAN 1"},{"$f":"IF(AA17=\"\",\"\",AA17)","v":0},null,"Q",null,null,null,null,null,null,null,null,null,null,null,{"$f":"IF(P35=\"\",\"\",IF(P35=\"v\",N35,N37))","v":"ALMA 1"},{"$f":"IF(P35=\"\",\"\",IF(P35=\"v\",O35,O37))","v":0},null,null,null,null,null,null,null,{"$f":"IF(Y35=\"\",\"\",IF(Y35=\"v\",W35,W37))","v":"STAN 6"},{"$f":"IF(Y35=\"\",\"\",IF(Y35=\"v\",X35,X37))","v":""}]
["2ème",{"$f":"IF(Y10=\"\",\"\",IF(Y10=\"p\",W10,W24))","v":"STAN 2"},{"$f":"IF(Y10=\"\",\"\",IF(Y10=\"p\",X10,X24))","v":0},null,"Q",null,null,null,null,null,null,null,null,{"$f":"B24","v":"ALMA 1"},{"$f":"A24","v":0},"V",null,null,null,null,null,null,{"$f":"IF(C20=\"\",\"\",IF(C20=\"p\",E20,E27))","v":"SLH 1"},{"$f":"IF(C20=\"\",\"\",IF(C20=\"p\",D20,D27))","v":""},"P"]
["3ème",{"$f":"IF(W32=\"\",\"\",W32)","v":"FEN 1"},{"$f":"IF(X32=\"\",\"\",X32)","v":0},null,"Q"]
["4ème",{"$f":"IF(V31=\"\",\"\",IF(V31=\"p\",T31,T33))","v":"FEN 2"},{"$f":"IF(V31=\"\",\"\",IF(V31=\"p\",U31,U33))","v":0},null,"Q",null,null,null,null,null,null,null,null,"Place de 9 à 12"]
["5ème",{"$f":"IF(Q36=\"\",\"\",Q36)","v":"ALMA 1"},{"$f":"IF(R36=\"\",\"\",R36)","v":0},null,"Q",null,null,null,null,null,null,null,null,{"$f":"IF(F3=\"\",\"\",IF(F3=\"p\",H3,H6))","v":"STAN 3"},{"$f":"IF(F3=\"\",\"\",IF(F3=\"p\",G3,G6))","v":0},"P","Place de 9-10"]
["6ème",{"$f":"IF(P35=\"\",\"\",IF(P35=\"p\",N35,N37))","v":"STAN 4"},{"$f":"IF(P35=\"\",\"\",IF(P35=\"p\",O35,O37))","v":0},null,"Q",null,null,null,null,null,null,null,null,null,null,null,{"$f":"IF(P40=\"\",\"\",IF(P40=\"v\",N40,N42))","v":"ALMA 2"},{"$f":"IF(P40=\"\",\"\",IF(P40=\"v\",O40,O42))","v":""},"P"]
["7ème",{"$f":"IF(Z36=\"\",\"\",Z36)","v":"STAN 6"},{"$f":"IF(AA36=\"\",\"\",AA36)","v":""},null,null,null,null,null,null,null,null,null,null,{"$f":"IF(F10=\"\",\"\",IF(F10=\"p\",H10,H13))","v":"ALMA 2"},{"$f":"IF(F10=\"\",\"\",IF(F10=\"p\",G10,G13))","v":""},"V"]
["8ème",{"$f":"IF(Y35=\"\",\"\",IF(Y35=\"p\",W35,W37))","v":"SLH 1"},{"$f":"IF(Y35=\"\",\"\",IF(Y35=\"p\",X35,X37))","v":""},null,null,null,null,null,null,null,null,null,null,null,null,null,null,null,null,{"$f":"IF(S41=\"\",\"\",IF(S41=\"v\",Q41,Q45))","v":"BND 1"},{"$f":"IF(S41=\"\",\"\",IF(S41=\"v\",R41,R45))","v":0},"9ème"]
["9ème",{"$f":"IF(T43=\"\",\"\",T43)","v":"BND 1"},{"$f":"IF(U43=\"\",\"\",U43)","v":0},null,null,null,null,null,null,null,null,null,null,{"$f":"IF(F18=\"\",\"\",IF(F18=\"p\",H18,H21))","v":"BND 1"},{"$f":"IF(F18=\"\",\"\",IF(F18=\"p\",G18,G21))","v":0},"V"]
["10ème",{"$f":"IF(S41=\"\",\"\",IF(S41=\"p\",Q41,Q45))","v":"ALMA 2"},{"$f":"IF(S41=\"\",\"\",IF(S41=\"p\",R41,R45))","v":""},null,null,null,null,null,null,null,null,null,null,null,null,null,{"$f":"IF(P44=\"\",\"\",IF(P44=\"v\",N44,N46))","v":"BND 1"},{"$f":"IF(P44=\"\",\"\",IF(P44=\"v\",O44,O46))","v":0},"V"]
["11ème",{"$f":"IF(T49=\"\",\"\",T49)","v":"STAN 3"},{"$f":"IF(U49=\"\",\"\",U49)","v":0},null,null,null,null,null,null,null,null,null,null,{"$f":"IF(F25=\"\",\"\",IF(F25=\"p\",H25,H28))","v":"STAN 5"},{"$f":"IF(F25=\"\",\"\",IF(F25=\"p\",G25,G28))","v":""},"P"]
["12ème",{"$f":"IF(S48=\"\",\"\",IF(S48=\"p\",Q48,Q50))","v":"STAN 5"},{"$f":"IF(S48=\"\",\"\",IF(S48=\"p\",R48,R50))","v":""},null,null,null,null,null,null,null,null,null,null,null,null,null,"Place de 11-12"]
["13ème",{"$f":"IF(T56=\"\",\"\",T56)","v":"STAN 7"},{"$f":"IF(U56=\"\",\"\",U56)","v":""},null,null,null,null,null,null,null,null,null,null,null,null,null,{"$f":"IF(P40=\"\",\"\",IF(P40=\"p\",N40,N42))","v":"STAN 3"},{"$f":"IF(P42=\"\",\"\",IF(P42=\"p\",O42,O40))","v":0},"V"]
["14ème",{"$f":"IF(S54=\"\",\"\",IF(S54=\"p\",Q54,Q58))","v":"STAN 8"},{"$f":"IF(S54=\"\",\"\",IF(S54=\"p\",R54,R58))","v":""},null,null,null,null,null,null,null,null,null,null,null,null,null,null,null,null,{"$f":"IF(S48=\"\",\"\",IF(S48=\"v\",Q48,Q50))","v":"STAN 3"},{"$f":"IF(S48=\"\",\"\",IF(S48=\"v\",R48,R50))","v":0},"11ème"]
["15ème",{"$f":"IF(T62=\"\",\"\",T62)","v":"BND 2"},{"$f":"IF(U62=\"\",\"\",U62)","v":""},null,null,null,null,null,null,null,null,null,null,null,null,null,{"$f":"IF(P44=\"\",\"\",IF(P44=\"p\",N44,N46))","v":"STAN 5"},{"$f":"IF(P44=\"\",\"\",IF(P44=\"p\",O44,O46))","v":""},"P"]
["16ème",{"$f":"IF(S61=\"\",\"\",IF(S61=\"p\",Q61,Q63))","v":"FEN 3"},{"$f":"IF(S61=\"\",\"\",IF(S61=\"p\",R61,R63))","v":""}]
[null,null,null,null,null,null,null,null,null,null,null,null,null,"Place de 13 à 16"]
[null,null,null,null,null,null,null,null,null,null,null,null,null,{"$f":"IF(I5=\"\",\"\",IF(I5=\"p\",K5,K7))","v":"STAN 8"},{"$f":"IF(I5=\"\",\"\",IF(I5=\"p\",J5,J7))","v":""},"V","Place de 13-14"]
[null,null,null,null,null,null,null,null,null,null,null,null,null,null,null,null,{"$f":"IF(P53=\"\",\"\",IF(P53=\"v\",N53,N55))","v":"STAN 8"},{"$f":"IF(P53=\"\",\"\",IF(P53=\"v\",O53,O55))","v":""},"P"]
[null,null,null,null,null,null,null,null,null,null,null,null,null,{"$f":"IF(I12=\"\",\"\",IF(I12=\"p\",K12,K14))","v":"BND 2"},{"$f":"IF(I12=\"\",\"\",IF(I12=\"p\",J12,J14))","v":""},"P"]
[null,null,null,null,null,null,null,null,null,null,null,null,null,null,null,null,null,null,null,{"$f":"IF(S54=\"\",\"\",IF(S54=\"v\",Q54,Q58))","v":"STAN 7"},{"$f":"IF(S54=\"\",\"\",IF(S54=\"v\",R54,R58))","v":""},"13ème"]
[null,null,null,null,null,null,null,null,null,null,null,null,null,{"$f":"IF(I20=\"\",\"\",IF(I20=\"p\",K20,K22))","v":"STAN 7"},{"$f":"IF(I20=\"\",\"\",IF(I20=\"p\",J20,J22))","v":""},"V"]
[null,null,null,null,null,null,null,null,null,null,null,null,null,null,null,null,{"$f":"IF(P57=\"\",\"\",IF(P57=\"v\",N57,N59))","v":"STAN 7"},{"$f":"IF(P57=\"\",\"\",IF(P57=\"v\",O57,O59))","v":""},"V"]
[null,null,null,null,null,null,null,null,null,null,null,null,null,{"$f":"IF(I27=\"\",\"\",IF(I27=\"p\",K27,K29))","v":"FEN 3"},{"$f":"IF(I27=\"\",\"\",IF(I27=\"p\",J27,J29))","v":""},"P"]
[null,null,null,null,null,null,null,null,null,null,null,null,null,null,null,null,"Place de 15-16"]
[null,null,null,null,null,null,null,null,null,null,null,null,null,null,null,null,{"$f":"IF(P53=\"\",\"\",IF(P53=\"p\",N53,N55))","v":"BND 2"},{"$f":"IF(P53=\"\",\"\",IF(P53=\"p\",O53,O55))","v":""},"V"]
[null,null,null,null,null,null,null,null,null,null,null,null,null,null,null,null,null,null,null,{"$f":"IF(S61=\"\",\"\",IF(S61=\"v\",Q61,Q63))","v":"BND 2"},{"$f":"IF(S61=\"\",\"\",IF(S61=\"v\",R61,R63))","v":""},"15ème"]
[null,null,null,null,null,null,null,null,null,null,null,null,null,null,null,null,{"$f":"IF(P57=\"\",\"\",IF(P57=\"p\",N57,N59))","v":"FEN 3"},{"$f":"IF(P57=\"\",\"\",IF(P57=\"p\",O57,O59))","v":""},"P"]