{"text_format":"1","workbook":"xlsx","n_sheets":4,"sheets":["Engagés","Poule 1","Poule 2","Tableau"],"not_rendered":{"charts":0,"images":1,"macros":1,"external_links":0,"defined_names":1,"comments":0,"pivot_tables":0},"unopened":[],"bounds":{"document_bytes":16777216,"sheet_cells":100000,"rows_first":2000,"rows_last":500,"rows_between":2000,"halvings":0,"cell_chars":16384,"cell_head_chars":4096},"cells_cut":0,"cells_raw":0,"read":"whole","date_system":"1900"}

{"sheet":"Engagés","index":0,"n_rows":37,"n_cols":14,"rows_kept":37,"cut":false,"hidden":false,"merged":[[0,0,2,2],[17,6,17,9],[17,10,17,13],[23,6,23,9],[23,10,23,13],[5,10,5,13],[5,6,5,9],[11,6,11,9],[11,10,11,13]]}
["Championnat Comité de Paris\nTENNIS DE TABLE",null,null,"DATE :","11 fev"]
[null,null,null,"LIEU :","STAN"]
[null,null,null,"CATEGORIE :","CJG promo"]
["Tête de série","ETABLISSEMENT","NOM","PRENOM","SIGLE"]
[]
[1,null,"TRAVERS","AURELIEN","75-4-STAP",null,"Poule 1",null,null,null,"Poule 2"]
[2,null,"ROUYER--NICOLAS","GASPARD","75-4-LMAP",null,1,{"$f":"VLOOKUP($G7,$A$1:$E$37,3,FALSE)","v":"TRAVERS"},{"$f":"VLOOKUP($G7,$A$1:$E$37,4,FALSE)","v":"AURELIEN"},{"$f":"VLOOKUP($G7,$A$1:$E$37,5,FALSE)","v":"75-4-STAP"},2,{"$f":"VLOOKUP($K7,$A$1:$E$37,3,FALSE)","v":"ROUYER--NICOLAS"},{"$f":"VLOOKUP($K7,$A$1:$E$37,4,FALSE)","v":"GASPARD"},{"$f":"VLOOKUP($K7,$A$1:$E$37,5,FALSE)","v":"75-4-LMAP"}]
[3,null,"SITHISAK","WILLIAM","75-4-STAP",null,4,{"$f":"VLOOKUP($G8,$A$1:$E$37,3,FALSE)","v":"ROCHET"},{"$f":"VLOOKUP($G8,$A$1:$E$37,4,FALSE)","v":"JEREMY"},{"$f":"VLOOKUP($G8,$A$1:$E$37,5,FALSE)","v":"75-4-BLOP"},3,{"$f":"VLOOKUP($K8,$A$1:$E$37,3,FALSE)","v":"SITHISAK"},{"$f":"VLOOKUP($K8,$A$1:$E$37,4,FALSE)","v":"WILLIAM"},{"$f":"VLOOKUP($K8,$A$1:$E$37,5,FALSE)","v":"75-4-STAP"}]
[4,null,"ROCHET","JEREMY","75-4-BLOP",null,5,{"$f":"VLOOKUP($G9,$A$1:$E$37,3,FALSE)","v":"DELPECH"},{"$f":"VLOOKUP($G9,$A$1:$E$37,4,FALSE)","v":"LOUIS"},{"$f":"VLOOKUP($G9,$A$1:$E$37,5,FALSE)","v":"75-4-LMAP"},6,{"$f":"VLOOKUP($K9,$A$1:$E$37,3,FALSE)","v":"YE"},{"$f":"VLOOKUP($K9,$A$1:$E$37,4,FALSE)","v":"SHAWN"},{"$f":"VLOOKUP($K9,$A$1:$E$37,5,FALSE)","v":"75-4-STAP"}]
[5,null,"DELPECH","LOUIS","75-4-LMAP",null,8,{"$f":"VLOOKUP($G10,$A$1:$E$37,3,FALSE)","v":"DE BATTISTA"},{"$f":"VLOOKUP($G10,$A$1:$E$37,4,FALSE)","v":"TIPHAINE"},{"$f":"VLOOKUP($G10,$A$1:$E$37,5,FALSE)","v":"75-4-STAP"},7,{"$f":"VLOOKUP($K10,$A$1:$E$37,3,FALSE)","v":0},{"$f":"VLOOKUP($K10,$A$1:$E$37,4,FALSE)","v":0},{"$f":"VLOOKUP($K10,$A$1:$E$37,5,FALSE)","v":0}]
[6,null,"YE","SHAWN","75-4-STAP"]
[7,null,null,null,null,null,"Poule 3",null,null,null,"Poule 4"]
[8,null,"DE BATTISTA","TIPHAINE","75-4-STAP",null,null,{"$f":"VLOOKUP($G13,$A$1:$E$37,3,FALSE)","v":{"$error":"#N/A"}},{"$f":"VLOOKUP($G13,$A$1:$E$37,4,FALSE)","v":{"$error":"#N/A"}},{"$f":"VLOOKUP($G13,$A$1:$E$37,5,FALSE)","v":{"$error":"#N/A"}},4,{"$f":"VLOOKUP($K13,$A$1:$E$37,3,FALSE)","v":"ROCHET"},{"$f":"VLOOKUP($K13,$A$1:$E$37,4,FALSE)","v":"JEREMY"},{"$f":"VLOOKUP($K13,$A$1:$E$37,5,FALSE)","v":"75-4-BLOP"}]
[9,null,null,null,null,null,14,{"$f":"VLOOKUP($G14,$A$1:$E$37,3,FALSE)","v":0},{"$f":"VLOOKUP($G14,$A$1:$E$37,4,FALSE)","v":0},{"$f":"VLOOKUP($G14,$A$1:$E$37,5,FALSE)","v":0},13,{"$f":"VLOOKUP($K14,$A$1:$E$37,3,FALSE)","v":0},{"$f":"VLOOKUP($K14,$A$1:$E$37,4,FALSE)","v":0},{"$f":"VLOOKUP($K14,$A$1:$E$37,5,FALSE)","v":0}]
[10,null,null,null,null,null,19,{"$f":"VLOOKUP($G15,$A$1:$E$37,3,FALSE)","v":0},{"$f":"VLOOKUP($G15,$A$1:$E$37,4,FALSE)","v":0},{"$f":"VLOOKUP($G15,$A$1:$E$37,5,FALSE)","v":0},20,{"$f":"VLOOKUP($K15,$A$1:$E$37,3,FALSE)","v":0},{"$f":"VLOOKUP($K15,$A$1:$E$37,4,FALSE)","v":0},{"$f":"VLOOKUP($K15,$A$1:$E$37,5,FALSE)","v":0}]
[11,null,null,null,null,null,30,{"$f":"VLOOKUP($G16,$A$1:$E$37,3,FALSE)","v":0},{"$f":"VLOOKUP($G16,$A$1:$E$37,4,FALSE)","v":0},{"$f":"VLOOKUP($G16,$A$1:$E$37,5,FALSE)","v":0},29,{"$f":"VLOOKUP($K16,$A$1:$E$37,3,FALSE)","v":0},{"$f":"VLOOKUP($K16,$A$1:$E$37,4,FALSE)","v":0},{"$f":"VLOOKUP($K16,$A$1:$E$37,5,FALSE)","v":0}]
[12]
[13,null,null,null,null,null,"Poule 5",null,null,null,"Poule 6"]
[14,null,null,null,null,null,5,{"$f":"VLOOKUP($G19,$A$1:$E$37,3,FALSE)","v":"DELPECH"},{"$f":"VLOOKUP($G19,$A$1:$E$37,4,FALSE)","v":"LOUIS"},{"$f":"VLOOKUP($G19,$A$1:$E$37,5,FALSE)","v":"75-4-LMAP"},6,{"$f":"VLOOKUP($K19,$A$1:$E$37,3,FALSE)","v":"YE"},{"$f":"VLOOKUP($K19,$A$1:$E$37,4,FALSE)","v":"SHAWN"},{"$f":"VLOOKUP($K19,$A$1:$E$37,5,FALSE)","v":"75-4-STAP"}]
[15,null,null,null,null,null,12,{"$f":"VLOOKUP($G20,$A$1:$E$37,3,FALSE)","v":0},{"$f":"VLOOKUP($G20,$A$1:$E$37,4,FALSE)","v":0},{"$f":"VLOOKUP($G20,$A$1:$E$37,5,FALSE)","v":0},11,{"$f":"VLOOKUP($K20,$A$1:$E$37,3,FALSE)","v":0},{"$f":"VLOOKUP($K20,$A$1:$E$37,4,FALSE)","v":0},{"$f":"VLOOKUP($K20,$A$1:$E$37,5,FALSE)","v":0}]
[16,null,null,null,null,null,21,{"$f":"VLOOKUP($G21,$A$1:$E$37,3,FALSE)","v":0},{"$f":"VLOOKUP($G21,$A$1:$E$37,4,FALSE)","v":0},{"$f":"VLOOKUP($G21,$A$1:$E$37,5,FALSE)","v":0},22,{"$f":"VLOOKUP($K21,$A$1:$E$37,3,FALSE)","v":0},{"$f":"VLOOKUP($K21,$A$1:$E$37,4,FALSE)","v":0},{"$f":"VLOOKUP($K21,$A$1:$E$37,5,FALSE)","v":0}]
[17,null,null,null,null,null,28,{"$f":"VLOOKUP($G22,$A$1:$E$37,3,FALSE)","v":0},{"$f":"VLOOKUP($G22,$A$1:$E$37,4,FALSE)","v":0},{"$f":"VLOOKUP($G22,$A$1:$E$37,5,FALSE)","v":0},27,{"$f":"VLOOKUP($K22,$A$1:$E$37,3,FALSE)","v":0},{"$f":"VLOOKUP($K22,$A$1:$E$37,4,FALSE)","v":0},{"$f":"VLOOKUP($K22,$A$1:$E$37,5,FALSE)","v":0}]
[18]
[19,null,null,null,null,null,"Poule 7",null,null,null,"Poule 8"]
[20,null,null,null,null,null,7,{"$f":"VLOOKUP($G25,$A$1:$E$37,3,FALSE)","v":0},{"$f":"VLOOKUP($G25,$A$1:$E$37,4,FALSE)","v":0},{"$f":"VLOOKUP($G25,$A$1:$E$37,5,FALSE)","v":0},8,{"$f":"VLOOKUP($K25,$A$1:$E$37,3,FALSE)","v":"DE BATTISTA"},{"$f":"VLOOKUP($K25,$A$1:$E$37,4,FALSE)","v":"TIPHAINE"},{"$f":"VLOOKUP($K25,$A$1:$E$37,5,FALSE)","v":"75-4-STAP"}]
[21,null,null,null,null,null,10,{"$f":"VLOOKUP($G26,$A$1:$E$37,3,FALSE)","v":0},{"$f":"VLOOKUP($G26,$A$1:$E$37,4,FALSE)","v":0},{"$f":"VLOOKUP($G26,$A$1:$E$37,5,FALSE)","v":0},9,{"$f":"VLOOKUP($K26,$A$1:$E$37,3,FALSE)","v":0},{"$f":"VLOOKUP($K26,$A$1:$E$37,4,FALSE)","v":0},{"$f":"VLOOKUP($K26,$A$1:$E$37,5,FALSE)","v":0}]
[22,null,null,null,null,null,23,{"$f":"VLOOKUP($G27,$A$1:$E$37,3,FALSE)","v":0},{"$f":"VLOOKUP($G27,$A$1:$E$37,4,FALSE)","v":0},{"$f":"VLOOKUP($G27,$A$1:$E$37,5,FALSE)","v":0},24,{"$f":"VLOOKUP($K27,$A$1:$E$37,3,FALSE)","v":0},{"$f":"VLOOKUP($K27,$A$1:$E$37,4,FALSE)","v":0},{"$f":"VLOOKUP($K27,$A$1:$E$37,5,FALSE)","v":0}]
[23,null,null,null,null,null,26,{"$f":"VLOOKUP($G28,$A$1:$E$37,3,FALSE)","v":0},{"$f":"VLOOKUP($G28,$A$1:$E$37,4,FALSE)","v":0},{"$f":"VLOOKUP($G28,$A$1:$E$37,5,FALSE)","v":0},25,{"$f":"VLOOKUP($K28,$A$1:$E$37,3,FALSE)","v":0},{"$f":"VLOOKUP($K28,$A$1:$E$37,4,FALSE)","v":0},{"$f":"VLOOKUP($K28,$A$1:$E$37,5,FALSE)","v":0}]
[24]
[25]
[26]
[27]
[28]
[29]
[30]
[31]
[32]

{"sheet":"Poule 1","index":1,"n_rows":21,"n_cols":7,"rows_kept":21,"cut":false,"hidden":false,"merged":[[0,0,0,4],[19,0,19,1],[17,2,17,3],[16,4,16,5],[17,4,17,5],[7,0,7,6],[8,3,8,4],[1,0,1,2],[1,3,1,4],[16,0,16,1],[16,2,16,3],[15,4,15,6],[8,0,8,2],[9,0,9,2],[10,0,10,2],[17,0,17,1],[20,4,20,5],[19,4,19,5],[20,2,20,3],[18,0,18,1],[20,0,20,1],[18,2,18,3],[18,4,18,5],[19,2,19,3],[13,0,13,2],[14,0,14,2],[11,0,11,2],[12,0,12,2],[15,0,15,3]]}
[{"$f":"Engagés!A1","v":"Championnat Comité de Paris\nTENNIS DE TABLE"}]
["POULE 1",null,null,{"$f":"Engagés!E3","v":"CJG promo"}]
[null,"NOM","Prénom","Sigle","Vict","Def","Classement"]
[1,{"$f":"VLOOKUP($A4,Engagés!$A$1:$E$376,3,FALSE)","v":"TRAVERS"},{"$f":"VLOOKUP($A4,Engagés!$A$1:$E$376,4,FALSE)","v":"AURELIEN"},{"$f":"VLOOKUP($A4,Engagés!$A$1:$E$376,5,FALSE)","v":"75-4-STAP"},null,null,"1er"]
[4,{"$f":"VLOOKUP($A5,Engagés!$A$1:$E$376,3,FALSE)","v":"ROCHET"},{"$f":"VLOOKUP($A5,Engagés!$A$1:$E$376,4,FALSE)","v":"JEREMY"},{"$f":"VLOOKUP($A5,Engagés!$A$1:$E$376,5,FALSE)","v":"75-4-BLOP"},null,null,"2ème"]
[5,{"$f":"VLOOKUP($A6,Engagés!$A$1:$E$376,3,FALSE)","v":"DELPECH"},{"$f":"VLOOKUP($A6,Engagés!$A$1:$E$376,4,FALSE)","v":"LOUIS"},{"$f":"VLOOKUP($A6,Engagés!$A$1:$E$376,5,FALSE)","v":"75-4-LMAP"},null,null,"3ème"]
[8,{"$f":"VLOOKUP($A7,Engagés!$A$1:$E$376,3,FALSE)","v":"DE BATTISTA"},{"$f":"VLOOKUP($A7,Engagés!$A$1:$E$376,4,FALSE)","v":"TIPHAINE"},{"$f":"VLOOKUP($A7,Engagés!$A$1:$E$376,5,FALSE)","v":"75-4-STAP"},null,null,"4ème"]
["Si poule de 4 joueurs alors…"]
["Déroulement",null,null,"Joueurs A contre Joueur B",null,"Vainqueur","Score"]
["Match 1",null,null,{"$f":"B4","v":"TRAVERS"},{"$f":"B7","v":"DE BATTISTA"}]
["Match 2",null,null,{"$f":"B5","v":"ROCHET"},{"$f":"B6","v":"DELPECH"}]
["Match 3",null,null,{"$f":"B5","v":"ROCHET"},{"$f":"B7","v":"DE BATTISTA"}]
["Match 4",null,null,{"$f":"B4","v":"TRAVERS"},{"$f":"B6","v":"DELPECH"}]
["Match 5",null,null,{"$f":"B6","v":"DELPECH"},{"$f":"B7","v":"DE BATTISTA"}]
["Match 6",null,null,{"$f":"B4","v":"TRAVERS"},{"$f":"B5","v":"ROCHET"}]
["CLASSEMENT",null,null,null,{"$f":"A2","v":"POULE 1"}]
[null,null,"NOM",null,"PRENOM",null,"SIGLE"]
["1er",null,{"$f":"IF($G$4=\"1er\", $B$4,IF($G$5=\"1er\",$B$5,IF($G$6=\"1er\",$B$6,IF($G$7=\"1er\",$B$7,\"\"))))","v":"TRAVERS"},null,{"$f":"IF($G$4=\"1er\", $C$4,IF($G$5=\"1er\",$C$5,IF($G$6=\"1er\",$C$6,IF($G$7=\"1er\",$C$7,\"\"))))","v":"AURELIEN"},null,{"$f":"IF($G$4=\"1er\", $D$4,IF($G$5=\"1er\",$D$5,IF($G$6=\"1er\",$D$6,IF($G$7=\"1er\",$D$7,\"\"))))","v":"75-4-STAP"}]
["2ème",null,{"$f":"IF($G$4=\"2ème\", $B$4,IF($G$5=\"2ème\",$B$5,IF($G$6=\"2ème\",$B$6,IF($G$7=\"2ème\",$B$7,\"\"))))","v":"ROCHET"},null,{"$f":"IF($G$4=\"2ème\", $C$4,IF($G$5=\"2ème\",$C$5,IF($G$6=\"2ème\",$C$6,IF($G$7=\"2ème\",$C$7,\"\"))))","v":"JEREMY"},null,{"$f":"IF($G$4=\"2ème\", $D$4,IF($G$5=\"2ème\",$D$5,IF($G$6=\"2ème\",$D$6,IF($G$7=\"2ème\",$D$7,\"\"))))","v":"75-4-BLOP"}]
["3ème",null,{"$f":"IF($G$4=\"3ème\", $B$4,IF($G$5=\"3ème\",$B$5,IF($G$6=\"3ème\",$B$6,IF($G$7=\"3ème\",$B$7,\"\"))))","v":"DELPECH"},null,{"$f":"IF($G$4=\"3ème\", $C$4,IF($G$5=\"3ème\",$C$5,IF($G$6=\"3ème\",$C$6,IF($G$7=\"3ème\",$C$7,\"\"))))","v":"LOUIS"},null,{"$f":"IF($G$4=\"3ème\", $D$4,IF($G$5=\"3ème\",$D$5,IF($G$6=\"3ème\",$D$6,IF($G$7=\"3ème\",$D$7,\"\"))))","v":"75-4-LMAP"}]
["4ème",null,{"$f":"IF($G$4=\"4ème\", $B$4,IF($G$5=\"4ème\",$B$5,IF($G$6=\"4ème\",$B$6,IF($G$7=\"4ème\",$B$7,\"\"))))","v":"DE BATTISTA"},null,{"$f":"IF($G$4=\"4ème\", $C$4,IF($G$5=\"4ème\",$C$5,IF($G$6=\"4ème\",$C$6,IF($G$7=\"4ème\",$C$7,\"\"))))","v":"TIPHAINE"},null,{"$f":"IF($G$4=\"4ème\", $D$4,IF($G$5=\"4ème\",$D$5,IF($G$6=\"4ème\",$D$6,IF($G$7=\"4ème\",$D$7,\"\"))))","v":"75-4-STAP"}]

{"sheet":"Poule 2","index":2,"n_rows":21,"n_cols":7,"rows_kept":21,"cut":false,"hidden":false,"merged":[[20,0,20,1],[20,2,20,3],[20,4,20,5],[18,0,18,1],[18,2,18,3],[18,4,18,5],[19,0,19,1],[19,2,19,3],[19,4,19,5],[17,0,17,1],[17,2,17,3],[17,4,17,5],[9,0,9,2],[10,0,10,2],[11,0,11,2],[12,0,12,2],[13,0,13,2],[14,0,14,2],[15,0,15,3],[15,4,15,6],[16,0,16,1],[16,2,16,3],[16,4,16,5],[0,0,0,4],[1,0,1,2],[1,3,1,4],[7,0,7,6],[8,0,8,2],[8,3,8,4]]}
[{"$f":"Engagés!A1","v":"Championnat Comité de Paris\nTENNIS DE TABLE"}]
["POULE 2",null,null,{"$f":"Engagés!E3","v":"CJG promo"}]
[null,"NOM","Prénom","Sigle","Vict","Def","Classement"]
[2,{"$f":"VLOOKUP($A4,Engagés!$A$1:$E$376,3,FALSE)","v":"ROUYER--NICOLAS"},{"$f":"VLOOKUP($A4,Engagés!$A$1:$E$376,4,FALSE)","v":"GASPARD"},{"$f":"VLOOKUP($A4,Engagés!$A$1:$E$376,5,FALSE)","v":"75-4-LMAP"},null,null,"1er"]
[3,{"$f":"VLOOKUP($A5,Engagés!$A$1:$E$376,3,FALSE)","v":"SITHISAK"},{"$f":"VLOOKUP($A5,Engagés!$A$1:$E$376,4,FALSE)","v":"WILLIAM"},{"$f":"VLOOKUP($A5,Engagés!$A$1:$E$376,5,FALSE)","v":"75-4-STAP"},null,null,"2ème"]
[6,{"$f":"VLOOKUP($A6,Engagés!$A$1:$E$376,3,FALSE)","v":"YE"},{"$f":"VLOOKUP($A6,Engagés!$A$1:$E$376,4,FALSE)","v":"SHAWN"},{"$f":"VLOOKUP($A6,Engagés!$A$1:$E$376,5,FALSE)","v":"75-4-STAP"},null,null,"3ème"]
[7,{"$f":"VLOOKUP($A7,Engagés!$A$1:$E$376,3,FALSE)","v":0},{"$f":"VLOOKUP($A7,Engagés!$A$1:$E$376,4,FALSE)","v":0},{"$f":"VLOOKUP($A7,Engagés!$A$1:$E$376,5,FALSE)","v":0},null,null,"4ème"]
["Si poule de 4 joueurs alors…"]
["Déroulement",null,null,"Joueurs A contre Joueur B",null,"Vainqueur","Score"]
["Match 1",null,null,{"$f":"B4","v":"ROUYER--NICOLAS"},{"$f":"B7","v":0}]
["Match 2",null,null,{"$f":"B5","v":"SITHISAK"},{"$f":"B6","v":"YE"}]
["Match 3",null,null,{"$f":"B5","v":"SITHISAK"},{"$f":"B7","v":0}]
["Match 4",null,null,{"$f":"B4","v":"ROUYER--NICOLAS"},{"$f":"B6","v":"YE"}]
["Match 5",null,null,{"$f":"B6","v":"YE"},{"$f":"B7","v":0}]
["Match 6",null,null,{"$f":"B4","v":"ROUYER--NICOLAS"},{"$f":"B5","v":"SITHISAK"}]
["CLASSEMENT",null,null,null,{"$f":"A2","v":"POULE 2"}]
[null,null,"NOM",null,"PRENOM",null,"SIGLE"]
["1er",null,{"$f":"IF($G$4=\"1er\", $B$4,IF($G$5=\"1er\",$B$5,IF($G$6=\"1er\",$B$6,IF($G$7=\"1er\",$B$7,\"\"))))","v":"ROUYER--NICOLAS"},null,{"$f":"IF($G$4=\"1er\", $C$4,IF($G$5=\"1er\",$C$5,IF($G$6=\"1er\",$C$6,IF($G$7=\"1er\",$C$7,\"\"))))","v":"GASPARD"},null,{"$f":"IF($G$4=\"1er\", $D$4,IF($G$5=\"1er\",$D$5,IF($G$6=\"1er\",$D$6,IF($G$7=\"1er\",$D$7,\"\"))))","v":"75-4-LMAP"}]
["2ème",null,{"$f":"IF($G$4=\"2ème\", $B$4,IF($G$5=\"2ème\",$B$5,IF($G$6=\"2ème\",$B$6,IF($G$7=\"2ème\",$B$7,\"\"))))","v":"SITHISAK"},null,{"$f":"IF($G$4=\"2ème\", $C$4,IF($G$5=\"2ème\",$C$5,IF($G$6=\"2ème\",$C$6,IF($G$7=\"2ème\",$C$7,\"\"))))","v":"WILLIAM"},null,{"$f":"IF($G$4=\"2ème\", $D$4,IF($G$5=\"2ème\",$D$5,IF($G$6=\"2ème\",$D$6,IF($G$7=\"2ème\",$D$7,\"\"))))","v":"75-4-STAP"}]
["3ème",null,{"$f":"IF($G$4=\"3ème\", $B$4,IF($G$5=\"3ème\",$B$5,IF($G$6=\"3ème\",$B$6,IF($G$7=\"3ème\",$B$7,\"\"))))","v":"YE"},null,{"$f":"IF($G$4=\"3ème\", $C$4,IF($G$5=\"3ème\",$C$5,IF($G$6=\"3ème\",$C$6,IF($G$7=\"3ème\",$C$7,\"\"))))","v":"SHAWN"},null,{"$f":"IF($G$4=\"3ème\", $D$4,IF($G$5=\"3ème\",$D$5,IF($G$6=\"3ème\",$D$6,IF($G$7=\"3ème\",$D$7,\"\"))))","v":"75-4-STAP"}]
["4ème",null,{"$f":"IF($G$4=\"4ème\", $B$4,IF($G$5=\"4ème\",$B$5,IF($G$6=\"4ème\",$B$6,IF($G$7=\"4ème\",$B$7,\"\"))))","v":0},null,{"$f":"IF($G$4=\"4ème\", $C$4,IF($G$5=\"4ème\",$C$5,IF($G$6=\"4ème\",$C$6,IF($G$7=\"4ème\",$C$7,\"\"))))","v":0},null,{"$f":"IF($G$4=\"4ème\", $D$4,IF($G$5=\"4ème\",$D$5,IF($G$6=\"4ème\",$D$6,IF($G$7=\"4ème\",$D$7,\"\"))))","v":0}]

{"sheet":"Tableau","index":3,"n_rows":16,"n_cols":6,"rows_kept":16,"cut":false,"hidden":false,"merged":[]}
["DEMI-FINALES"]
["Match","Joueur 1","Joueur 2","Score 1","Score 2","Vainqueur"]
["DF1",{"$f":"'Poule 1'!C18","v":"TRAVERS"},{"$f":"'Poule 2'!C19","v":"SITHISAK"},null,null,{"$f":"B3","v":"TRAVERS"}]
["DF2",{"$f":"'Poule 2'!C18","v":"ROUYER--NICOLAS"},{"$f":"'Poule 1'!C19","v":"ROCHET"},null,null,{"$f":"B4","v":"ROUYER--NICOLAS"}]
[]
["FINALE"]
["Match","Joueur 1","Joueur 2","Score 1","Score 2","Champion"]
["Finale",{"$f":"F3","v":"TRAVERS"},{"$f":"F4","v":"ROUYER--NICOLAS"},null,null,{"$f":"C8","v":"ROUYER--NICOLAS"}]
[]
["PETITE FINALE (3e place)"]
["Match","Joueur 1","Joueur 2","Score 1","Score 2","3e"]
["3e place",{"$f":"C3","v":"SITHISAK"},{"$f":"C4","v":"ROCHET"},null,null,{"$f":"C12","v":"ROCHET"}]
[]
["MATCH 5/6"]
["Match","Joueur 1","Joueur 2","Score 1","Score 2","5e"]
["5e place",{"$f":"'Poule 2'!C20","v":"YE"},{"$f":"'Poule 1'!C20","v":"DELPECH"}]