{"text_format":"1","workbook":"xlsx","n_sheets":14,"sheets":["Engagés","Poule 1","Poule 2","Poule 3","Poule 4","Poule 5","Poule 6","Poule 7","Poule 8","Résultats de poule","Tableau","Classement","Feuille de match","Feuilles"],"not_rendered":{"charts":0,"images":82,"macros":1,"external_links":0,"defined_names":1,"comments":0,"pivot_tables":0},"unopened":[],"bounds":{"document_bytes":16777216,"sheet_cells":100000,"rows_first":2000,"rows_last":500,"rows_between":2000,"halvings":0,"cell_chars":16384,"cell_head_chars":4096},"cells_cut":0,"cells_raw":0,"read":"whole","date_system":"1900"}

{"sheet":"Engagés","index":0,"n_rows":37,"n_cols":14,"rows_kept":37,"cut":false,"hidden":false,"merged":[[17,6,17,9],[17,10,17,13],[23,6,23,9],[23,10,23,13],[0,0,2,1],[5,10,5,13],[5,6,5,9],[11,6,11,9],[11,10,11,13],[0,2,2,2]]}
["FINALES Comité de Paris ",null,"TENNIS DE TABLE","DATE :","2024-01-31"]
[null,null,null,"LIEU :","Stanislas"]
[null,null,null,"CATEGORIE :","BF Promo"]
["Tête de série","ETABLISSEMENT","NOM","PRENOM","SIGLE"]
[]
[1,"AS ALMA","GUILLEMAIN BARANDE","PALOMA","75-4-LMAP",null,"Poule 1",null,null,null,"Poule 2"]
[2,"SAINTE URSULE","CARTOUX","PAULINE","75-2-SUPA",null,1,{"$f":"VLOOKUP($G7,$A$1:$E$37,3,FALSE)","v":"GUILLEMAIN BARANDE"},{"$f":"VLOOKUP($G7,$A$1:$E$37,4,FALSE)","v":"PALOMA"},{"$f":"VLOOKUP($G7,$A$1:$E$37,5,FALSE)","v":"75-4-LMAP"},2,{"$f":"VLOOKUP($K7,$A$1:$E$37,3,FALSE)","v":"CARTOUX"},{"$f":"VLOOKUP($K7,$A$1:$E$37,4,FALSE)","v":"PAULINE"},{"$f":"VLOOKUP($K7,$A$1:$E$37,5,FALSE)","v":"75-2-SUPA"}]
[3,"PAUL CLAUDEL HULST","MUNIER","CHARLOTTE","75-4-PCHP",null,16,{"$f":"VLOOKUP($G8,$A$1:$E$37,3,FALSE)","v":0},{"$f":"VLOOKUP($G8,$A$1:$E$37,4,FALSE)","v":0},{"$f":"VLOOKUP($G8,$A$1:$E$37,5,FALSE)","v":0},15,{"$f":"VLOOKUP($K8,$A$1:$E$37,3,FALSE)","v":"KOHLER"},{"$f":"VLOOKUP($K8,$A$1:$E$37,4,FALSE)","v":"LEA"},{"$f":"VLOOKUP($K8,$A$1:$E$37,5,FALSE)","v":"75-2-SLHP"}]
[4,"AS ALMA","DELPECH","APOLLINE","75-4-LMAP",null,17,{"$f":"VLOOKUP($G9,$A$1:$E$37,3,FALSE)","v":"VETSCH"},{"$f":"VLOOKUP($G9,$A$1:$E$37,4,FALSE)","v":"PAULINE"},{"$f":"VLOOKUP($G9,$A$1:$E$37,5,FALSE)","v":"75-4-BLOP"},18,{"$f":"VLOOKUP($K9,$A$1:$E$37,3,FALSE)","v":"HARTOG"},{"$f":"VLOOKUP($K9,$A$1:$E$37,4,FALSE)","v":"PHILIPPINE"},{"$f":"VLOOKUP($K9,$A$1:$E$37,5,FALSE)","v":"75-4-STAP"}]
[5,"FENELON STE MARIE","PICARLE","PHILIPPINE","75-4-FENP",null,32,{"$f":"VLOOKUP($G10,$A$1:$E$37,3,FALSE)","v":0},{"$f":"VLOOKUP($G10,$A$1:$E$37,4,FALSE)","v":0},{"$f":"VLOOKUP($G10,$A$1:$E$37,5,FALSE)","v":0},31,{"$f":"VLOOKUP($K10,$A$1:$E$37,3,FALSE)","v":0},{"$f":"VLOOKUP($K10,$A$1:$E$37,4,FALSE)","v":0},{"$f":"VLOOKUP($K10,$A$1:$E$37,5,FALSE)","v":0}]
[6,"AS ALMA","DELAPLACE","CHLOE","75-4-LMAP"]
[7,"SAINTE URSULE","LALANNE","PERRINE","75-2-SUPA",null,"Poule 3",null,null,null,"Poule 4"]
[8,"AS ALMA","THIBAULT","MATHILDE","75-4-LMAP",null,3,{"$f":"VLOOKUP($G13,$A$1:$E$37,3,FALSE)","v":"MUNIER"},{"$f":"VLOOKUP($G13,$A$1:$E$37,4,FALSE)","v":"CHARLOTTE"},{"$f":"VLOOKUP($G13,$A$1:$E$37,5,FALSE)","v":"75-4-PCHP"},4,{"$f":"VLOOKUP($K13,$A$1:$E$37,3,FALSE)","v":"DELPECH"},{"$f":"VLOOKUP($K13,$A$1:$E$37,4,FALSE)","v":"APOLLINE"},{"$f":"VLOOKUP($K13,$A$1:$E$37,5,FALSE)","v":"75-4-LMAP"}]
[9,null,null,null,null,null,14,{"$f":"VLOOKUP($G14,$A$1:$E$37,3,FALSE)","v":"LIU"},{"$f":"VLOOKUP($G14,$A$1:$E$37,4,FALSE)","v":"ANGELINA"},{"$f":"VLOOKUP($G14,$A$1:$E$37,5,FALSE)","v":"75-4-SMPP"},13,{"$f":"VLOOKUP($K14,$A$1:$E$37,3,FALSE)","v":"BARBARIT"},{"$f":"VLOOKUP($K14,$A$1:$E$37,4,FALSE)","v":"LOUISE"},{"$f":"VLOOKUP($K14,$A$1:$E$37,5,FALSE)","v":"75-4-BLOP"}]
[10,null,null,null,null,null,19,{"$f":"VLOOKUP($G15,$A$1:$E$37,3,FALSE)","v":"DIOP"},{"$f":"VLOOKUP($G15,$A$1:$E$37,4,FALSE)","v":"LANA"},{"$f":"VLOOKUP($G15,$A$1:$E$37,5,FALSE)","v":"75-4-LMAP"},20,{"$f":"VLOOKUP($K15,$A$1:$E$37,3,FALSE)","v":"DE BAILLIENCOURT"},{"$f":"VLOOKUP($K15,$A$1:$E$37,4,FALSE)","v":"AUGUSTINE"},{"$f":"VLOOKUP($K15,$A$1:$E$37,5,FALSE)","v":"75-4-FENP"}]
[11,null,null,null,null,null,30,{"$f":"VLOOKUP($G16,$A$1:$E$37,3,FALSE)","v":0},{"$f":"VLOOKUP($G16,$A$1:$E$37,4,FALSE)","v":0},{"$f":"VLOOKUP($G16,$A$1:$E$37,5,FALSE)","v":0},29,{"$f":"VLOOKUP($K16,$A$1:$E$37,3,FALSE)","v":"RODET"},{"$f":"VLOOKUP($K16,$A$1:$E$37,4,FALSE)","v":"DOMITILLE"},{"$f":"VLOOKUP($K16,$A$1:$E$37,5,FALSE)","v":"75-4-SMPP"}]
[12,"AS ALMA","DUVERNAY","AVRIL","75-4-LMAP"]
[13,"EDELWEISS","BARBARIT","LOUISE","75-4-BLOP",null,"Poule 5",null,null,null,"Poule 6"]
[14,"ST MICHEL DE PICPUS","LIU","ANGELINA","75-4-SMPP",null,5,{"$f":"VLOOKUP($G19,$A$1:$E$37,3,FALSE)","v":"PICARLE"},{"$f":"VLOOKUP($G19,$A$1:$E$37,4,FALSE)","v":"PHILIPPINE"},{"$f":"VLOOKUP($G19,$A$1:$E$37,5,FALSE)","v":"75-4-FENP"},6,{"$f":"VLOOKUP($K19,$A$1:$E$37,3,FALSE)","v":"DELAPLACE"},{"$f":"VLOOKUP($K19,$A$1:$E$37,4,FALSE)","v":"CHLOE"},{"$f":"VLOOKUP($K19,$A$1:$E$37,5,FALSE)","v":"75-4-LMAP"}]
[15,"SAINT LOUIS","KOHLER","LEA","75-2-SLHP",null,12,{"$f":"VLOOKUP($G20,$A$1:$E$37,3,FALSE)","v":"DUVERNAY"},{"$f":"VLOOKUP($G20,$A$1:$E$37,4,FALSE)","v":"AVRIL"},{"$f":"VLOOKUP($G20,$A$1:$E$37,5,FALSE)","v":"75-4-LMAP"},11,{"$f":"VLOOKUP($K20,$A$1:$E$37,3,FALSE)","v":0},{"$f":"VLOOKUP($K20,$A$1:$E$37,4,FALSE)","v":0},{"$f":"VLOOKUP($K20,$A$1:$E$37,5,FALSE)","v":0}]
[16,null,null,null,null,null,21,{"$f":"VLOOKUP($G21,$A$1:$E$37,3,FALSE)","v":"ROCHET"},{"$f":"VLOOKUP($G21,$A$1:$E$37,4,FALSE)","v":"OLIVIA"},{"$f":"VLOOKUP($G21,$A$1:$E$37,5,FALSE)","v":"75-4-BLOP"},22,{"$f":"VLOOKUP($K21,$A$1:$E$37,3,FALSE)","v":0},{"$f":"VLOOKUP($K21,$A$1:$E$37,4,FALSE)","v":0},{"$f":"VLOOKUP($K21,$A$1:$E$37,5,FALSE)","v":0}]
[17,"EDELWEISS","VETSCH","PAULINE","75-4-BLOP",null,28,{"$f":"VLOOKUP($G22,$A$1:$E$37,3,FALSE)","v":"RAZAFINOMBANA"},{"$f":"VLOOKUP($G22,$A$1:$E$37,4,FALSE)","v":"JUSTINE"},{"$f":"VLOOKUP($G22,$A$1:$E$37,5,FALSE)","v":"75-4-PCHP"},27,{"$f":"VLOOKUP($K22,$A$1:$E$37,3,FALSE)","v":"QUERU"},{"$f":"VLOOKUP($K22,$A$1:$E$37,4,FALSE)","v":"JULIETTE"},{"$f":"VLOOKUP($K22,$A$1:$E$37,5,FALSE)","v":"75-4-SMPP"}]
[18,"STANISLAS","HARTOG","PHILIPPINE","75-4-STAP"]
[19,"AS ALMA","DIOP","LANA","75-4-LMAP",null,"Poule 7",null,null,null,"Poule 8"]
[20,"FENELON STE MARIE","DE BAILLIENCOURT","AUGUSTINE","75-4-FENP",null,7,{"$f":"VLOOKUP($G25,$A$1:$E$37,3,FALSE)","v":"LALANNE"},{"$f":"VLOOKUP($G25,$A$1:$E$37,4,FALSE)","v":"PERRINE"},{"$f":"VLOOKUP($G25,$A$1:$E$37,5,FALSE)","v":"75-2-SUPA"},8,{"$f":"VLOOKUP($K25,$A$1:$E$37,3,FALSE)","v":"THIBAULT"},{"$f":"VLOOKUP($K25,$A$1:$E$37,4,FALSE)","v":"MATHILDE"},{"$f":"VLOOKUP($K25,$A$1:$E$37,5,FALSE)","v":"75-4-LMAP"}]
[21,"EDELWEISS","ROCHET","OLIVIA","75-4-BLOP",null,10,{"$f":"VLOOKUP($G26,$A$1:$E$37,3,FALSE)","v":0},{"$f":"VLOOKUP($G26,$A$1:$E$37,4,FALSE)","v":0},{"$f":"VLOOKUP($G26,$A$1:$E$37,5,FALSE)","v":0},9,{"$f":"VLOOKUP($K26,$A$1:$E$37,3,FALSE)","v":0},{"$f":"VLOOKUP($K26,$A$1:$E$37,4,FALSE)","v":0},{"$f":"VLOOKUP($K26,$A$1:$E$37,5,FALSE)","v":0}]
[22,null,null,null,null,null,23,{"$f":"VLOOKUP($G27,$A$1:$E$37,3,FALSE)","v":0},{"$f":"VLOOKUP($G27,$A$1:$E$37,4,FALSE)","v":0},{"$f":"VLOOKUP($G27,$A$1:$E$37,5,FALSE)","v":0},24,{"$f":"VLOOKUP($K27,$A$1:$E$37,3,FALSE)","v":"GILBERT"},{"$f":"VLOOKUP($K27,$A$1:$E$37,4,FALSE)","v":"FAUSTINE"},{"$f":"VLOOKUP($K27,$A$1:$E$37,5,FALSE)","v":"75-4-PCHP"}]
[23,null,null,null,null,null,26,{"$f":"VLOOKUP($G28,$A$1:$E$37,3,FALSE)","v":"HALES"},{"$f":"VLOOKUP($G28,$A$1:$E$37,4,FALSE)","v":"ADELE"},{"$f":"VLOOKUP($G28,$A$1:$E$37,5,FALSE)","v":"75-4-LMAP"},25,{"$f":"VLOOKUP($K28,$A$1:$E$37,3,FALSE)","v":"VEZIN"},{"$f":"VLOOKUP($K28,$A$1:$E$37,4,FALSE)","v":"CLEMENCE"},{"$f":"VLOOKUP($K28,$A$1:$E$37,5,FALSE)","v":"75-4-BLOP"}]
[24,"PAUL CLAUDEL HULST","GILBERT","FAUSTINE","75-4-PCHP"]
[25,"EDELWEISS","VEZIN","CLEMENCE","75-4-BLOP"]
[26,"AS ALMA","HALES","ADELE","75-4-LMAP"]
[27,"ST MICHEL DE PICPUS","QUERU","JULIETTE","75-4-SMPP"]
[28,"PAUL CLAUDEL HULST","RAZAFINOMBANA","JUSTINE","75-4-PCHP"]
[29,"ST MICHEL DE PICPUS","RODET","DOMITILLE","75-4-SMPP"]
[30]
[31]
[32]

{"sheet":"Poule 1","index":1,"n_rows":24,"n_cols":7,"rows_kept":24,"cut":false,"hidden":false,"merged":[[22,2,22,3],[20,0,20,1],[18,4,18,6],[11,0,11,2],[12,0,12,2],[14,0,14,2],[17,0,17,2],[18,0,18,3],[21,4,21,5],[19,0,19,1],[15,0,15,2],[16,0,16,2],[19,2,19,3],[8,0,8,2],[9,0,9,2],[10,0,10,2],[1,0,1,2],[1,3,1,6],[0,0,0,2],[0,3,0,4],[22,0,22,1],[20,2,20,3],[23,4,23,5],[22,4,22,5],[13,0,13,6],[14,3,14,4],[23,2,23,3],[21,0,21,1],[23,0,23,1],[21,2,21,3],[19,4,19,5],[20,4,20,5],[7,0,7,6],[8,3,8,4]]}
[{"$f":"Engagés!C1","v":"TENNIS DE TABLE"},null,null,{"$f":"Engagés!E3","v":"BF Promo"}]
["POULE 1"]
[null,"NOM","Prénom","Sigle","Vict","Def","Classement"]
[1,{"$f":"VLOOKUP($A4,Engagés!$A$1:$E$380,3,FALSE)","v":"GUILLEMAIN BARANDE"},{"$f":"VLOOKUP($A4,Engagés!$A$1:$E$380,4,FALSE)","v":"PALOMA"},{"$f":"VLOOKUP($A4,Engagés!$A$1:$E$380,5,FALSE)","v":"75-4-LMAP"},null,null,"1er"]
[16,{"$f":"VLOOKUP($A5,Engagés!$A$1:$E$380,3,FALSE)","v":0},{"$f":"VLOOKUP($A5,Engagés!$A$1:$E$380,4,FALSE)","v":0},{"$f":"VLOOKUP($A5,Engagés!$A$1:$E$380,5,FALSE)","v":0},null,null,"3ème"]
[17,{"$f":"VLOOKUP($A6,Engagés!$A$1:$E$380,3,FALSE)","v":"VETSCH"},{"$f":"VLOOKUP($A6,Engagés!$A$1:$E$380,4,FALSE)","v":"PAULINE"},{"$f":"VLOOKUP($A6,Engagés!$A$1:$E$380,5,FALSE)","v":"75-4-BLOP"},null,null,"2ème"]
[32,{"$f":"VLOOKUP($A7,Engagés!$A$1:$E$380,3,FALSE)","v":0},{"$f":"VLOOKUP($A7,Engagés!$A$1:$E$380,4,FALSE)","v":0},{"$f":"VLOOKUP($A7,Engagés!$A$1:$E$380,5,FALSE)","v":0},null,null,"4ème"]
["Si poule de 4 joueurs alors…"]
["Déroulement",null,null,"Joueurs A contre Joueur B",null,"Vainqueur","Score"]
["Match 1",null,null,{"$f":"B4","v":"GUILLEMAIN BARANDE"},{"$f":"B7","v":0}]
["Match 2",null,null,{"$f":"B5","v":0},{"$f":"B6","v":"VETSCH"}]
["Finale vainqueur Match 1 contre vainqueur Match 2",null,null,{"$f":"IF(F10=\"\",\"\",F10)","v":""},{"$f":"IF(F11=\"\",\"\",F11)","v":""}]
["Petite finale entre les deux perdants des matchs 1 et 2",null,null,{"$f":"IF(D12=\"\",\"\",IF(D12=D10,E10,D10))","v":""},{"$f":"IF(E12=\"\",\"\",IF(E12=D11,E11,D11))","v":""}]
["Si poule de 3 joueurs alors…"]
["Déroulement",null,null,"Joueurs A contre Joueur B",null,"Vainqueur","Score"]
["Match 1",null,null,{"$f":"B4","v":"GUILLEMAIN BARANDE"},{"$f":"B6","v":"VETSCH"},0]
["Match 2",null,null,{"$f":"B5","v":0},{"$f":"B6","v":"VETSCH"},0]
["Match 3",null,null,{"$f":"B4","v":"GUILLEMAIN BARANDE"},{"$f":"B5","v":0},0]
["CLASSEMENT",null,null,null,{"$f":"A2","v":"POULE 1"}]
[null,null,"NOM",null,"PRENOM",null,"SIGLE"]
["1er",null,{"$f":"IF($G$4=\"1er\", $B$4,IF($G$5=\"1er\",$B$5,IF($G$6=\"1er\",$B$6,IF($G$7=\"1er\",$B$7,\"\"))))","v":"GUILLEMAIN BARANDE"},null,{"$f":"IF($G$4=\"1er\", $C$4,IF($G$5=\"1er\",$C$5,IF($G$6=\"1er\",$C$6,IF($G$7=\"1er\",$C$7,\"\"))))","v":"PALOMA"},null,{"$f":"IF($G$4=\"1er\", $D$4,IF($G$5=\"1er\",$D$5,IF($G$6=\"1er\",$D$6,IF($G$7=\"1er\",$D$7,\"\"))))","v":"75-4-LMAP"}]
["2ème",null,{"$f":"IF($G$4=\"2ème\", $B$4,IF($G$5=\"2ème\",$B$5,IF($G$6=\"2ème\",$B$6,IF($G$7=\"2ème\",$B$7,\"\"))))","v":"VETSCH"},null,{"$f":"IF($G$4=\"2ème\", $C$4,IF($G$5=\"2ème\",$C$5,IF($G$6=\"2ème\",$C$6,IF($G$7=\"2ème\",$C$7,\"\"))))","v":"PAULINE"},null,{"$f":"IF($G$4=\"2ème\", $D$4,IF($G$5=\"2ème\",$D$5,IF($G$6=\"2ème\",$D$6,IF($G$7=\"2ème\",$D$7,\"\"))))","v":"75-4-BLOP"}]
["3ème",null,{"$f":"IF($G$4=\"3ème\", $B$4,IF($G$5=\"3ème\",$B$5,IF($G$6=\"3ème\",$B$6,IF($G$7=\"3ème\",$B$7,\"\"))))","v":0},null,{"$f":"IF($G$4=\"3ème\", $C$4,IF($G$5=\"3ème\",$C$5,IF($G$6=\"3ème\",$C$6,IF($G$7=\"3ème\",$C$7,\"\"))))","v":0},null,{"$f":"IF($G$4=\"3ème\", $D$4,IF($G$5=\"3ème\",$D$5,IF($G$6=\"3ème\",$D$6,IF($G$7=\"3ème\",$D$7,\"\"))))","v":0}]
["4ème",null,{"$f":"IF($G$4=\"4ème\", $B$4,IF($G$5=\"4ème\",$B$5,IF($G$6=\"4ème\",$B$6,IF($G$7=\"4ème\",$B$7,\"\"))))","v":0},null,{"$f":"IF($G$4=\"4ème\", $C$4,IF($G$5=\"4ème\",$C$5,IF($G$6=\"4ème\",$C$6,IF($G$7=\"4ème\",$C$7,\"\"))))","v":0},null,{"$f":"IF($G$4=\"4ème\", $D$4,IF($G$5=\"4ème\",$D$5,IF($G$6=\"4ème\",$D$6,IF($G$7=\"4ème\",$D$7,\"\"))))","v":0}]

{"sheet":"Poule 2","index":2,"n_rows":24,"n_cols":7,"rows_kept":24,"cut":false,"hidden":false,"merged":[[23,0,23,1],[23,2,23,3],[23,4,23,5],[21,0,21,1],[21,2,21,3],[21,4,21,5],[22,0,22,1],[22,2,22,3],[22,4,22,5],[17,0,17,2],[18,0,18,3],[18,4,18,6],[20,0,20,1],[20,2,20,3],[20,4,20,5],[19,0,19,1],[19,2,19,3],[19,4,19,5],[0,3,0,4],[15,0,15,2],[16,0,16,2],[1,0,1,2],[1,3,1,6],[7,0,7,6],[8,0,8,2],[8,3,8,4],[9,0,9,2],[10,0,10,2],[11,0,11,2],[12,0,12,2],[13,0,13,6],[14,0,14,2],[14,3,14,4],[0,0,0,2]]}
[{"$f":"Engagés!C1","v":"TENNIS DE TABLE"},null,null,{"$f":"Engagés!E3","v":"BF Promo"}]
["POULE 2"]
[null,"NOM","Prénom","Sigle","Vict","Def","Classement"]
[2,{"$f":"VLOOKUP($A4,Engagés!$A$1:$E$380,3,FALSE)","v":"CARTOUX"},{"$f":"VLOOKUP($A4,Engagés!$A$1:$E$380,4,FALSE)","v":"PAULINE"},{"$f":"VLOOKUP($A4,Engagés!$A$1:$E$380,5,FALSE)","v":"75-2-SUPA"},null,null,"1er"]
[15,{"$f":"VLOOKUP($A5,Engagés!$A$1:$E$380,3,FALSE)","v":"KOHLER"},{"$f":"VLOOKUP($A5,Engagés!$A$1:$E$380,4,FALSE)","v":"LEA"},{"$f":"VLOOKUP($A5,Engagés!$A$1:$E$380,5,FALSE)","v":"75-2-SLHP"},null,null,"3ème"]
[18,{"$f":"VLOOKUP($A6,Engagés!$A$1:$E$380,3,FALSE)","v":"HARTOG"},{"$f":"VLOOKUP($A6,Engagés!$A$1:$E$380,4,FALSE)","v":"PHILIPPINE"},{"$f":"VLOOKUP($A6,Engagés!$A$1:$E$380,5,FALSE)","v":"75-4-STAP"},null,null,"2ème"]
[31,{"$f":"VLOOKUP($A7,Engagés!$A$1:$E$380,3,FALSE)","v":0},{"$f":"VLOOKUP($A7,Engagés!$A$1:$E$380,4,FALSE)","v":0},{"$f":"VLOOKUP($A7,Engagés!$A$1:$E$380,5,FALSE)","v":0},null,null,"4ème"]
["Si poule de 4 joueurs alors…"]
["Déroulement",null,null,"Joueurs A contre Joueur B",null,"Vainqueur","Score"]
["Match 1",null,null,{"$f":"B4","v":"CARTOUX"},{"$f":"B7","v":0}]
["Match 2",null,null,{"$f":"B5","v":"KOHLER"},{"$f":"B6","v":"HARTOG"}]
["Finale vainqueur Match 1 contre vainqueur Match 2",null,null,{"$f":"IF(F10=\"\",\"\",F10)","v":""},{"$f":"IF(F11=\"\",\"\",F11)","v":""}]
["Petite finale entre les deux perdants des matchs 1 et 2",null,null,{"$f":"IF(D12=\"\",\"\",IF(D12=D10,E10,D10))","v":""},{"$f":"IF(E12=\"\",\"\",IF(E12=D11,E11,D11))","v":""}]
["Si poule de 3 joueurs alors…"]
["Déroulement",null,null,"Joueurs A contre Joueur B",null,"Vainqueur","Score"]
["Match 1",null,null,{"$f":"B4","v":"CARTOUX"},{"$f":"B6","v":"HARTOG"},0]
["Match 2",null,null,{"$f":"B5","v":"KOHLER"},{"$f":"B6","v":"HARTOG"},0]
["Match 3",null,null,{"$f":"B4","v":"CARTOUX"},{"$f":"B5","v":"KOHLER"},0]
["CLASSEMENT",null,null,null,{"$f":"A2","v":"POULE 2"}]
[null,null,"NOM",null,"PRENOM",null,"SIGLE"]
["1er",null,{"$f":"IF($G$4=\"1er\", $B$4,IF($G$5=\"1er\",$B$5,IF($G$6=\"1er\",$B$6,IF($G$7=\"1er\",$B$7,\"\"))))","v":"CARTOUX"},null,{"$f":"IF($G$4=\"1er\", $C$4,IF($G$5=\"1er\",$C$5,IF($G$6=\"1er\",$C$6,IF($G$7=\"1er\",$C$7,\"\"))))","v":"PAULINE"},null,{"$f":"IF($G$4=\"1er\", $D$4,IF($G$5=\"1er\",$D$5,IF($G$6=\"1er\",$D$6,IF($G$7=\"1er\",$D$7,\"\"))))","v":"75-2-SUPA"}]
["2ème",null,{"$f":"IF($G$4=\"2ème\", $B$4,IF($G$5=\"2ème\",$B$5,IF($G$6=\"2ème\",$B$6,IF($G$7=\"2ème\",$B$7,\"\"))))","v":"HARTOG"},null,{"$f":"IF($G$4=\"2ème\", $C$4,IF($G$5=\"2ème\",$C$5,IF($G$6=\"2ème\",$C$6,IF($G$7=\"2ème\",$C$7,\"\"))))","v":"PHILIPPINE"},null,{"$f":"IF($G$4=\"2ème\", $D$4,IF($G$5=\"2ème\",$D$5,IF($G$6=\"2ème\",$D$6,IF($G$7=\"2ème\",$D$7,\"\"))))","v":"75-4-STAP"}]
["3ème",null,{"$f":"IF($G$4=\"3ème\", $B$4,IF($G$5=\"3ème\",$B$5,IF($G$6=\"3ème\",$B$6,IF($G$7=\"3ème\",$B$7,\"\"))))","v":"KOHLER"},null,{"$f":"IF($G$4=\"3ème\", $C$4,IF($G$5=\"3ème\",$C$5,IF($G$6=\"3ème\",$C$6,IF($G$7=\"3ème\",$C$7,\"\"))))","v":"LEA"},null,{"$f":"IF($G$4=\"3ème\", $D$4,IF($G$5=\"3ème\",$D$5,IF($G$6=\"3ème\",$D$6,IF($G$7=\"3ème\",$D$7,\"\"))))","v":"75-2-SLHP"}]
["4ème",null,{"$f":"IF($G$4=\"4ème\", $B$4,IF($G$5=\"4ème\",$B$5,IF($G$6=\"4ème\",$B$6,IF($G$7=\"4ème\",$B$7,\"\"))))","v":0},null,{"$f":"IF($G$4=\"4ème\", $C$4,IF($G$5=\"4ème\",$C$5,IF($G$6=\"4ème\",$C$6,IF($G$7=\"4ème\",$C$7,\"\"))))","v":0},null,{"$f":"IF($G$4=\"4ème\", $D$4,IF($G$5=\"4ème\",$D$5,IF($G$6=\"4ème\",$D$6,IF($G$7=\"4ème\",$D$7,\"\"))))","v":0}]

{"sheet":"Poule 3","index":3,"n_rows":24,"n_cols":7,"rows_kept":24,"cut":false,"hidden":false,"merged":[[23,0,23,1],[23,2,23,3],[23,4,23,5],[21,0,21,1],[21,2,21,3],[21,4,21,5],[22,0,22,1],[22,2,22,3],[22,4,22,5],[17,0,17,2],[18,0,18,3],[18,4,18,6],[20,0,20,1],[20,2,20,3],[20,4,20,5],[19,0,19,1],[19,2,19,3],[19,4,19,5],[0,3,0,4],[15,0,15,2],[16,0,16,2],[1,0,1,2],[1,3,1,6],[7,0,7,6],[8,0,8,2],[8,3,8,4],[9,0,9,2],[10,0,10,2],[11,0,11,2],[12,0,12,2],[13,0,13,6],[14,0,14,2],[14,3,14,4],[0,0,0,2]]}
[{"$f":"Engagés!C1","v":"TENNIS DE TABLE"},null,null,{"$f":"Engagés!E3","v":"BF Promo"}]
["POULE 3"]
[null,"NOM","Prénom","Sigle","Vict","Def","Classement"]
[3,{"$f":"VLOOKUP($A4,Engagés!$A$1:$E$380,3,FALSE)","v":"MUNIER"},{"$f":"VLOOKUP($A4,Engagés!$A$1:$E$380,4,FALSE)","v":"CHARLOTTE"},{"$f":"VLOOKUP($A4,Engagés!$A$1:$E$380,5,FALSE)","v":"75-4-PCHP"},null,null,"1er"]
[14,{"$f":"VLOOKUP($A5,Engagés!$A$1:$E$380,3,FALSE)","v":"LIU"},{"$f":"VLOOKUP($A5,Engagés!$A$1:$E$380,4,FALSE)","v":"ANGELINA"},{"$f":"VLOOKUP($A5,Engagés!$A$1:$E$380,5,FALSE)","v":"75-4-SMPP"},null,null,"3ème"]
[19,{"$f":"VLOOKUP($A6,Engagés!$A$1:$E$380,3,FALSE)","v":"DIOP"},{"$f":"VLOOKUP($A6,Engagés!$A$1:$E$380,4,FALSE)","v":"LANA"},{"$f":"VLOOKUP($A6,Engagés!$A$1:$E$380,5,FALSE)","v":"75-4-LMAP"},null,null,"2ème"]
[30,{"$f":"VLOOKUP($A7,Engagés!$A$1:$E$380,3,FALSE)","v":0},{"$f":"VLOOKUP($A7,Engagés!$A$1:$E$380,4,FALSE)","v":0},{"$f":"VLOOKUP($A7,Engagés!$A$1:$E$380,5,FALSE)","v":0},null,null,"4ème"]
["Si poule de 4 joueurs alors…"]
["Déroulement",null,null,"Joueurs A contre Joueur B",null,"Vainqueur","Score"]
["Match 1",null,null,{"$f":"B4","v":"MUNIER"},{"$f":"B7","v":0}]
["Match 2",null,null,{"$f":"B5","v":"LIU"},{"$f":"B6","v":"DIOP"}]
["Finale vainqueur Match 1 contre vainqueur Match 2",null,null,{"$f":"IF(F10=\"\",\"\",F10)","v":""},{"$f":"IF(F11=\"\",\"\",F11)","v":""}]
["Petite finale entre les deux perdants des matchs 1 et 2",null,null,{"$f":"IF(D12=\"\",\"\",IF(D12=D10,E10,D10))","v":""},{"$f":"IF(E12=\"\",\"\",IF(E12=D11,E11,D11))","v":""}]
["Si poule de 3 joueurs alors…"]
["Déroulement",null,null,"Joueurs A contre Joueur B",null,"Vainqueur","Score"]
["Match 1",null,null,{"$f":"B4","v":"MUNIER"},{"$f":"B6","v":"DIOP"},0]
["Match 2",null,null,{"$f":"B5","v":"LIU"},{"$f":"B6","v":"DIOP"},0]
["Match 3",null,null,{"$f":"B4","v":"MUNIER"},{"$f":"B5","v":"LIU"},0]
["CLASSEMENT",null,null,null,{"$f":"A2","v":"POULE 3"}]
[null,null,"NOM",null,"PRENOM",null,"SIGLE"]
["1er",null,{"$f":"IF($G$4=\"1er\", $B$4,IF($G$5=\"1er\",$B$5,IF($G$6=\"1er\",$B$6,IF($G$7=\"1er\",$B$7,\"\"))))","v":"MUNIER"},null,{"$f":"IF($G$4=\"1er\", $C$4,IF($G$5=\"1er\",$C$5,IF($G$6=\"1er\",$C$6,IF($G$7=\"1er\",$C$7,\"\"))))","v":"CHARLOTTE"},null,{"$f":"IF($G$4=\"1er\", $D$4,IF($G$5=\"1er\",$D$5,IF($G$6=\"1er\",$D$6,IF($G$7=\"1er\",$D$7,\"\"))))","v":"75-4-PCHP"}]
["2ème",null,{"$f":"IF($G$4=\"2ème\", $B$4,IF($G$5=\"2ème\",$B$5,IF($G$6=\"2ème\",$B$6,IF($G$7=\"2ème\",$B$7,\"\"))))","v":"DIOP"},null,{"$f":"IF($G$4=\"2ème\", $C$4,IF($G$5=\"2ème\",$C$5,IF($G$6=\"2ème\",$C$6,IF($G$7=\"2ème\",$C$7,\"\"))))","v":"LANA"},null,{"$f":"IF($G$4=\"2ème\", $D$4,IF($G$5=\"2ème\",$D$5,IF($G$6=\"2ème\",$D$6,IF($G$7=\"2ème\",$D$7,\"\"))))","v":"75-4-LMAP"}]
["3ème",null,{"$f":"IF($G$4=\"3ème\", $B$4,IF($G$5=\"3ème\",$B$5,IF($G$6=\"3ème\",$B$6,IF($G$7=\"3ème\",$B$7,\"\"))))","v":"LIU"},null,{"$f":"IF($G$4=\"3ème\", $C$4,IF($G$5=\"3ème\",$C$5,IF($G$6=\"3ème\",$C$6,IF($G$7=\"3ème\",$C$7,\"\"))))","v":"ANGELINA"},null,{"$f":"IF($G$4=\"3ème\", $D$4,IF($G$5=\"3ème\",$D$5,IF($G$6=\"3ème\",$D$6,IF($G$7=\"3ème\",$D$7,\"\"))))","v":"75-4-SMPP"}]
["4ème",null,{"$f":"IF($G$4=\"4ème\", $B$4,IF($G$5=\"4ème\",$B$5,IF($G$6=\"4ème\",$B$6,IF($G$7=\"4ème\",$B$7,\"\"))))","v":0},null,{"$f":"IF($G$4=\"4ème\", $C$4,IF($G$5=\"4ème\",$C$5,IF($G$6=\"4ème\",$C$6,IF($G$7=\"4ème\",$C$7,\"\"))))","v":0},null,{"$f":"IF($G$4=\"4ème\", $D$4,IF($G$5=\"4ème\",$D$5,IF($G$6=\"4ème\",$D$6,IF($G$7=\"4ème\",$D$7,\"\"))))","v":0}]

{"sheet":"Poule 4","index":4,"n_rows":24,"n_cols":7,"rows_kept":24,"cut":false,"hidden":false,"merged":[[23,0,23,1],[23,2,23,3],[23,4,23,5],[21,0,21,1],[21,2,21,3],[21,4,21,5],[22,0,22,1],[22,2,22,3],[22,4,22,5],[17,0,17,2],[18,0,18,3],[18,4,18,6],[20,0,20,1],[20,2,20,3],[20,4,20,5],[19,0,19,1],[19,2,19,3],[19,4,19,5],[0,3,0,4],[15,0,15,2],[16,0,16,2],[1,0,1,2],[1,3,1,6],[7,0,7,6],[8,0,8,2],[8,3,8,4],[9,0,9,2],[10,0,10,2],[11,0,11,2],[12,0,12,2],[13,0,13,6],[14,0,14,2],[14,3,14,4],[0,0,0,2]]}
[{"$f":"Engagés!C1","v":"TENNIS DE TABLE"},null,null,{"$f":"Engagés!E3","v":"BF Promo"}]
["POULE 4"]
[null,"NOM","Prénom","Sigle","Vict","Def","Classement"]
[4,{"$f":"VLOOKUP($A4,Engagés!$A$1:$E$380,3,FALSE)","v":"DELPECH"},{"$f":"VLOOKUP($A4,Engagés!$A$1:$E$380,4,FALSE)","v":"APOLLINE"},{"$f":"VLOOKUP($A4,Engagés!$A$1:$E$380,5,FALSE)","v":"75-4-LMAP"},null,null,"1er"]
[13,{"$f":"VLOOKUP($A5,Engagés!$A$1:$E$380,3,FALSE)","v":"BARBARIT"},{"$f":"VLOOKUP($A5,Engagés!$A$1:$E$380,4,FALSE)","v":"LOUISE"},{"$f":"VLOOKUP($A5,Engagés!$A$1:$E$380,5,FALSE)","v":"75-4-BLOP"},null,null,"3ème"]
[20,{"$f":"VLOOKUP($A6,Engagés!$A$1:$E$380,3,FALSE)","v":"DE BAILLIENCOURT"},{"$f":"VLOOKUP($A6,Engagés!$A$1:$E$380,4,FALSE)","v":"AUGUSTINE"},{"$f":"VLOOKUP($A6,Engagés!$A$1:$E$380,5,FALSE)","v":"75-4-FENP"},null,null,"2ème"]
[29,{"$f":"VLOOKUP($A7,Engagés!$A$1:$E$380,3,FALSE)","v":"RODET"},{"$f":"VLOOKUP($A7,Engagés!$A$1:$E$380,4,FALSE)","v":"DOMITILLE"},{"$f":"VLOOKUP($A7,Engagés!$A$1:$E$380,5,FALSE)","v":"75-4-SMPP"},null,null,"4ème"]
["Si poule de 4 joueurs alors…"]
["Déroulement",null,null,"Joueurs A contre Joueur B",null,"Vainqueur","Score"]
["Match 1",null,null,{"$f":"B4","v":"DELPECH"},{"$f":"B7","v":"RODET"},0]
["Match 2",null,null,{"$f":"B5","v":"BARBARIT"},{"$f":"B6","v":"DE BAILLIENCOURT"},0]
["Finale vainqueur Match 1 contre vainqueur Match 2",null,null,{"$f":"IF(F10=\"\",\"\",F10)","v":0},{"$f":"IF(F11=\"\",\"\",F11)","v":0},0]
["Petite finale entre les deux perdants des matchs 1 et 2",null,null,null,null,0]
["Si poule de 3 joueurs alors…"]
["Déroulement",null,null,"Joueurs A contre Joueur B",null,"Vainqueur","Score"]
["Match 1",null,null,{"$f":"B4","v":"DELPECH"},{"$f":"B6","v":"DE BAILLIENCOURT"}]
["Match 2",null,null,{"$f":"B5","v":"BARBARIT"},{"$f":"B6","v":"DE BAILLIENCOURT"}]
["Match 3",null,null,{"$f":"B4","v":"DELPECH"},{"$f":"B5","v":"BARBARIT"}]
["CLASSEMENT",null,null,null,{"$f":"A2","v":"POULE 4"}]
[null,null,"NOM",null,"PRENOM",null,"SIGLE"]
["1er",null,{"$f":"IF($G$4=\"1er\", $B$4,IF($G$5=\"1er\",$B$5,IF($G$6=\"1er\",$B$6,IF($G$7=\"1er\",$B$7,\"\"))))","v":"DELPECH"},null,{"$f":"IF($G$4=\"1er\", $C$4,IF($G$5=\"1er\",$C$5,IF($G$6=\"1er\",$C$6,IF($G$7=\"1er\",$C$7,\"\"))))","v":"APOLLINE"},null,{"$f":"IF($G$4=\"1er\", $D$4,IF($G$5=\"1er\",$D$5,IF($G$6=\"1er\",$D$6,IF($G$7=\"1er\",$D$7,\"\"))))","v":"75-4-LMAP"}]
["2ème",null,{"$f":"IF($G$4=\"2ème\", $B$4,IF($G$5=\"2ème\",$B$5,IF($G$6=\"2ème\",$B$6,IF($G$7=\"2ème\",$B$7,\"\"))))","v":"DE BAILLIENCOURT"},null,{"$f":"IF($G$4=\"2ème\", $C$4,IF($G$5=\"2ème\",$C$5,IF($G$6=\"2ème\",$C$6,IF($G$7=\"2ème\",$C$7,\"\"))))","v":"AUGUSTINE"},null,{"$f":"IF($G$4=\"2ème\", $D$4,IF($G$5=\"2ème\",$D$5,IF($G$6=\"2ème\",$D$6,IF($G$7=\"2ème\",$D$7,\"\"))))","v":"75-4-FENP"}]
["3ème",null,{"$f":"IF($G$4=\"3ème\", $B$4,IF($G$5=\"3ème\",$B$5,IF($G$6=\"3ème\",$B$6,IF($G$7=\"3ème\",$B$7,\"\"))))","v":"BARBARIT"},null,{"$f":"IF($G$4=\"3ème\", $C$4,IF($G$5=\"3ème\",$C$5,IF($G$6=\"3ème\",$C$6,IF($G$7=\"3ème\",$C$7,\"\"))))","v":"LOUISE"},null,{"$f":"IF($G$4=\"3ème\", $D$4,IF($G$5=\"3ème\",$D$5,IF($G$6=\"3ème\",$D$6,IF($G$7=\"3ème\",$D$7,\"\"))))","v":"75-4-BLOP"}]
["4ème",null,{"$f":"IF($G$4=\"4ème\", $B$4,IF($G$5=\"4ème\",$B$5,IF($G$6=\"4ème\",$B$6,IF($G$7=\"4ème\",$B$7,\"\"))))","v":"RODET"},null,{"$f":"IF($G$4=\"4ème\", $C$4,IF($G$5=\"4ème\",$C$5,IF($G$6=\"4ème\",$C$6,IF($G$7=\"4ème\",$C$7,\"\"))))","v":"DOMITILLE"},null,{"$f":"IF($G$4=\"4ème\", $D$4,IF($G$5=\"4ème\",$D$5,IF($G$6=\"4ème\",$D$6,IF($G$7=\"4ème\",$D$7,\"\"))))","v":"75-4-SMPP"}]

{"sheet":"Poule 5","index":5,"n_rows":24,"n_cols":7,"rows_kept":24,"cut":false,"hidden":false,"merged":[[23,0,23,1],[23,2,23,3],[23,4,23,5],[21,0,21,1],[21,2,21,3],[21,4,21,5],[22,0,22,1],[22,2,22,3],[22,4,22,5],[20,0,20,1],[20,2,20,3],[20,4,20,5],[14,0,14,2],[14,3,14,4],[15,0,15,2],[18,4,18,6],[19,0,19,1],[19,2,19,3],[19,4,19,5],[16,0,16,2],[17,0,17,2],[18,0,18,3],[12,0,12,2],[13,0,13,6],[0,0,0,2],[0,3,0,4],[10,0,10,2],[11,0,11,2],[1,0,1,2],[1,3,1,6],[7,0,7,6],[8,0,8,2],[8,3,8,4],[9,0,9,2]]}
[{"$f":"Engagés!C1","v":"TENNIS DE TABLE"},null,null,{"$f":"Engagés!E3","v":"BF Promo"}]
["POULE 5"]
[null,"NOM","Prénom","Sigle","Vict","Def","Classement"]
[5,{"$f":"VLOOKUP($A4,Engagés!$A$1:$E$380,3,FALSE)","v":"PICARLE"},{"$f":"VLOOKUP($A4,Engagés!$A$1:$E$380,4,FALSE)","v":"PHILIPPINE"},{"$f":"VLOOKUP($A4,Engagés!$A$1:$E$380,5,FALSE)","v":"75-4-FENP"},null,null,"2ème"]
[12,{"$f":"VLOOKUP($A5,Engagés!$A$1:$E$380,3,FALSE)","v":"DUVERNAY"},{"$f":"VLOOKUP($A5,Engagés!$A$1:$E$380,4,FALSE)","v":"AVRIL"},{"$f":"VLOOKUP($A5,Engagés!$A$1:$E$380,5,FALSE)","v":"75-4-LMAP"},null,null,"3ème"]
[21,{"$f":"VLOOKUP($A6,Engagés!$A$1:$E$380,3,FALSE)","v":"ROCHET"},{"$f":"VLOOKUP($A6,Engagés!$A$1:$E$380,4,FALSE)","v":"OLIVIA"},{"$f":"VLOOKUP($A6,Engagés!$A$1:$E$380,5,FALSE)","v":"75-4-BLOP"},null,null,"1er"]
[28,{"$f":"VLOOKUP($A7,Engagés!$A$1:$E$380,3,FALSE)","v":"RAZAFINOMBANA"},{"$f":"VLOOKUP($A7,Engagés!$A$1:$E$380,4,FALSE)","v":"JUSTINE"},{"$f":"VLOOKUP($A7,Engagés!$A$1:$E$380,5,FALSE)","v":"75-4-PCHP"},null,null,"4ème"]
["Si poule de 4 joueurs alors…"]
["Déroulement",null,null,"Joueurs A contre Joueur B",null,"Vainqueur","Score"]
["Match 1",null,null,{"$f":"B4","v":"PICARLE"},{"$f":"B7","v":"RAZAFINOMBANA"},0]
["Match 2",null,null,{"$f":"B5","v":"DUVERNAY"},{"$f":"B6","v":"ROCHET"},0]
["Finale vainqueur Match 1 contre vainqueur Match 2",null,null,{"$f":"IF(F10=\"\",\"\",F10)","v":0},{"$f":"IF(F11=\"\",\"\",F11)","v":0},0]
["Petite finale entre les deux perdants des matchs 1 et 2",null,null,null,null,0]
["Si poule de 3 joueurs alors…"]
["Déroulement",null,null,"Joueurs A contre Joueur B",null,"Vainqueur","Score"]
["Match 1",null,null,{"$f":"B4","v":"PICARLE"},{"$f":"B6","v":"ROCHET"}]
["Match 2",null,null,{"$f":"B5","v":"DUVERNAY"},{"$f":"B6","v":"ROCHET"}]
["Match 3",null,null,{"$f":"B4","v":"PICARLE"},{"$f":"B5","v":"DUVERNAY"}]
["CLASSEMENT",null,null,null,{"$f":"A2","v":"POULE 5"}]
[null,null,"NOM",null,"PRENOM",null,"SIGLE"]
["1er",null,{"$f":"IF($G$4=\"1er\", $B$4,IF($G$5=\"1er\",$B$5,IF($G$6=\"1er\",$B$6,IF($G$7=\"1er\",$B$7,\"\"))))","v":"ROCHET"},null,{"$f":"IF($G$4=\"1er\", $C$4,IF($G$5=\"1er\",$C$5,IF($G$6=\"1er\",$C$6,IF($G$7=\"1er\",$C$7,\"\"))))","v":"OLIVIA"},null,{"$f":"IF($G$4=\"1er\", $D$4,IF($G$5=\"1er\",$D$5,IF($G$6=\"1er\",$D$6,IF($G$7=\"1er\",$D$7,\"\"))))","v":"75-4-BLOP"}]
["2ème",null,{"$f":"IF($G$4=\"2ème\", $B$4,IF($G$5=\"2ème\",$B$5,IF($G$6=\"2ème\",$B$6,IF($G$7=\"2ème\",$B$7,\"\"))))","v":"PICARLE"},null,{"$f":"IF($G$4=\"2ème\", $C$4,IF($G$5=\"2ème\",$C$5,IF($G$6=\"2ème\",$C$6,IF($G$7=\"2ème\",$C$7,\"\"))))","v":"PHILIPPINE"},null,{"$f":"IF($G$4=\"2ème\", $D$4,IF($G$5=\"2ème\",$D$5,IF($G$6=\"2ème\",$D$6,IF($G$7=\"2ème\",$D$7,\"\"))))","v":"75-4-FENP"}]
["3ème",null,{"$f":"IF($G$4=\"3ème\", $B$4,IF($G$5=\"3ème\",$B$5,IF($G$6=\"3ème\",$B$6,IF($G$7=\"3ème\",$B$7,\"\"))))","v":"DUVERNAY"},null,{"$f":"IF($G$4=\"3ème\", $C$4,IF($G$5=\"3ème\",$C$5,IF($G$6=\"3ème\",$C$6,IF($G$7=\"3ème\",$C$7,\"\"))))","v":"AVRIL"},null,{"$f":"IF($G$4=\"3ème\", $D$4,IF($G$5=\"3ème\",$D$5,IF($G$6=\"3ème\",$D$6,IF($G$7=\"3ème\",$D$7,\"\"))))","v":"75-4-LMAP"}]
["4ème",null,{"$f":"IF($G$4=\"4ème\", $B$4,IF($G$5=\"4ème\",$B$5,IF($G$6=\"4ème\",$B$6,IF($G$7=\"4ème\",$B$7,\"\"))))","v":"RAZAFINOMBANA"},null,{"$f":"IF($G$4=\"4ème\", $C$4,IF($G$5=\"4ème\",$C$5,IF($G$6=\"4ème\",$C$6,IF($G$7=\"4ème\",$C$7,\"\"))))","v":"JUSTINE"},null,{"$f":"IF($G$4=\"4ème\", $D$4,IF($G$5=\"4ème\",$D$5,IF($G$6=\"4ème\",$D$6,IF($G$7=\"4ème\",$D$7,\"\"))))","v":"75-4-PCHP"}]

{"sheet":"Poule 6","index":6,"n_rows":24,"n_cols":7,"rows_kept":24,"cut":false,"hidden":false,"merged":[[23,0,23,1],[23,2,23,3],[23,4,23,5],[21,0,21,1],[21,2,21,3],[21,4,21,5],[22,0,22,1],[22,2,22,3],[22,4,22,5],[20,0,20,1],[20,2,20,3],[20,4,20,5],[14,0,14,2],[14,3,14,4],[15,0,15,2],[18,4,18,6],[19,0,19,1],[19,2,19,3],[19,4,19,5],[16,0,16,2],[17,0,17,2],[18,0,18,3],[12,0,12,2],[13,0,13,6],[0,0,0,2],[0,3,0,4],[10,0,10,2],[11,0,11,2],[1,0,1,2],[1,3,1,6],[7,0,7,6],[8,0,8,2],[8,3,8,4],[9,0,9,2]]}
[{"$f":"Engagés!C1","v":"TENNIS DE TABLE"},null,null,{"$f":"Engagés!E3","v":"BF Promo"}]
["POULE 6"]
[null,"NOM","Prénom","Sigle","Vict","Def","Classement"]
[6,{"$f":"VLOOKUP($A4,Engagés!$A$1:$E$380,3,FALSE)","v":"DELAPLACE"},{"$f":"VLOOKUP($A4,Engagés!$A$1:$E$380,4,FALSE)","v":"CHLOE"},{"$f":"VLOOKUP($A4,Engagés!$A$1:$E$380,5,FALSE)","v":"75-4-LMAP"},null,null,"1er"]
[11,{"$f":"VLOOKUP($A5,Engagés!$A$1:$E$380,3,FALSE)","v":0},{"$f":"VLOOKUP($A5,Engagés!$A$1:$E$380,4,FALSE)","v":0},{"$f":"VLOOKUP($A5,Engagés!$A$1:$E$380,5,FALSE)","v":0},null,null,"4ème"]
[22,{"$f":"VLOOKUP($A6,Engagés!$A$1:$E$380,3,FALSE)","v":0},{"$f":"VLOOKUP($A6,Engagés!$A$1:$E$380,4,FALSE)","v":0},{"$f":"VLOOKUP($A6,Engagés!$A$1:$E$380,5,FALSE)","v":0},null,null,"3ème"]
[27,{"$f":"VLOOKUP($A7,Engagés!$A$1:$E$380,3,FALSE)","v":"QUERU"},{"$f":"VLOOKUP($A7,Engagés!$A$1:$E$380,4,FALSE)","v":"JULIETTE"},{"$f":"VLOOKUP($A7,Engagés!$A$1:$E$380,5,FALSE)","v":"75-4-SMPP"},null,null,"2ème"]
["Si poule de 4 joueurs alors…"]
["Déroulement",null,null,"Joueurs A contre Joueur B",null,"Vainqueur","Score"]
["Match 1",null,null,{"$f":"B4","v":"DELAPLACE"},{"$f":"B7","v":"QUERU"},0]
["Match 2",null,null,{"$f":"B5","v":0},{"$f":"B6","v":0},0]
["Finale vainqueur Match 1 contre vainqueur Match 2",null,null,{"$f":"IF(F10=\"\",\"\",F10)","v":0},{"$f":"IF(F11=\"\",\"\",F11)","v":0},0]
["Petite finale entre les deux perdants des matchs 1 et 2",null,null,null,null,0]
["Si poule de 3 joueurs alors…"]
["Déroulement",null,null,"Joueurs A contre Joueur B",null,"Vainqueur","Score"]
["Match 1",null,null,{"$f":"B4","v":"DELAPLACE"},{"$f":"B6","v":0}]
["Match 2",null,null,{"$f":"B5","v":0},{"$f":"B6","v":0}]
["Match 3",null,null,{"$f":"B4","v":"DELAPLACE"},{"$f":"B5","v":0}]
["CLASSEMENT",null,null,null,{"$f":"A2","v":"POULE 6"}]
[null,null,"NOM",null,"PRENOM",null,"SIGLE"]
["1er",null,{"$f":"IF($G$4=\"1er\", $B$4,IF($G$5=\"1er\",$B$5,IF($G$6=\"1er\",$B$6,IF($G$7=\"1er\",$B$7,\"\"))))","v":"DELAPLACE"},null,{"$f":"IF($G$4=\"1er\", $C$4,IF($G$5=\"1er\",$C$5,IF($G$6=\"1er\",$C$6,IF($G$7=\"1er\",$C$7,\"\"))))","v":"CHLOE"},null,{"$f":"IF($G$4=\"1er\", $D$4,IF($G$5=\"1er\",$D$5,IF($G$6=\"1er\",$D$6,IF($G$7=\"1er\",$D$7,\"\"))))","v":"75-4-LMAP"}]
["2ème",null,{"$f":"IF($G$4=\"2ème\", $B$4,IF($G$5=\"2ème\",$B$5,IF($G$6=\"2ème\",$B$6,IF($G$7=\"2ème\",$B$7,\"\"))))","v":"QUERU"},null,{"$f":"IF($G$4=\"2ème\", $C$4,IF($G$5=\"2ème\",$C$5,IF($G$6=\"2ème\",$C$6,IF($G$7=\"2ème\",$C$7,\"\"))))","v":"JULIETTE"},null,{"$f":"IF($G$4=\"2ème\", $D$4,IF($G$5=\"2ème\",$D$5,IF($G$6=\"2ème\",$D$6,IF($G$7=\"2ème\",$D$7,\"\"))))","v":"75-4-SMPP"}]
["3ème",null,{"$f":"IF($G$4=\"3ème\", $B$4,IF($G$5=\"3ème\",$B$5,IF($G$6=\"3ème\",$B$6,IF($G$7=\"3ème\",$B$7,\"\"))))","v":0},null,{"$f":"IF($G$4=\"3ème\", $C$4,IF($G$5=\"3ème\",$C$5,IF($G$6=\"3ème\",$C$6,IF($G$7=\"3ème\",$C$7,\"\"))))","v":0},null,{"$f":"IF($G$4=\"3ème\", $D$4,IF($G$5=\"3ème\",$D$5,IF($G$6=\"3ème\",$D$6,IF($G$7=\"3ème\",$D$7,\"\"))))","v":0}]
["4ème",null,{"$f":"IF($G$4=\"4ème\", $B$4,IF($G$5=\"4ème\",$B$5,IF($G$6=\"4ème\",$B$6,IF($G$7=\"4ème\",$B$7,\"\"))))","v":0},null,{"$f":"IF($G$4=\"4ème\", $C$4,IF($G$5=\"4ème\",$C$5,IF($G$6=\"4ème\",$C$6,IF($G$7=\"4ème\",$C$7,\"\"))))","v":0},null,{"$f":"IF($G$4=\"4ème\", $D$4,IF($G$5=\"4ème\",$D$5,IF($G$6=\"4ème\",$D$6,IF($G$7=\"4ème\",$D$7,\"\"))))","v":0}]

{"sheet":"Poule 7","index":7,"n_rows":24,"n_cols":7,"rows_kept":24,"cut":false,"hidden":false,"merged":[[23,0,23,1],[23,2,23,3],[23,4,23,5],[21,0,21,1],[21,2,21,3],[21,4,21,5],[22,0,22,1],[22,2,22,3],[22,4,22,5],[20,0,20,1],[20,2,20,3],[20,4,20,5],[14,0,14,2],[14,3,14,4],[15,0,15,2],[18,4,18,6],[19,0,19,1],[19,2,19,3],[19,4,19,5],[16,0,16,2],[17,0,17,2],[18,0,18,3],[12,0,12,2],[13,0,13,6],[0,0,0,2],[0,3,0,4],[10,0,10,2],[11,0,11,2],[1,0,1,2],[1,3,1,6],[7,0,7,6],[8,0,8,2],[8,3,8,4],[9,0,9,2]]}
[{"$f":"Engagés!C1","v":"TENNIS DE TABLE"},null,null,{"$f":"Engagés!E3","v":"BF Promo"}]
["POULE 7"]
[null,"NOM","Prénom","Sigle","Vict","Def","Classement"]
[7,{"$f":"VLOOKUP($A4,Engagés!$A$1:$E$380,3,FALSE)","v":"LALANNE"},{"$f":"VLOOKUP($A4,Engagés!$A$1:$E$380,4,FALSE)","v":"PERRINE"},{"$f":"VLOOKUP($A4,Engagés!$A$1:$E$380,5,FALSE)","v":"75-2-SUPA"},null,null,"1er"]
[10,{"$f":"VLOOKUP($A5,Engagés!$A$1:$E$380,3,FALSE)","v":0},{"$f":"VLOOKUP($A5,Engagés!$A$1:$E$380,4,FALSE)","v":0},{"$f":"VLOOKUP($A5,Engagés!$A$1:$E$380,5,FALSE)","v":0},null,null,"3ème"]
[23,{"$f":"VLOOKUP($A6,Engagés!$A$1:$E$380,3,FALSE)","v":0},{"$f":"VLOOKUP($A6,Engagés!$A$1:$E$380,4,FALSE)","v":0},{"$f":"VLOOKUP($A6,Engagés!$A$1:$E$380,5,FALSE)","v":0},null,null,"4ème"]
[26,{"$f":"VLOOKUP($A7,Engagés!$A$1:$E$380,3,FALSE)","v":"HALES"},{"$f":"VLOOKUP($A7,Engagés!$A$1:$E$380,4,FALSE)","v":"ADELE"},{"$f":"VLOOKUP($A7,Engagés!$A$1:$E$380,5,FALSE)","v":"75-4-LMAP"},null,null,"2ème"]
["Si poule de 4 joueurs alors…"]
["Déroulement",null,null,"Joueurs A contre Joueur B",null,"Vainqueur","Score"]
["Match 1",null,null,{"$f":"B4","v":"LALANNE"},{"$f":"B7","v":"HALES"},0]
["Match 2",null,null,{"$f":"B5","v":0},{"$f":"B6","v":0},0]
["Finale vainqueur Match 1 contre vainqueur Match 2",null,null,{"$f":"IF(F10=\"\",\"\",F10)","v":0},{"$f":"IF(F11=\"\",\"\",F11)","v":0},0]
["Petite finale entre les deux perdants des matchs 1 et 2",null,null,null,null,0]
["Si poule de 3 joueurs alors…"]
["Déroulement",null,null,"Joueurs A contre Joueur B",null,"Vainqueur","Score"]
["Match 1",null,null,{"$f":"B4","v":"LALANNE"},{"$f":"B6","v":0}]
["Match 2",null,null,{"$f":"B5","v":0},{"$f":"B6","v":0}]
["Match 3",null,null,{"$f":"B4","v":"LALANNE"},{"$f":"B5","v":0}]
["CLASSEMENT",null,null,null,{"$f":"A2","v":"POULE 7"}]
[null,null,"NOM",null,"PRENOM",null,"SIGLE"]
["1er",null,{"$f":"IF($G$4=\"1er\", $B$4,IF($G$5=\"1er\",$B$5,IF($G$6=\"1er\",$B$6,IF($G$7=\"1er\",$B$7,\"\"))))","v":"LALANNE"},null,{"$f":"IF($G$4=\"1er\", $C$4,IF($G$5=\"1er\",$C$5,IF($G$6=\"1er\",$C$6,IF($G$7=\"1er\",$C$7,\"\"))))","v":"PERRINE"},null,{"$f":"IF($G$4=\"1er\", $D$4,IF($G$5=\"1er\",$D$5,IF($G$6=\"1er\",$D$6,IF($G$7=\"1er\",$D$7,\"\"))))","v":"75-2-SUPA"}]
["2ème",null,{"$f":"IF($G$4=\"2ème\", $B$4,IF($G$5=\"2ème\",$B$5,IF($G$6=\"2ème\",$B$6,IF($G$7=\"2ème\",$B$7,\"\"))))","v":"HALES"},null,{"$f":"IF($G$4=\"2ème\", $C$4,IF($G$5=\"2ème\",$C$5,IF($G$6=\"2ème\",$C$6,IF($G$7=\"2ème\",$C$7,\"\"))))","v":"ADELE"},null,{"$f":"IF($G$4=\"2ème\", $D$4,IF($G$5=\"2ème\",$D$5,IF($G$6=\"2ème\",$D$6,IF($G$7=\"2ème\",$D$7,\"\"))))","v":"75-4-LMAP"}]
["3ème",null,{"$f":"IF($G$4=\"3ème\", $B$4,IF($G$5=\"3ème\",$B$5,IF($G$6=\"3ème\",$B$6,IF($G$7=\"3ème\",$B$7,\"\"))))","v":0},null,{"$f":"IF($G$4=\"3ème\", $C$4,IF($G$5=\"3ème\",$C$5,IF($G$6=\"3ème\",$C$6,IF($G$7=\"3ème\",$C$7,\"\"))))","v":0},null,{"$f":"IF($G$4=\"3ème\", $D$4,IF($G$5=\"3ème\",$D$5,IF($G$6=\"3ème\",$D$6,IF($G$7=\"3ème\",$D$7,\"\"))))","v":0}]
["4ème",null,{"$f":"IF($G$4=\"4ème\", $B$4,IF($G$5=\"4ème\",$B$5,IF($G$6=\"4ème\",$B$6,IF($G$7=\"4ème\",$B$7,\"\"))))","v":0},null,{"$f":"IF($G$4=\"4ème\", $C$4,IF($G$5=\"4ème\",$C$5,IF($G$6=\"4ème\",$C$6,IF($G$7=\"4ème\",$C$7,\"\"))))","v":0},null,{"$f":"IF($G$4=\"4ème\", $D$4,IF($G$5=\"4ème\",$D$5,IF($G$6=\"4ème\",$D$6,IF($G$7=\"4ème\",$D$7,\"\"))))","v":0}]

{"sheet":"Poule 8","index":8,"n_rows":24,"n_cols":7,"rows_kept":24,"cut":false,"hidden":false,"merged":[[23,0,23,1],[23,2,23,3],[23,4,23,5],[21,0,21,1],[21,2,21,3],[21,4,21,5],[22,0,22,1],[22,2,22,3],[22,4,22,5],[20,0,20,1],[20,2,20,3],[20,4,20,5],[14,0,14,2],[14,3,14,4],[15,0,15,2],[18,4,18,6],[19,0,19,1],[19,2,19,3],[19,4,19,5],[16,0,16,2],[17,0,17,2],[18,0,18,3],[12,0,12,2],[13,0,13,6],[0,0,0,2],[0,3,0,4],[10,0,10,2],[11,0,11,2],[1,0,1,2],[1,3,1,6],[7,0,7,6],[8,0,8,2],[8,3,8,4],[9,0,9,2]]}
[{"$f":"Engagés!C1","v":"TENNIS DE TABLE"},null,null,{"$f":"Engagés!E3","v":"BF Promo"}]
["POULE 8"]
[null,"NOM","Prénom","Sigle","Vict","Def","Classement"]
[8,{"$f":"VLOOKUP($A4,Engagés!$A$1:$E$380,3,FALSE)","v":"THIBAULT"},{"$f":"VLOOKUP($A4,Engagés!$A$1:$E$380,4,FALSE)","v":"MATHILDE"},{"$f":"VLOOKUP($A4,Engagés!$A$1:$E$380,5,FALSE)","v":"75-4-LMAP"},null,null,"1er"]
[9,{"$f":"VLOOKUP($A5,Engagés!$A$1:$E$380,3,FALSE)","v":0},{"$f":"VLOOKUP($A5,Engagés!$A$1:$E$380,4,FALSE)","v":0},{"$f":"VLOOKUP($A5,Engagés!$A$1:$E$380,5,FALSE)","v":0},null,null,"4ème"]
[24,{"$f":"VLOOKUP($A6,Engagés!$A$1:$E$380,3,FALSE)","v":"GILBERT"},{"$f":"VLOOKUP($A6,Engagés!$A$1:$E$380,4,FALSE)","v":"FAUSTINE"},{"$f":"VLOOKUP($A6,Engagés!$A$1:$E$380,5,FALSE)","v":"75-4-PCHP"},null,null,"2ème"]
[25,{"$f":"VLOOKUP($A7,Engagés!$A$1:$E$380,3,FALSE)","v":"VEZIN"},{"$f":"VLOOKUP($A7,Engagés!$A$1:$E$380,4,FALSE)","v":"CLEMENCE"},{"$f":"VLOOKUP($A7,Engagés!$A$1:$E$380,5,FALSE)","v":"75-4-BLOP"},null,null,"3ème"]
["Si poule de 4 joueurs alors…"]
["Déroulement",null,null,"Joueurs A contre Joueur B",null,"Vainqueur","Score"]
["Match 1",null,null,{"$f":"B4","v":"THIBAULT"},{"$f":"B7","v":"VEZIN"},0]
["Match 2",null,null,{"$f":"B5","v":0},{"$f":"B6","v":"GILBERT"},0]
["Finale vainqueur Match 1 contre vainqueur Match 2",null,null,{"$f":"IF(F10=\"\",\"\",F10)","v":0},{"$f":"IF(F11=\"\",\"\",F11)","v":0},0]
["Petite finale entre les deux perdants des matchs 1 et 2",null,null,null,null,0]
["Si poule de 3 joueurs alors…"]
["Déroulement",null,null,"Joueurs A contre Joueur B",null,"Vainqueur","Score"]
["Match 1",null,null,{"$f":"B4","v":"THIBAULT"},{"$f":"B6","v":"GILBERT"}]
["Match 2",null,null,{"$f":"B5","v":0},{"$f":"B6","v":"GILBERT"}]
["Match 3",null,null,{"$f":"B4","v":"THIBAULT"},{"$f":"B5","v":0}]
["CLASSEMENT",null,null,null,{"$f":"A2","v":"POULE 8"}]
[null,null,"NOM",null,"PRENOM",null,"SIGLE"]
["1er",null,{"$f":"IF($G$4=\"1er\", $B$4,IF($G$5=\"1er\",$B$5,IF($G$6=\"1er\",$B$6,IF($G$7=\"1er\",$B$7,\"\"))))","v":"THIBAULT"},null,{"$f":"IF($G$4=\"1er\", $C$4,IF($G$5=\"1er\",$C$5,IF($G$6=\"1er\",$C$6,IF($G$7=\"1er\",$C$7,\"\"))))","v":"MATHILDE"},null,{"$f":"IF($G$4=\"1er\", $D$4,IF($G$5=\"1er\",$D$5,IF($G$6=\"1er\",$D$6,IF($G$7=\"1er\",$D$7,\"\"))))","v":"75-4-LMAP"}]
["2ème",null,{"$f":"IF($G$4=\"2ème\", $B$4,IF($G$5=\"2ème\",$B$5,IF($G$6=\"2ème\",$B$6,IF($G$7=\"2ème\",$B$7,\"\"))))","v":"GILBERT"},null,{"$f":"IF($G$4=\"2ème\", $C$4,IF($G$5=\"2ème\",$C$5,IF($G$6=\"2ème\",$C$6,IF($G$7=\"2ème\",$C$7,\"\"))))","v":"FAUSTINE"},null,{"$f":"IF($G$4=\"2ème\", $D$4,IF($G$5=\"2ème\",$D$5,IF($G$6=\"2ème\",$D$6,IF($G$7=\"2ème\",$D$7,\"\"))))","v":"75-4-PCHP"}]
["3ème",null,{"$f":"IF($G$4=\"3ème\", $B$4,IF($G$5=\"3ème\",$B$5,IF($G$6=\"3ème\",$B$6,IF($G$7=\"3ème\",$B$7,\"\"))))","v":"VEZIN"},null,{"$f":"IF($G$4=\"3ème\", $C$4,IF($G$5=\"3ème\",$C$5,IF($G$6=\"3ème\",$C$6,IF($G$7=\"3ème\",$C$7,\"\"))))","v":"CLEMENCE"},null,{"$f":"IF($G$4=\"3ème\", $D$4,IF($G$5=\"3ème\",$D$5,IF($G$6=\"3ème\",$D$6,IF($G$7=\"3ème\",$D$7,\"\"))))","v":"75-4-BLOP"}]
["4ème",null,{"$f":"IF($G$4=\"4ème\", $B$4,IF($G$5=\"4ème\",$B$5,IF($G$6=\"4ème\",$B$6,IF($G$7=\"4ème\",$B$7,\"\"))))","v":0},null,{"$f":"IF($G$4=\"4ème\", $C$4,IF($G$5=\"4ème\",$C$5,IF($G$6=\"4ème\",$C$6,IF($G$7=\"4ème\",$C$7,\"\"))))","v":0},null,{"$f":"IF($G$4=\"4ème\", $D$4,IF($G$5=\"4ème\",$D$5,IF($G$6=\"4ème\",$D$6,IF($G$7=\"4ème\",$D$7,\"\"))))","v":0}]

{"sheet":"Résultats de poule","index":9,"n_rows":10,"n_cols":16,"rows_kept":10,"cut":false,"hidden":false,"merged":[[0,0,0,3],[0,4,0,7],[0,8,0,11],[0,12,0,15],[5,0,5,3],[5,4,5,7],[5,8,5,11],[5,12,5,15]]}
["Poule 1",null,null,null,"Poule 2",null,null,null,"Poule 3",null,null,null,"Poule 4"]
["1er",{"$f":"'Poule 1'!$C21","v":"GUILLEMAIN BARANDE"},{"$f":"'Poule 1'!$E21","v":"PALOMA"},{"$f":"'Poule 1'!$G21","v":"75-4-LMAP"},"1er",{"$f":"'Poule 2'!$C21","v":"CARTOUX"},{"$f":"'Poule 2'!$E21","v":"PAULINE"},{"$f":"'Poule 2'!$G21","v":"75-2-SUPA"},"1er",{"$f":"'Poule 3'!$C21","v":"MUNIER"},{"$f":"'Poule 3'!$E21","v":"CHARLOTTE"},{"$f":"'Poule 3'!$G21","v":"75-4-PCHP"},"1er",{"$f":"'Poule 4'!$C21","v":"DELPECH"},{"$f":"'Poule 4'!$E21","v":"APOLLINE"},{"$f":"'Poule 4'!$G21","v":"75-4-LMAP"}]
["2ème",{"$f":"'Poule 1'!$C22","v":"VETSCH"},{"$f":"'Poule 1'!$E22","v":"PAULINE"},{"$f":"'Poule 1'!$G22","v":"75-4-BLOP"},"2ème",{"$f":"'Poule 2'!$C22","v":"HARTOG"},{"$f":"'Poule 2'!$E22","v":"PHILIPPINE"},{"$f":"'Poule 2'!$G22","v":"75-4-STAP"},"2ème",{"$f":"'Poule 3'!$C22","v":"DIOP"},{"$f":"'Poule 3'!$E22","v":"LANA"},{"$f":"'Poule 3'!$G22","v":"75-4-LMAP"},"2ème",{"$f":"'Poule 4'!$C22","v":"DE BAILLIENCOURT"},{"$f":"'Poule 4'!$E22","v":"AUGUSTINE"},{"$f":"'Poule 4'!$G22","v":"75-4-FENP"}]
["3ème",{"$f":"'Poule 1'!$C23","v":0},{"$f":"'Poule 1'!$E23","v":0},{"$f":"'Poule 1'!$G23","v":0},"3ème",{"$f":"'Poule 2'!$C23","v":"KOHLER"},{"$f":"'Poule 2'!$E23","v":"LEA"},{"$f":"'Poule 2'!$G23","v":"75-2-SLHP"},"3ème",{"$f":"'Poule 3'!$C23","v":"LIU"},{"$f":"'Poule 3'!$E23","v":"ANGELINA"},{"$f":"'Poule 3'!$G23","v":"75-4-SMPP"},"3ème",{"$f":"'Poule 4'!$C23","v":"BARBARIT"},{"$f":"'Poule 4'!$E23","v":"LOUISE"},{"$f":"'Poule 4'!$G23","v":"75-4-BLOP"}]
["4ème",{"$f":"'Poule 1'!$C24","v":0},{"$f":"'Poule 1'!$E24","v":0},{"$f":"'Poule 1'!$G24","v":0},"4ème",{"$f":"'Poule 2'!$C24","v":0},{"$f":"'Poule 2'!$E24","v":0},{"$f":"'Poule 2'!$G24","v":0},"4ème",{"$f":"'Poule 3'!$C24","v":0},{"$f":"'Poule 3'!$E24","v":0},{"$f":"'Poule 3'!$G24","v":0},"4ème",{"$f":"'Poule 4'!$C24","v":"RODET"},{"$f":"'Poule 4'!$E24","v":"DOMITILLE"},{"$f":"'Poule 4'!$G24","v":"75-4-SMPP"}]
["Poule 5",null,null,null,"Poule 6",null,null,null,"Poule 7",null,null,null,"Poule 8"]
["1er",{"$f":"'Poule 5'!$C21","v":"ROCHET"},{"$f":"'Poule 5'!$E21","v":"OLIVIA"},{"$f":"'Poule 5'!$G21","v":"75-4-BLOP"},"1er",{"$f":"'Poule 6'!$C21","v":"DELAPLACE"},{"$f":"'Poule 6'!$E21","v":"CHLOE"},{"$f":"'Poule 6'!$G21","v":"75-4-LMAP"},"1er",{"$f":"'Poule 7'!$C21","v":"LALANNE"},{"$f":"'Poule 7'!$E21","v":"PERRINE"},{"$f":"'Poule 7'!$G21","v":"75-2-SUPA"},"1er",{"$f":"'Poule 8'!$C21","v":"THIBAULT"},{"$f":"'Poule 8'!$E21","v":"MATHILDE"},{"$f":"'Poule 8'!$G21","v":"75-4-LMAP"}]
["2ème",{"$f":"'Poule 5'!$C22","v":"PICARLE"},{"$f":"'Poule 5'!$E22","v":"PHILIPPINE"},{"$f":"'Poule 5'!$G22","v":"75-4-FENP"},"2ème",{"$f":"'Poule 6'!$C22","v":"QUERU"},{"$f":"'Poule 6'!$E22","v":"JULIETTE"},{"$f":"'Poule 6'!$G22","v":"75-4-SMPP"},"2ème",{"$f":"'Poule 7'!$C22","v":"HALES"},{"$f":"'Poule 7'!$E22","v":"ADELE"},{"$f":"'Poule 7'!$G22","v":"75-4-LMAP"},"2ème",{"$f":"'Poule 8'!$C22","v":"GILBERT"},{"$f":"'Poule 8'!$E22","v":"FAUSTINE"},{"$f":"'Poule 8'!$G22","v":"75-4-PCHP"}]
["3ème",{"$f":"'Poule 5'!$C23","v":"DUVERNAY"},{"$f":"'Poule 5'!$E23","v":"AVRIL"},{"$f":"'Poule 5'!$G23","v":"75-4-LMAP"},"3ème",{"$f":"'Poule 6'!$C23","v":0},{"$f":"'Poule 6'!$E23","v":0},{"$f":"'Poule 6'!$G23","v":0},"3ème",{"$f":"'Poule 7'!$C23","v":0},{"$f":"'Poule 7'!$E23","v":0},{"$f":"'Poule 7'!$G23","v":0},"3ème",{"$f":"'Poule 8'!$C23","v":"VEZIN"},{"$f":"'Poule 8'!$E23","v":"CLEMENCE"},{"$f":"'Poule 8'!$G23","v":"75-4-BLOP"}]
["4ème",{"$f":"'Poule 5'!$C24","v":"RAZAFINOMBANA"},{"$f":"'Poule 5'!$E24","v":"JUSTINE"},{"$f":"'Poule 5'!$G24","v":"75-4-PCHP"},"4ème",{"$f":"'Poule 6'!$C24","v":0},{"$f":"'Poule 6'!$E24","v":0},{"$f":"'Poule 6'!$G24","v":0},"4ème",{"$f":"'Poule 7'!$C24","v":0},{"$f":"'Poule 7'!$E24","v":0},{"$f":"'Poule 7'!$G24","v":0},"4ème",{"$f":"'Poule 8'!$C24","v":0},{"$f":"'Poule 8'!$E24","v":0},{"$f":"'Poule 8'!$G24","v":0}]

{"sheet":"Tableau","index":10,"n_rows":92,"n_cols":34,"rows_kept":92,"cut":false,"hidden":false,"merged":[[55,10,55,11],[33,4,33,5],[42,1,42,2],[59,29,59,30],[55,23,55,24],[47,29,47,30],[35,20,35,21],[42,20,42,21],[41,23,41,24],[48,26,48,27],[57,20,57,21],[30,32,30,33],[0,16,0,19],[15,29,15,30],[0,0,0,14],[31,29,31,30],[10,1,10,2],[1,4,1,5],[0,20,0,33],[16,26,16,27],[23,23,23,24],[3,20,3,21],[18,20,18,21],[29,4,29,5],[25,20,25,21],[1,10,1,11],[9,23,9,24],[8,10,8,11],[50,20,50,21],[16,10,16,11],[23,10,23,11],[33,10,33,11],[40,10,40,11],[48,10,48,11],[10,20,10,21]]}
["REPECHAGES ET MATCHS DE CLASSEMENT",null,null,null,null,null,null,null,null,null,null,null,null,null,null,null,"1er tour de tableau",null,null,null,"TABLEAU PRINCIPAL"]
[]
[]
[null,null,null,null,null,null,null,null,null,null,null,null,null,null,null,null,"1er poule 1",{"$f":"'Résultats de poule'!B2","v":"GUILLEMAIN BARANDE"},{"$f":"'Résultats de poule'!D2","v":"75-4-LMAP"},"V","1/8 de finale 1"]
[null,null,null,null,null,null,null,null,null,null,null,null,"P",{"$f":"IF(T4=\"\",\"\",IF(T4=\"p\",S4,S5))","v":0},{"$f":"IF(T4=\"\",\"\",IF(T4=\"p\",R4,R5))","v":0},null,"4ème poule 8",{"$f":"'Résultats de poule'!N10","v":0},{"$f":"'Résultats de poule'!P10","v":0},"P",{"$f":"IF(T4=\"\",\"\",IF(T4=\"v\",R4,R5))","v":"GUILLEMAIN BARANDE"},{"$f":"IF(T4=\"\",\"\",IF(T4=\"v\",S4,S5))","v":"75-4-LMAP"},"V"]
[null,null,null,null,null,null,null,null,null,"P",{"$f":"IF(M5=\"\",\"\",IF(M5=\"v\",N5,N7))","v":"75-4-SMPP"},{"$f":"IF(M5=\"\",\"\",IF(M5=\"v\",O5,O7))","v":"LIU"},null,null,null,null,null,null,null,null,null,null,null,{"$f":"IF(W5=\"\",\"\",IF(W5=\"v\",U5,U7))","v":"GUILLEMAIN BARANDE"},{"$f":"IF(W5=\"\",\"\",IF(W5=\"v\",V5,V7))","v":"75-4-LMAP"},"V"]
[null,null,null,null,null,null,null,null,null,null,null,null,"V",{"$f":"IF(T7=\"\",\"\",IF(T7=\"p\",S7,S8))","v":"75-4-SMPP"},{"$f":"IF(T7=\"\",\"\",IF(T7=\"p\",R7,R8))","v":"LIU"},null,"3ème poule 3",{"$f":"'Résultats de poule'!J4","v":"LIU"},{"$f":"'Résultats de poule'!L4","v":"75-4-SMPP"},"P",{"$f":"IF(T7=\"\",\"\",IF(T7=\"v\",R7,R8))","v":"QUERU"},{"$f":"IF(T7=\"\",\"\",IF(T7=\"v\",S7,S8))","v":"75-4-SMPP"},"P"]
[null,null,null,null,null,null,null,null,null,null,null,null,null,null,null,null,"2ème poule 6",{"$f":"'Résultats de poule'!F8","v":"QUERU"},{"$f":"'Résultats de poule'!H8","v":"75-4-SMPP"},"V"]
[null,null,null,null,null,null,"P",{"$f":"IF(J6=\"\",\"\",IF(J6=\"v\",K6,K13))","v":"75-4-FENP"},{"$f":"IF(J6=\"\",\"\",IF(J6=\"v\",L6,L13))","v":"DE BAILLIENCOURT"}]
[null,null,null,null,null,null,null,null,null,null,null,null,null,null,null,null,null,null,null,null,null,null,null,"1/4 finale 1",null,null,{"$f":"IF(Z6=\"\",\"\",IF(Z6=\"v\",X6,X13))","v":"GUILLEMAIN BARANDE"},{"$f":"IF(Z6=\"\",\"\",IF(Z6=\"v\",Y6,Y13))","v":"75-4-LMAP"},"V"]
[null,null,null,null,null,null,null,null,null,null,null,null,null,null,null,null,"2ème poule 4",{"$f":"'Résultats de poule'!N3","v":"DE BAILLIENCOURT"},{"$f":"'Résultats de poule'!P3","v":"75-4-FENP"},"P","1/8 de finale 2"]
[null,null,null,null,null,null,null,null,null,null,null,null,"V",{"$f":"IF(T11=\"\",\"\",IF(T11=\"p\",S11,S12))","v":"75-4-FENP"},{"$f":"IF(T11=\"\",\"\",IF(T11=\"p\",R11,R12))","v":"DE BAILLIENCOURT"},null,"3ème poule 5",{"$f":"'Résultats de poule'!B9","v":"DUVERNAY"},{"$f":"'Résultats de poule'!D9","v":"75-4-LMAP"},"V",{"$f":"IF(T11=\"\",\"\",IF(T11=\"v\",R11,R12))","v":"DUVERNAY"},{"$f":"IF(T11=\"\",\"\",IF(T11=\"v\",S11,S12))","v":"75-4-LMAP"},"P"]
[null,null,null,null,null,null,null,null,null,"V",{"$f":"IF(M12=\"\",\"\",IF(M12=\"v\",N12,N14))","v":"75-4-FENP"},{"$f":"IF(M12=\"\",\"\",IF(M12=\"v\",O12,O14))","v":"DE BAILLIENCOURT"},null,null,null,null,null,null,null,null,null,null,null,{"$f":"IF(W12=\"\",\"\",IF(W12=\"v\",U12,U14))","v":"LALANNE"},{"$f":"IF(W12=\"\",\"\",IF(W12=\"v\",V12,V14))","v":"75-2-SUPA"},"P"]
[null,null,null,null,null,null,null,null,null,null,null,null,"P",{"$f":"IF(T14=\"\",\"\",IF(T14=\"p\",S14,S15))","v":0},{"$f":"IF(T14=\"\",\"\",IF(T14=\"p\",R14,R15))","v":0},null,"4ème poule 2",{"$f":"'Résultats de poule'!F5","v":0},{"$f":"'Résultats de poule'!H5","v":0},"P",{"$f":"IF(T14=\"\",\"\",IF(T14=\"v\",R14,R15))","v":"LALANNE"},{"$f":"IF(T14=\"\",\"\",IF(T14=\"v\",S14,S15))","v":"75-2-SUPA"},"V"]
[null,null,null,null,null,null,null,null,null,null,null,null,null,null,null,null,"1er poule 7",{"$f":"'Résultats de poule'!J7","v":"LALANNE"},{"$f":"'Résultats de poule'!L7","v":"75-2-SUPA"},"V"]
[null,null,null,"V",{"$f":"IF(G9=\"\",\"\",IF(G9=\"v\",H9,H24))","v":"75-2-SLHP"},{"$f":"IF(G9=\"\",\"\",IF(G9=\"v\",I9,I24))","v":"KOHLER"}]
[null,null,null,null,null,null,null,null,null,null,null,null,null,null,null,null,null,null,null,null,null,null,null,null,null,null,"1/2 finale A",null,null,{"$f":"IF(AC10=\"\",\"\",IF(AC10=\"v\",AA10,AA24))","v":"GUILLEMAIN BARANDE"},{"$f":"IF(AC10=\"\",\"\",IF(AC10=\"v\",AB10,AB24))","v":"75-4-LMAP"},"V"]
[]
[null,null,null,null,null,null,null,null,null,null,null,null,null,null,null,null,"1er poule 6",{"$f":"'Résultats de poule'!F7","v":"DELAPLACE"},{"$f":"'Résultats de poule'!H7","v":"75-4-LMAP"},"V","1/8 de finale 3"]
[null,null,null,null,null,null,null,null,null,null,null,null,"P",{"$f":"IF(T19=\"\",\"\",IF(T19=\"p\",S19,S20))","v":0},{"$f":"IF(T19=\"\",\"\",IF(T19=\"p\",R19,R20))","v":0},null,"4ème poule 3",{"$f":"'Résultats de poule'!J5","v":0},{"$f":"'Résultats de poule'!L5","v":0},"P",{"$f":"IF(T19=\"\",\"\",IF(T19=\"v\",R19,R20))","v":"DELAPLACE"},{"$f":"IF(T19=\"\",\"\",IF(T19=\"v\",S19,S20))","v":"75-4-LMAP"},"V"]
[null,null,null,null,null,null,null,null,null,"P",{"$f":"IF(M20=\"\",\"\",IF(M20=\"v\",N20,N22))","v":"75-4-BLOP"},{"$f":"IF(M20=\"\",\"\",IF(M20=\"v\",O20,O22))","v":"VEZIN"},null,null,null,null,null,null,null,null,null,null,null,{"$f":"IF(W20=\"\",\"\",IF(W20=\"v\",U20,U22))","v":"DELAPLACE"},{"$f":"IF(W20=\"\",\"\",IF(W20=\"v\",V20,V22))","v":"75-4-LMAP"},"V"]
[null,null,null,null,null,null,null,null,null,null,null,null,"V",{"$f":"IF(T22=\"\",\"\",IF(T22=\"p\",S22,S23))","v":"75-4-BLOP"},{"$f":"IF(T22=\"\",\"\",IF(T22=\"p\",R22,R23))","v":"VEZIN"},null,"3ème poule 8",{"$f":"'Résultats de poule'!N9","v":"VEZIN"},{"$f":"'Résultats de poule'!P9","v":"75-4-BLOP"},"P",{"$f":"IF(T22=\"\",\"\",IF(T22=\"v\",R22,R23))","v":"VETSCH"},{"$f":"IF(T22=\"\",\"\",IF(T22=\"v\",S22,S23))","v":"75-4-BLOP"},"P"]
[null,null,null,null,null,null,null,null,null,null,null,null,null,null,null,null,"2ème poule 1",{"$f":"'Résultats de poule'!B3","v":"VETSCH"},{"$f":"'Résultats de poule'!D3","v":"75-4-BLOP"},"V"]
[null,null,null,null,null,null,"V",{"$f":"IF(J21=\"\",\"\",IF(J21=\"v\",K21,K28))","v":"75-2-SLHP"},{"$f":"IF(J21=\"\",\"\",IF(J21=\"v\",L21,L28))","v":"KOHLER"},null,null,null,null,null,null,null,null,null,null,null,null,null,null,"1/4 finale 2",null,null,{"$f":"IF(Z21=\"\",\"\",IF(Z21=\"v\",X21,X28))","v":"DELAPLACE"},{"$f":"IF(Z21=\"\",\"\",IF(Z21=\"v\",Y21,Y28))","v":"75-4-LMAP"},"P"]
[]
[null,null,null,null,null,null,null,null,null,null,null,null,null,null,null,null,"2ème poule 7",{"$f":"'Résultats de poule'!J8","v":"HALES"},{"$f":"'Résultats de poule'!L8","v":"75-4-LMAP"},"V","1/8 de finale 4"]
[null,null,null,null,null,null,null,null,null,null,null,null,"V",{"$f":"IF(T26=\"\",\"\",IF(T26=\"p\",S26,S27))","v":"75-2-SLHP"},{"$f":"IF(T26=\"\",\"\",IF(T26=\"p\",R26,R27))","v":"KOHLER"},null,"3ème poule 2",{"$f":"'Résultats de poule'!F4","v":"KOHLER"},{"$f":"'Résultats de poule'!H4","v":"75-2-SLHP"},"P",{"$f":"IF(T26=\"\",\"\",IF(T26=\"v\",R26,R27))","v":"HALES"},{"$f":"IF(T26=\"\",\"\",IF(T26=\"v\",S26,S27))","v":"75-4-LMAP"},"P"]
[null,null,null,null,null,null,null,null,null,"V",{"$f":"IF(M27=\"\",\"\",IF(M27=\"v\",N27,N29))","v":"75-2-SLHP"},{"$f":"IF(M27=\"\",\"\",IF(M27=\"v\",O27,O29))","v":"KOHLER"},null,null,null,null,null,null,null,null,null,null,null,{"$f":"IF(W27=\"\",\"\",IF(W27=\"v\",U27,U29))","v":"DELPECH"},{"$f":"IF(W27=\"\",\"\",IF(W27=\"v\",V27,V29))","v":"75-4-LMAP"},"P"]
[null,null,null,null,null,null,null,null,null,null,null,null,"P",{"$f":"IF(T29=\"\",\"\",IF(T29=\"p\",S29,S30))","v":"75-4-PCHP"},{"$f":"IF(T29=\"\",\"\",IF(T29=\"p\",R29,R30))","v":"RAZAFINOMBANA"},null,"4ème poule 5",{"$f":"'Résultats de poule'!B10","v":"RAZAFINOMBANA"},{"$f":"'Résultats de poule'!D10","v":"75-4-PCHP"},"P",{"$f":"IF(T29=\"\",\"\",IF(T29=\"v\",R29,R30))","v":"DELPECH"},{"$f":"IF(T29=\"\",\"\",IF(T29=\"v\",S29,S30))","v":"75-4-LMAP"},"V"]
[null,null,null,null,null,null,null,null,null,null,null,null,null,null,null,null,"1er poule 4",{"$f":"'Résultats de poule'!N2","v":"DELPECH"},{"$f":"'Résultats de poule'!P2","v":"75-4-LMAP"},"V"]
[null,"17ème",null,null,null,null,null,null,null,null,null,null,null,null,null,null,null,null,null,null,null,null,null,null,null,null,null,null,null,null,null,null,"VAINQUEUR"]
[null,{"$f":"IF(D16=\"\",\"\",IF(D16=\"v\",E16,E48))","v":"75-2-SLHP"},{"$f":"IF(D16=\"\",\"\",IF(D16=\"v\",F16,F48))","v":"KOHLER"},null,null,null,null,null,null,null,null,null,null,null,null,null,null,null,null,null,null,null,null,null,null,null,null,null,null,"FINALE",null,null,{"$f":"IF(AF17=\"\",\"\",IF(AF17=\"v\",AD17,AD49))","v":"GUILLEMAIN BARANDE"},{"$f":"IF(AF17=\"\",\"\",IF(AF17=\"v\",AE17,AE49))","v":"75-4-LMAP"}]
[]
[]
[]
[null,null,null,null,null,null,null,null,null,null,null,null,null,null,null,null,"1er poule 3",{"$f":"'Résultats de poule'!J2","v":"MUNIER"},{"$f":"'Résultats de poule'!L2","v":"75-4-PCHP"},"V","1/8 de finale 5"]
[null,null,null,null,null,null,null,null,null,null,null,null,"P",{"$f":"IF(T36=\"\",\"\",IF(T36=\"p\",S36,S37))","v":0},{"$f":"IF(T36=\"\",\"\",IF(T36=\"p\",R36,R37))","v":0},null,"4ème poule 6",{"$f":"'Résultats de poule'!F10","v":0},{"$f":"'Résultats de poule'!H10","v":0},"P",{"$f":"IF(T36=\"\",\"\",IF(T36=\"v\",R36,R37))","v":"MUNIER"},{"$f":"IF(T36=\"\",\"\",IF(T36=\"v\",S36,S37))","v":"75-4-PCHP"},"V"]
[null,null,null,null,null,null,null,null,null,"P",{"$f":"IF(M37=\"\",\"\",IF(M37=\"v\",N37,N39))","v":0},{"$f":"IF(M37=\"\",\"\",IF(M37=\"v\",O37,O39))","v":0},null,null,null,null,null,null,null,null,null,null,null,{"$f":"IF(W37=\"\",\"\",IF(W37=\"v\",U37,U39))","v":"MUNIER"},{"$f":"IF(W37=\"\",\"\",IF(W37=\"v\",V37,V39))","v":"75-4-PCHP"},"V"]
[null,null,null,null,null,null,null,null,null,null,null,null,"V",{"$f":"IF(T39=\"\",\"\",IF(T39=\"p\",S39,S40))","v":0},{"$f":"IF(T39=\"\",\"\",IF(T39=\"p\",R39,R40))","v":0},null,"3ème poule 1",{"$f":"'Résultats de poule'!B4","v":0},{"$f":"'Résultats de poule'!D4","v":0},"P",{"$f":"IF(T39=\"\",\"\",IF(T39=\"v\",R39,R40))","v":"GILBERT"},{"$f":"IF(T39=\"\",\"\",IF(T39=\"v\",S39,S40))","v":"75-4-PCHP"},"P"]
[null,null,null,null,null,null,null,null,null,null,null,null,null,null,null,null,"2ème poule 8",{"$f":"'Résultats de poule'!N8","v":"GILBERT"},{"$f":"'Résultats de poule'!P8","v":"75-4-PCHP"},"V"]
[null,null,null,null,null,null,"P",{"$f":"IF(J38=\"\",\"\",IF(J38=\"v\",K38,K45))","v":"75-4-SMPP"},{"$f":"IF(J38=\"\",\"\",IF(J38=\"v\",L38,L45))","v":"RODET"}]
[null,null,null,null,null,null,null,null,null,null,null,null,null,null,null,null,null,null,null,null,null,null,null,"1/4 finale 3",null,null,{"$f":"IF(Z38=\"\",\"\",IF(Z38=\"v\",X38,X45))","v":"MUNIER"},{"$f":"IF(Z38=\"\",\"\",IF(Z38=\"v\",Y38,Y45))","v":"75-4-PCHP"},"V"]
[null,null,null,null,null,null,null,null,null,null,null,null,null,null,null,null,"2ème poule 2",{"$f":"'Résultats de poule'!F3","v":"HARTOG"},{"$f":"'Résultats de poule'!H3","v":"75-4-STAP"},"V","1/8 de finale 6"]
[null,null,null,null,null,null,null,null,null,null,null,null,"P",{"$f":"IF(T43=\"\",\"\",IF(T43=\"p\",S43,S44))","v":0},{"$f":"IF(T43=\"\",\"\",IF(T43=\"p\",R43,R44))","v":0},null,"3ème poule 7",{"$f":"'Résultats de poule'!J9","v":0},{"$f":"'Résultats de poule'!L9","v":0},"P",{"$f":"IF(T43=\"\",\"\",IF(T43=\"v\",R43,R44))","v":"HARTOG"},{"$f":"IF(T43=\"\",\"\",IF(T43=\"v\",S43,S44))","v":"75-4-STAP"},"P"]
[null,null,null,null,null,null,null,null,null,"V",{"$f":"IF(M44=\"\",\"\",IF(M44=\"v\",N44,N46))","v":"75-4-SMPP"},{"$f":"IF(M44=\"\",\"\",IF(M44=\"v\",O44,O46))","v":"RODET"},null,null,null,null,null,null,null,null,null,null,null,{"$f":"IF(W44=\"\",\"\",IF(W44=\"v\",U44,U46))","v":"ROCHET"},{"$f":"IF(W44=\"\",\"\",IF(W44=\"v\",V44,V46))","v":"75-4-BLOP"},"P"]
[null,null,null,null,null,null,null,null,null,null,null,null,"V",{"$f":"IF(T46=\"\",\"\",IF(T46=\"p\",S46,S47))","v":"75-4-SMPP"},{"$f":"IF(T46=\"\",\"\",IF(T46=\"p\",R46,R47))","v":"RODET"},null,"4ème poule 4",{"$f":"'Résultats de poule'!N5","v":"RODET"},{"$f":"'Résultats de poule'!P5","v":"75-4-SMPP"},"P",{"$f":"IF(T46=\"\",\"\",IF(T46=\"v\",R46,R47))","v":"ROCHET"},{"$f":"IF(T46=\"\",\"\",IF(T46=\"v\",S46,S47))","v":"75-4-BLOP"},"V"]
[null,null,null,null,null,null,null,null,null,null,null,null,null,null,null,null,"1er poule 5",{"$f":"'Résultats de poule'!B7","v":"ROCHET"},{"$f":"'Résultats de poule'!D7","v":"75-4-BLOP"},"V"]
[null,null,null,"P",{"$f":"IF(G41=\"\",\"\",IF(G41=\"v\",H41,H56))","v":"75-4-BLOP"},{"$f":"IF(G41=\"\",\"\",IF(G41=\"v\",I41,I56))","v":"BARBARIT"}]
[null,null,null,null,null,null,null,null,null,null,null,null,null,null,null,null,null,null,null,null,null,null,null,null,null,null,"1/2 finale B",null,null,{"$f":"IF(AC42=\"\",\"\",IF(AC42=\"v\",AA42,AA56))","v":"MUNIER"},{"$f":"IF(AC42=\"\",\"\",IF(AC42=\"v\",AB42,AB56))","v":"75-4-PCHP"},"P"]
[]
[null,null,null,null,null,null,null,null,null,null,null,null,null,null,null,null,"1er poule 8",{"$f":"'Résultats de poule'!N7","v":"THIBAULT"},{"$f":"'Résultats de poule'!P7","v":"75-4-LMAP"},"V","1/8 de finale 7"]
[null,null,null,null,null,null,null,null,null,null,null,null,"P",{"$f":"IF(T51=\"\",\"\",IF(T51=\"p\",S51,S52))","v":0},{"$f":"IF(T51=\"\",\"\",IF(T51=\"p\",R51,R52))","v":0},null,"4ème poule 1",{"$f":"'Résultats de poule'!B5","v":0},{"$f":"'Résultats de poule'!D5","v":0},"P",{"$f":"IF(T51=\"\",\"\",IF(T51=\"v\",R51,R52))","v":"THIBAULT"},{"$f":"IF(T51=\"\",\"\",IF(T51=\"v\",S51,S52))","v":"75-4-LMAP"},"V"]
[null,null,null,null,null,null,null,null,null,"P",{"$f":"IF(M52=\"\",\"\",IF(M52=\"v\",N52,N54))","v":0},{"$f":"IF(M52=\"\",\"\",IF(M52=\"v\",O52,O54))","v":0},null,null,null,null,null,null,null,null,null,null,null,{"$f":"IF(W52=\"\",\"\",IF(W52=\"v\",U52,U54))","v":"THIBAULT"},{"$f":"IF(W52=\"\",\"\",IF(W52=\"v\",V52,V54))","v":"75-4-LMAP"},"P"]
[null,null,null,null,null,null,null,null,null,null,null,null,"V",{"$f":"IF(T54=\"\",\"\",IF(T54=\"p\",S54,S55))","v":0},{"$f":"IF(T54=\"\",\"\",IF(T54=\"p\",R54,R55))","v":0},null,"3ème poule 6",{"$f":"'Résultats de poule'!F9","v":0},{"$f":"'Résultats de poule'!H9","v":0},"P",{"$f":"IF(T54=\"\",\"\",IF(T54=\"v\",R54,R55))","v":"DIOP"},{"$f":"IF(T54=\"\",\"\",IF(T54=\"v\",S54,S55))","v":"75-4-LMAP"},"P"]
[null,null,null,null,null,null,null,null,null,null,null,null,null,null,null,null,"2ème poule 3",{"$f":"'Résultats de poule'!J3","v":"DIOP"},{"$f":"'Résultats de poule'!L3","v":"75-4-LMAP"},"V"]
[null,null,null,null,null,null,"V",{"$f":"IF(J53=\"\",\"\",IF(J53=\"v\",K53,K60))","v":"75-4-BLOP"},{"$f":"IF(J53=\"\",\"\",IF(J53=\"v\",L53,L60))","v":"BARBARIT"},null,null,null,null,null,null,null,null,null,null,null,null,null,null,"1/4 finale 4",null,null,{"$f":"IF(Z53=\"\",\"\",IF(Z53=\"v\",X53,X60))","v":"CARTOUX"},{"$f":"IF(Z53=\"\",\"\",IF(Z53=\"v\",Y53,Y60))","v":"75-2-SUPA"},"P"]
[]
[null,null,null,null,null,null,null,null,null,null,null,null,null,null,null,null,"2ème poule 5",{"$f":"'Résultats de poule'!B8","v":"PICARLE"},{"$f":"'Résultats de poule'!D8","v":"75-4-FENP"},"V","1/8 de finale 8"]
[null,null,null,null,null,null,null,null,null,null,null,null,"V",{"$f":"IF(T58=\"\",\"\",IF(T58=\"p\",S58,S59))","v":"75-4-BLOP"},{"$f":"IF(T58=\"\",\"\",IF(T58=\"p\",R58,R59))","v":"BARBARIT"},null,"3ème poule 4",{"$f":"'Résultats de poule'!N4","v":"BARBARIT"},{"$f":"'Résultats de poule'!P4","v":"75-4-BLOP"},"P",{"$f":"IF(T58=\"\",\"\",IF(T58=\"v\",R58,R59))","v":"PICARLE"},{"$f":"IF(T58=\"\",\"\",IF(T58=\"v\",S58,S59))","v":"75-4-FENP"},"P"]
[null,"19ème",null,"P",{"$f":"IF(G9=\"\",\"\",IF(G9=\"p\",H9,H24))","v":"75-4-FENP"},{"$f":"IF(G9=\"\",\"\",IF(G9=\"p\",I9,I24))","v":"DE BAILLIENCOURT"},null,null,null,"V",{"$f":"IF(M59=\"\",\"\",IF(M59=\"v\",N59,N61))","v":"75-4-BLOP"},{"$f":"IF(M59=\"\",\"\",IF(M59=\"v\",O59,O61))","v":"BARBARIT"},null,null,null,null,null,null,null,null,null,null,null,{"$f":"IF(W59=\"\",\"\",IF(W59=\"v\",U59,U61))","v":"CARTOUX"},{"$f":"IF(W59=\"\",\"\",IF(W59=\"v\",V59,V61))","v":"75-2-SUPA"},"V",null,null,null,"Place de 3ème/4ème"]
[null,{"$f":"IF(D60=\"\",\"\",IF(D60=\"v\",E60,E62))","v":"75-4-SMPP"},{"$f":"IF(D60=\"\",\"\",IF(D60=\"v\",F60,F62))","v":"RODET"},null,null,null,null,null,null,null,null,null,"P",{"$f":"IF(T61=\"\",\"\",IF(T61=\"p\",S61,S62))","v":0},{"$f":"IF(T61=\"\",\"\",IF(T61=\"p\",R61,R62))","v":0},null,"4ème poule 7",{"$f":"'Résultats de poule'!J10","v":0},{"$f":"'Résultats de poule'!L10","v":0},"P",{"$f":"IF(T61=\"\",\"\",IF(T61=\"v\",R61,R62))","v":"CARTOUX"},{"$f":"IF(T61=\"\",\"\",IF(T61=\"v\",S61,S62))","v":"75-2-SUPA"},"V",null,null,null,null,null,null,{"$f":"IF(AC10=\"\",\"\",IF(AC10=\"p\",AA10,AA24))","v":"DELAPLACE"},{"$f":"IF(AC10=\"\",\"\",IF(AC10=\"p\",AB10,AB24))","v":"75-4-LMAP"},"V"]
[null,null,null,"V",{"$f":"IF(G41=\"\",\"\",IF(G41=\"p\",H41,H56))","v":"75-4-SMPP"},{"$f":"IF(G41=\"\",\"\",IF(G41=\"p\",I41,I56))","v":"RODET"},null,null,null,null,null,null,null,null,null,null,"1er poule 2",{"$f":"'Résultats de poule'!F2","v":"CARTOUX"},{"$f":"'Résultats de poule'!H2","v":"75-2-SUPA"},"V",null,null,null,null,null,null,null,null,null,null,null,null,{"$f":"IF(AF61=\"\",\"\",IF(AF61=\"v\",AD61,AD63))","v":"DELAPLACE"},{"$f":"IF(AF61=\"\",\"\",IF(AF61=\"v\",AE61,AE63))","v":"75-4-LMAP"}]
[null,null,null,null,null,null,null,null,null,null,null,null,null,null,null,null,null,null,null,null,null,null,null,null,null,null,null,null,null,{"$f":"IF(AC42=\"\",\"\",IF(AC42=\"p\",AA42,AA56))","v":"CARTOUX"},{"$f":"IF(AC42=\"\",\"\",IF(AC42=\"p\",AB42,AB56))","v":"75-2-SUPA"},"P"]
[]
[null,null,null,null,null,null,null,null,null,null,null,null,"V",{"$f":"IF(M5=\"\",\"\",IF(M5=\"p\",N5,N7))","v":0},{"$f":"IF(M5=\"\",\"\",IF(M5=\"p\",O5,O7))","v":0},null,null,{"$f":"IF(W5=\"\",\"\",IF(W5=\"p\",U5,U7))","v":"QUERU"},{"$f":"IF(W5=\"\",\"\",IF(W5=\"p\",V5,V7))","v":"75-4-SMPP"},"P"]
[null,null,null,null,null,null,null,null,null,"P",{"$f":"IF(M65=\"\",\"\",IF(M65=\"v\",N65,N66))","v":0},{"$f":"IF(M65=\"\",\"\",IF(M65=\"v\",O65,O66))","v":0},"P",{"$f":"IF(M12=\"\",\"\",IF(M12=\"p\",N12,N14))","v":0},{"$f":"IF(M12=\"\",\"\",IF(M12=\"p\",O12,O14))","v":0},null,null,{"$f":"IF(W12=\"\",\"\",IF(W12=\"p\",U12,U14))","v":"DUVERNAY"},{"$f":"IF(W12=\"\",\"\",IF(W12=\"p\",V12,V14))","v":"75-4-LMAP"},"V",{"$f":"IF(T65=\"\",\"\",IF(T65=\"v\",R65,R66))","v":"DUVERNAY"},{"$f":"IF(T65=\"\",\"\",IF(T65=\"v\",S65,S66))","v":"75-4-LMAP"},"V"]
[null,null,null,null,null,null,"V",{"$f":"IF(J66=\"\",\"\",IF(J66=\"v\",K66,K68))","v":"75-4-PCHP"},{"$f":"IF(J66=\"\",\"\",IF(J66=\"v\",L66,L68))","v":"RAZAFINOMBANA"},null,null,null,null,null,null,null,null,null,null,null,null,null,null,{"$f":"IF(W66=\"\",\"\",IF(W66=\"v\",U66,U68))","v":"DUVERNAY"},{"$f":"IF(W66=\"\",\"\",IF(W66=\"v\",V66,V68))","v":"75-4-LMAP"},"P"]
[null,null,null,null,null,null,null,null,null,"V",{"$f":"IF(M68=\"\",\"\",IF(M68=\"v\",N68,N69))","v":"75-4-PCHP"},{"$f":"IF(M68=\"\",\"\",IF(M68=\"v\",O68,O69))","v":"RAZAFINOMBANA"},"P",{"$f":"IF(M20=\"\",\"\",IF(M20=\"p\",N20,N22))","v":0},{"$f":"IF(M20=\"\",\"\",IF(M20=\"p\",O20,O22))","v":0},null,null,{"$f":"IF(W20=\"\",\"\",IF(W20=\"p\",U20,U22))","v":"VETSCH"},{"$f":"IF(W20=\"\",\"\",IF(W20=\"p\",V20,V22))","v":"75-4-BLOP"},"P",{"$f":"IF(T68=\"\",\"\",IF(T68=\"v\",R68,R69))","v":"HALES"},{"$f":"IF(T68=\"\",\"\",IF(T68=\"v\",S68,S69))","v":"75-4-LMAP"},"P"]
[null,null,null,null,"25ème",null,null,null,null,null,null,null,"V",{"$f":"IF(M27=\"\",\"\",IF(M27=\"p\",N27,N29))","v":"75-4-PCHP"},{"$f":"IF(M27=\"\",\"\",IF(M27=\"p\",O27,O29))","v":"RAZAFINOMBANA"},null,null,{"$f":"IF(W27=\"\",\"\",IF(W27=\"p\",U27,U29))","v":"HALES"},{"$f":"IF(W27=\"\",\"\",IF(W27=\"p\",V27,V29))","v":"75-4-LMAP"},"V",null,null,null,null,null,null,null,"9ème"]
[null,null,null,null,{"$f":"IF(G67=\"\",\"\",IF(G67=\"v\",H67,H73))","v":"75-4-PCHP"},{"$f":"IF(G67=\"\",\"\",IF(G67=\"v\",I67,I73))","v":"RAZAFINOMBANA"},null,null,null,null,null,null,null,null,null,null,null,null,null,null,null,null,null,null,null,null,{"$f":"IF(Z67=\"\",\"\",IF(Z67=\"v\",X67,X73))","v":"PICARLE"},{"$f":"IF(Z67=\"\",\"\",IF(Z67=\"v\",Y67,Y73))","v":"75-4-FENP"}]
[null,null,null,null,null,null,null,null,null,null,null,null,"P",{"$f":"IF(M37=\"\",\"\",IF(M37=\"p\",N37,N39))","v":0},{"$f":"IF(M37=\"\",\"\",IF(M37=\"p\",O37,O39))","v":0},null,null,{"$f":"IF(W37=\"\",\"\",IF(W37=\"p\",U37,U39))","v":"GILBERT"},{"$f":"IF(W37=\"\",\"\",IF(W37=\"p\",V37,V39))","v":"75-4-PCHP"},"P"]
[null,null,null,null,null,null,null,null,null,null,{"$f":"IF(M71=\"\",\"\",IF(M71=\"v\",N71,N72))","v":0},{"$f":"IF(M71=\"\",\"\",IF(M71=\"v\",O71,O72))","v":0},"V",{"$f":"IF(M44=\"\",\"\",IF(M44=\"p\",N44,N46))","v":0},{"$f":"IF(M44=\"\",\"\",IF(M44=\"p\",O44,O46))","v":0},null,null,{"$f":"IF(W44=\"\",\"\",IF(W44=\"p\",U44,U46))","v":"HARTOG"},{"$f":"IF(W44=\"\",\"\",IF(W44=\"p\",V44,V46))","v":"75-4-STAP"},"V",{"$f":"IF(T71=\"\",\"\",IF(T71=\"v\",R71,R72))","v":"HARTOG"},{"$f":"IF(T71=\"\",\"\",IF(T71=\"v\",S71,S72))","v":"75-4-STAP"},"P"]
[null,null,null,null,null,null,"P",{"$f":"IF(J72=\"\",\"\",IF(J72=\"v\",K72,K74))","v":""},{"$f":"IF(J72=\"\",\"\",IF(J72=\"v\",L72,L74))","v":""},null,null,null,null,null,null,null,null,null,null,null,null,null,null,{"$f":"IF(W72=\"\",\"\",IF(W72=\"v\",U72,U74))","v":"PICARLE"},{"$f":"IF(W72=\"\",\"\",IF(W72=\"v\",V72,V74))","v":"75-4-FENP"},"V"]
[null,null,null,null,null,null,null,null,null,null,{"$f":"IF(M74=\"\",\"\",IF(M74=\"v\",N74,N75))","v":0},{"$f":"IF(M74=\"\",\"\",IF(M74=\"v\",O74,O75))","v":0},"P",{"$f":"IF(M52=\"\",\"\",IF(M52=\"p\",N52,N54))","v":0},{"$f":"IF(M52=\"\",\"\",IF(M52=\"p\",O52,O54))","v":0},null,null,{"$f":"IF(W52=\"\",\"\",IF(W52=\"p\",U52,U54))","v":"DIOP"},{"$f":"IF(W52=\"\",\"\",IF(W52=\"p\",V52,V54))","v":"75-4-LMAP"},"P",{"$f":"IF(T74=\"\",\"\",IF(T74=\"v\",R74,R75))","v":"PICARLE"},{"$f":"IF(T74=\"\",\"\",IF(T74=\"v\",S74,S75))","v":"75-4-FENP"},"V"]
[null,null,null,null,null,null,null,null,null,null,null,null,"V",{"$f":"IF(M59=\"\",\"\",IF(M59=\"p\",N59,N61))","v":0},{"$f":"IF(M59=\"\",\"\",IF(M59=\"p\",O59,O61))","v":0},null,null,{"$f":"IF(W59=\"\",\"\",IF(W59=\"p\",U59,U61))","v":"PICARLE"},{"$f":"IF(W59=\"\",\"\",IF(W59=\"p\",V59,V61))","v":"75-4-FENP"},"V",null,null,null,null,null,null,{"$f":"IF(Z6=\"\",\"\",IF(Z6=\"p\",X6,X13))","v":"LALANNE"},{"$f":"IF(Z6=\"\",\"\",IF(Z6=\"p\",Y6,Y13))","v":"75-2-SUPA"},"V"]
[null,null,null,null,null,null,null,null,null,null,null,null,null,null,null,null,null,null,null,null,null,null,null,null,null,null,null,null,null,{"$f":"IF(AC75=\"\",\"\",IF(AC75=\"v\",AA75,AA77))","v":"LALANNE"},{"$f":"IF(AC75=\"\",\"\",IF(AC75=\"v\",AB75,AB77))","v":"75-2-SUPA"},"V"]
[null,null,null,null,null,null,null,null,null,null,null,null,"V",{"$f":"IF(M65=\"\",\"\",IF(M65=\"p\",N65,N66))","v":0},{"$f":"IF(M65=\"\",\"\",IF(M65=\"p\",O65,O66))","v":0},null,null,{"$f":"IF(T65=\"\",\"\",IF(T65=\"p\",R65,R66))","v":"QUERU"},{"$f":"IF(T65=\"\",\"\",IF(T65=\"p\",S65,S66))","v":"75-4-SMPP"},"V",null,null,null,null,null,null,{"$f":"IF(Z21=\"\",\"\",IF(Z21=\"p\",X21,X28))","v":"DELPECH"},{"$f":"IF(Z21=\"\",\"\",IF(Z21=\"p\",Y21,Y28))","v":"75-4-LMAP"},"P"]
[null,null,null,null,null,null,null,"29ème",null,"P",{"$f":"IF(M77=\"\",\"\",IF(M77=\"v\",N77,N78))","v":0},{"$f":"IF(M77=\"\",\"\",IF(M77=\"v\",O77,O78))","v":0},"P",{"$f":"IF(M68=\"\",\"\",IF(M68=\"p\",N68,N69))","v":0},{"$f":"IF(M68=\"\",\"\",IF(M68=\"p\",O68,O69))","v":0},null,null,{"$f":"IF(T68=\"\",\"\",IF(T68=\"p\",R68,R69))","v":"VETSCH"},{"$f":"IF(T68=\"\",\"\",IF(T68=\"p\",S68,S69))","v":"75-4-BLOP"},"P",{"$f":"IF(T77=\"\",\"\",IF(T77=\"v\",R77,R78))","v":"QUERU"},{"$f":"IF(T77=\"\",\"\",IF(T77=\"v\",S77,S78))","v":"75-4-SMPP"},"V",null,"13ème",null,null,null,null,null,null,null,null,"5ème"]
[null,null,null,null,null,null,null,{"$f":"IF(J78=\"\",\"\",IF(J78=\"v\",K78,K80))","v":0},{"$f":"IF(J78=\"\",\"\",IF(J78=\"v\",L78,L80))","v":0},null,null,null,null,null,null,null,null,null,null,null,null,null,null,{"$f":"IF(W78=\"\",\"\",IF(W78=\"v\",U78,U80))","v":"QUERU"},{"$f":"IF(W78=\"\",\"\",IF(W78=\"v\",V78,V80))","v":"75-4-SMPP"},null,null,null,null,null,null,null,{"$f":"IF(AF76=\"\",\"\",IF(AF76=\"v\",AD76,AD82))","v":"LALANNE"},{"$f":"IF(AF76=\"\",\"\",IF(AF76=\"v\",AE76,AE82))","v":"75-2-SUPA"}]
[null,null,null,null,null,null,null,null,null,"V",{"$f":"IF(M80=\"\",\"\",IF(M80=\"v\",N80,N81))","v":0},{"$f":"IF(M80=\"\",\"\",IF(M80=\"v\",O80,O81))","v":0},"P",{"$f":"IF(M71=\"\",\"\",IF(M71=\"p\",N71,N72))","v":0},{"$f":"IF(M71=\"\",\"\",IF(M71=\"p\",O71,O72))","v":0},null,null,{"$f":"IF(T71=\"\",\"\",IF(T71=\"p\",R71,R72))","v":"GILBERT"},{"$f":"IF(T71=\"\",\"\",IF(T71=\"p\",S71,S72))","v":"75-4-PCHP"},"P",{"$f":"IF(T80=\"\",\"\",IF(T80=\"v\",R80,R81))","v":"DIOP"},{"$f":"IF(T80=\"\",\"\",IF(T80=\"v\",S80,S81))","v":"75-4-LMAP"},"P"]
[null,null,null,null,null,null,null,null,null,null,null,null,"V",{"$f":"IF(M74=\"\",\"\",IF(M74=\"p\",N74,N75))","v":0},{"$f":"IF(M74=\"\",\"\",IF(M74=\"p\",O74,O75))","v":0},null,null,{"$f":"IF(T74=\"\",\"\",IF(T74=\"p\",R74,R75))","v":"DIOP"},{"$f":"IF(T74=\"\",\"\",IF(T74=\"p\",S74,S75))","v":"75-4-LMAP"},"V",null,null,null,null,null,null,{"$f":"IF(Z38=\"\",\"\",IF(Z38=\"p\",X38,X45))","v":"ROCHET"},{"$f":"IF(Z38=\"\",\"\",IF(Z38=\"p\",Y38,Y45))","v":"75-4-BLOP"},"V"]
[null,null,null,null,null,null,null,null,null,null,"27ème",null,null,null,null,null,null,null,null,null,null,"11ème",null,null,null,null,null,null,null,{"$f":"IF(AC81=\"\",\"\",IF(AC81=\"v\",AA81,AA83))","v":"ROCHET"},{"$f":"IF(AC81=\"\",\"\",IF(AC81=\"v\",AB81,AB83))","v":"75-4-BLOP"},"P"]
[null,null,null,null,null,null,null,null,null,null,{"$f":"IF(M83=\"\",\"\",IF(M83=\"v\",N83,N84))","v":""},{"$f":"IF(M83=\"\",\"\",IF(M83=\"v\",O83,O84))","v":""},"P",{"$f":"IF(J66=\"\",\"\",IF(J66=\"p\",K66,K68))","v":0},{"$f":"IF(J66=\"\",\"\",IF(J66=\"p\",L66,L68))","v":0},null,null,{"$f":"IF(W66=\"\",\"\",IF(W66=\"p\",U66,U68))","v":"HALES"},{"$f":"IF(W66=\"\",\"\",IF(W66=\"p\",V66,V68))","v":"75-4-LMAP"},"P",{"$f":"IF(T83=\"\",\"\",IF(T83=\"v\",R83,R84))","v":"HARTOG"},{"$f":"IF(T83=\"\",\"\",IF(T83=\"v\",S83,S84))","v":"75-4-STAP"},null,null,null,null,{"$f":"IF(Z53=\"\",\"\",IF(Z53=\"p\",X53,X60))","v":"THIBAULT"},{"$f":"IF(Z53=\"\",\"\",IF(Z53=\"p\",Y53,Y60))","v":"75-4-LMAP"},"P"]
[null,null,null,null,null,null,null,null,null,null,null,null,"V",{"$f":"IF(J72=\"\",\"\",IF(J72=\"p\",K72,K74))","v":""},{"$f":"IF(J72=\"\",\"\",IF(J72=\"p\",L72,L74))","v":""},null,null,{"$f":"IF(W72=\"\",\"\",IF(W72=\"p\",U72,U74))","v":"HARTOG"},{"$f":"IF(W72=\"\",\"\",IF(W72=\"p\",V72,V74))","v":"75-4-STAP"},"V"]
[null,null,null,null,null,null,"V",{"$f":"IF(J6=\"\",\"\",IF(J6=\"p\",K6,K13))","v":"75-4-SMPP"},{"$f":"IF(J6=\"\",\"\",IF(J6=\"p\",L6,L13))","v":"LIU"},null,null,null,null,null,null,null,null,null,null,null,null,null,null,null,null,null,{"$f":"IF(AC75=\"\",\"\",IF(AC75=\"p\",AA75,AA77))","v":"DELPECH"},{"$f":"IF(AC75=\"\",\"\",IF(AC75=\"p\",AB75,AB77))","v":"75-4-LMAP"},"V",null,"7ème"]
[null,"21ème",null,"V",{"$f":"IF(G85=\"\",\"\",IF(G85=\"v\",H85,H86))","v":"75-4-SMPP"},{"$f":"IF(G85=\"\",\"\",IF(G85=\"v\",I85,I86))","v":"LIU"},"P",{"$f":"IF(J21=\"\",\"\",IF(J21=\"p\",K21,K28))","v":"75-4-BLOP"},{"$f":"IF(J21=\"\",\"\",IF(J21=\"p\",L21,L28))","v":"VEZIN"},null,"31ème",null,null,null,null,null,null,null,null,null,null,"15ème",null,null,null,null,null,null,null,{"$f":"IF(AC85=\"\",\"\",IF(AC85=\"v\",AA85,AA87))","v":"DELPECH"},{"$f":"IF(AC85=\"\",\"\",IF(AC85=\"v\",AB85,AB87))","v":"75-4-LMAP"}]
[null,{"$f":"IF(D86=\"\",\"\",IF(D86=\"v\",E86,E88))","v":"75-4-SMPP"},{"$f":"IF(D86=\"\",\"\",IF(D86=\"v\",F86,F88))","v":"LIU"},null,null,null,null,null,null,null,{"$f":"IF(M87=\"\",\"\",IF(M87=\"v\",N87,N88))","v":0},{"$f":"IF(M87=\"\",\"\",IF(M87=\"v\",O87,O88))","v":0},"V",{"$f":"IF(M77=\"\",\"\",IF(M77=\"p\",N77,N78))","v":0},{"$f":"IF(M77=\"\",\"\",IF(M77=\"p\",O77,O78))","v":0},null,null,{"$f":"IF(T77=\"\",\"\",IF(T77=\"p\",R77,R78))","v":"VETSCH"},{"$f":"IF(T77=\"\",\"\",IF(T77=\"p\",S77,S78))","v":"75-4-BLOP"},"V",{"$f":"IF(T87=\"\",\"\",IF(T87=\"v\",R87,R88))","v":"VETSCH"},{"$f":"IF(T87=\"\",\"\",IF(T87=\"v\",S87,S88))","v":"75-4-BLOP"},null,null,null,null,{"$f":"IF(AC81=\"\",\"\",IF(AC81=\"p\",AA81,AA83))","v":"THIBAULT"},{"$f":"IF(AC81=\"\",\"\",IF(AC81=\"p\",AB81,AB83))","v":"75-4-LMAP"},"P"]
[null,null,null,"P",{"$f":"IF(G88=\"\",\"\",IF(G88=\"v\",H88,H89))","v":0},{"$f":"IF(G88=\"\",\"\",IF(G88=\"v\",I88,I89))","v":0},"V",{"$f":"IF(J38=\"\",\"\",IF(J38=\"p\",K38,K45))","v":0},{"$f":"IF(J38=\"\",\"\",IF(J38=\"p\",L38,L45))","v":0},null,null,null,"P",{"$f":"IF(M80=\"\",\"\",IF(M80=\"p\",N80,N81))","v":0},{"$f":"IF(M80=\"\",\"\",IF(M80=\"p\",O80,O81))","v":0},null,null,{"$f":"IF(T80=\"\",\"\",IF(T80=\"p\",R80,R81))","v":"GILBERT"},{"$f":"IF(T80=\"\",\"\",IF(T80=\"p\",S80,S81))","v":"75-4-PCHP"},"P"]
[null,null,null,null,null,null,"P",{"$f":"IF(J53=\"\",\"\",IF(J53=\"p\",K53,K60))","v":0},{"$f":"IF(J53=\"\",\"\",IF(J53=\"p\",L53,L60))","v":0}]
[null,"23ème"]
[null,{"$f":"IF(D91=\"\",\"\",IF(D91=\"v\",E91,E92))","v":"75-4-BLOP"},{"$f":"IF(D91=\"\",\"\",IF(D91=\"v\",F91,F92))","v":"VEZIN"},"V",{"$f":"IF(G85=\"\",\"\",IF(G85=\"p\",H85,H86))","v":"75-4-BLOP"},{"$f":"IF(G85=\"\",\"\",IF(G85=\"p\",I85,I86))","v":"VEZIN"}]
[null,null,null,"P",{"$f":"IF(G88=\"\",\"\",IF(G88=\"p\",H88,H89))","v":0},{"$f":"IF(G88=\"\",\"\",IF(G88=\"p\",I88,I89))","v":0}]

{"sheet":"Classement","index":11,"n_rows":35,"n_cols":4,"rows_kept":35,"cut":false,"hidden":false,"merged":[[1,0,1,2],[0,0,0,2]]}
[{"$f":"IF(Engagés!A1=\"\",\"\",Engagés!A1)","v":"FINALES Comité de Paris "}]
[{"$f":"IF(Engagés!E3=\"\",\"\",Engagés!E3)","v":"BF Promo"}]
["CLASSEMENT","NOMS","Etablissement"]
["1er",{"$f":"Tableau!AG32","v":"GUILLEMAIN BARANDE"},{"$f":"Tableau!AH32","v":"75-4-LMAP"},"Q"]
["2ème",{"$f":"IF(Tableau!$AF$17=\"\",\"\",IF(Tableau!$AF$17=\"p\",Tableau!$AD$17,Tableau!$AD$49))","v":"MUNIER"},{"$f":"IF(Tableau!$AF$17=\"\",\"\",IF(Tableau!$AF$17=\"p\",Tableau!$AE$17,Tableau!$AE$49))","v":"75-4-PCHP"},"Q"]
["3ème",{"$f":"Tableau!AG62","v":"DELAPLACE"},{"$f":"Tableau!AH62","v":"75-4-LMAP"},"Q"]
["4ème",{"$f":"IF(Tableau!AF61=\"\",\"\",IF(Tableau!$AF$61=\"p\",Tableau!$AD$61,Tableau!$AD$63))","v":"CARTOUX"},{"$f":"IF(Tableau!AF61=\"\",\"\",IF(Tableau!$AF$61=\"p\",Tableau!$AE$61,Tableau!$AE$63))","v":"75-2-SUPA"},"Q"]
["5ème",{"$f":"Tableau!AG79","v":"LALANNE"},{"$f":"Tableau!AH79","v":"75-2-SUPA"},"Q"]
["6ème",{"$f":"IF(Tableau!AF76=\"\",\"\",IF(Tableau!$AF$76=\"p\",Tableau!$AD$76,Tableau!$AD$82))","v":"ROCHET"},"75-4-BLOP","Q"]
["7ème",{"$f":"Tableau!AD86","v":"DELPECH"},{"$f":"Tableau!AE86","v":"75-4-LMAP"},"Q"]
["8ème",{"$f":"IF(Tableau!$AC$85=\"\",\"\",IF(Tableau!$AC$85=\"p\",Tableau!$AA$85,Tableau!$AA$87))","v":"THIBAULT"},{"$f":"IF(Tableau!$AC$85=\"\",\"\",IF(Tableau!$AC$85=\"p\",Tableau!$AB$85,Tableau!$AB$87))","v":"75-4-LMAP"},"Q"]
["9ème",{"$f":"Tableau!AA70","v":"PICARLE"},{"$f":"Tableau!Y73","v":"75-4-FENP"},"R1"]
["10ème",{"$f":"IF(Tableau!$Z$67=\"\",\"\",IF(Tableau!$Z$67=\"p\",Tableau!$X$67,Tableau!$X$73))","v":"DUVERNAY"},{"$f":"IF(Tableau!$Z$67=\"\",\"\",IF(Tableau!$Z$67=\"p\",Tableau!$Y$67,Tableau!$Y$73))","v":"75-4-LMAP"},"R2"]
["11ème",{"$f":"Tableau!U83","v":"HARTOG"},{"$f":"Tableau!V83","v":"75-4-STAP"}]
["12ème",{"$f":"IF(Tableau!$T$83=\"\",\"\",IF(Tableau!$T$83=\"p\",Tableau!$R$83,Tableau!$R$84))","v":"HALES"},{"$f":"IF(Tableau!$T$83=\"\",\"\",IF(Tableau!$T$83=\"p\",Tableau!$S$83,Tableau!$S$84))","v":"75-4-LMAP"}]
["13ème",{"$f":"Tableau!X79","v":"QUERU"},{"$f":"Tableau!Y79","v":"75-4-SMPP"}]
["14ème",{"$f":"IF(Tableau!$W$78=\"\",\"\",IF(Tableau!$W$78=\"p\",Tableau!$U$78,Tableau!$U$80))","v":"DIOP"},{"$f":"IF(Tableau!$W$78=\"\",\"\",IF(Tableau!$W$78=\"p\",Tableau!$V$78,Tableau!$V$80))","v":"75-4-LMAP"}]
["15ème",{"$f":"Tableau!U87","v":"VETSCH"},{"$f":"Tableau!V87","v":"75-4-BLOP"}]
["16ème",{"$f":"IF(Tableau!$T$87=\"\",\"\",IF(Tableau!$T$87=\"p\",Tableau!$R$87,Tableau!$R$88))","v":"GILBERT"},{"$f":"IF(Tableau!$T$87=\"\",\"\",IF(Tableau!$T$87=\"p\",Tableau!$S$87,Tableau!$S$88))","v":"75-4-PCHP"}]
["17ème",{"$f":"Tableau!C32","v":"KOHLER"},{"$f":"Tableau!B32","v":"75-2-SLHP"}]
["18ème",{"$f":"IF(Tableau!$D$16=\"\",\"\",IF(Tableau!$D$16=\"p\",Tableau!$F$16,Tableau!$F$48))","v":"BARBARIT"},{"$f":"IF(Tableau!$D$16=\"\",\"\",IF(Tableau!$D$16=\"p\",Tableau!$E$16,Tableau!$E$48))","v":"75-4-BLOP"}]
["19ème",{"$f":"Tableau!C61","v":"RODET"},{"$f":"Tableau!B61","v":"75-4-SMPP"}]
["20ème",{"$f":"IF(Tableau!D60=\"\",\"\",IF(Tableau!$D$60=\"p\",Tableau!$F$60,Tableau!$F$62))","v":"DE BAILLIENCOURT"},{"$f":"IF(Tableau!D60=\"\",\"\",IF(Tableau!$D$60=\"p\",Tableau!$E$60,Tableau!$E$62))","v":"75-4-FENP"}]
["21ème",{"$f":"Tableau!C87","v":"LIU"},{"$f":"Tableau!B87","v":"75-4-SMPP"}]
["22ème",{"$f":"IF(Tableau!$D$86=\"\",\"\",IF(Tableau!$D$86=\"p\",Tableau!$F$86,Tableau!$F$88))","v":0},{"$f":"IF(Tableau!$D$86=\"\",\"\",IF(Tableau!$D$86=\"p\",Tableau!$E$86,Tableau!$E$88))","v":0}]
["23ème",{"$f":"Tableau!C91","v":"VEZIN"},{"$f":"Tableau!B91","v":"75-4-BLOP"}]
["24ème",{"$f":"IF(Tableau!$D$91=\"\",\"\",IF(Tableau!$D$91=\"p\",Tableau!$F$91,Tableau!$F$92))","v":0},{"$f":"IF(Tableau!$D$91=\"\",\"\",IF(Tableau!$D$91=\"p\",Tableau!$E$91,Tableau!$E$92))","v":0}]
["25ème",{"$f":"Tableau!F70","v":"RAZAFINOMBANA"},{"$f":"Tableau!E70","v":"75-4-PCHP"}]
["26ème",{"$f":"IF(Tableau!$G$67=\"\",\"\",IF(Tableau!$G$67=\"p\",Tableau!$I$67,Tableau!$I$73))","v":""},{"$f":"IF(Tableau!$G$67=\"\",\"\",IF(Tableau!$G$67=\"p\",Tableau!$H$73,Tableau!$H$67))","v":"75-4-PCHP"}]
["27ème",{"$f":"Tableau!L83","v":""},{"$f":"Tableau!K83","v":""}]
["28ème",{"$f":"IF(Tableau!$M$83=\"\",\"\",IF(Tableau!$M$83=\"p\",Tableau!$O$83,Tableau!$O$84))","v":0},{"$f":"IF(Tableau!$M$83=\"\",\"\",IF(Tableau!$M$83=\"p\",Tableau!$N$83,Tableau!$N$84))","v":0}]
["29ème",{"$f":"Tableau!I79","v":0},{"$f":"Tableau!H79","v":0}]
["30ème",{"$f":"IF(Tableau!$J$78=\"\",\"\",IF(Tableau!$J$78=\"p\",Tableau!$L$78,Tableau!$L$80))","v":0},{"$f":"IF(Tableau!$J$78=\"\",\"\",IF(Tableau!$J$78=\"p\",Tableau!$K$78,Tableau!$K$80))","v":0}]
["31ème",{"$f":"Tableau!L87","v":0},{"$f":"Tableau!K87","v":0}]
["32ème",{"$f":"IF(Tableau!$M$87=\"\",\"\",IF(Tableau!$M$87=\"p\",Tableau!$O$87,Tableau!$O$88))","v":0},{"$f":"IF(Tableau!$M$87=\"\",\"\",IF(Tableau!$M$87=\"p\",Tableau!$N$87,Tableau!$N$88))","v":0}]

{"sheet":"Feuille de match","index":12,"n_rows":49,"n_cols":10,"rows_kept":49,"cut":false,"hidden":false,"merged":[[48,0,49,0],[48,1,49,3],[48,6,49,6],[48,7,49,9],[41,0,41,1],[41,3,41,4],[41,6,41,7],[41,9,41,10],[42,0,42,1],[42,3,42,4],[42,6,42,7],[42,9,42,10],[34,1,34,3],[34,7,34,9],[35,2,47,2],[35,8,47,8],[36,0,36,1],[36,3,36,4],[36,6,36,7],[36,9,36,10],[38,0,38,1],[38,3,38,4],[38,6,38,7],[38,9,38,10],[39,0,39,1],[39,3,39,4],[39,6,39,7],[39,9,39,10],[25,0,25,1],[25,3,25,4],[25,6,25,7],[25,9,25,10],[31,0,32,0],[31,1,32,3],[31,6,32,6],[31,7,32,9],[22,0,22,1],[22,3,22,4],[22,6,22,7],[22,9,22,10],[24,0,24,1],[24,3,24,4],[24,6,24,7],[24,9,24,10],[18,2,30,2],[18,8,30,8],[19,0,19,1],[19,3,19,4],[19,6,19,7],[19,9,19,10],[21,0,21,1],[21,3,21,4],[21,6,21,7],[21,9,21,10],[14,0,15,0],[14,1,15,3],[14,6,15,6],[14,7,15,9],[17,1,17,3],[17,7,17,9],[7,0,7,1],[7,3,7,4],[7,6,7,7],[7,9,7,10],[8,0,8,1],[8,3,8,4],[8,6,8,7],[8,9,8,10],[0,0,0,3],[0,7,0,9],[1,2,13,2],[1,8,13,8],[2,0,2,1],[2,3,2,4],[2,6,2,7],[2,9,2,10],[4,0,4,1],[4,3,4,4],[4,6,4,7],[4,9,4,10],[5,0,5,1],[5,3,5,4],[5,6,5,7],[5,9,5,10]]}
["Tennis de Table",null,null,null,{"$f":"Engagés!$E$3","v":"BF Promo"},null,null,"Tennis de Table"]
[]
["Catégorie",null,null,{"$f":"Engagés!$E$3","v":"BF Promo"},null,null,"Catégorie",null,null,{"$f":"Engagés!$E$3","v":"BF Promo"}]
[]
["NOM",null,null,"NOM",null,null,"NOM",null,null,"NOM"]
[]
[]
["SIGLE",null,null,"SIGLE",null,null,"SIGLE",null,null,"SIGLE"]
[]
[]
["1er set",null,null,null,null,null,"1er set"]
["2ème set",null,null,null,null,null,"2ème set"]
["3ème set",null,null,null,null,null,"3ème set"]
[]
["Vainqueur",null,null,null,null,null,"Vainqueur"]
[]
[]
[null,"Tennis de Table",null,null,null,null,null,"Tennis de Table"]
[]
["Catégorie",null,null,{"$f":"Engagés!$E$3","v":"BF Promo"},null,null,"Catégorie",null,null,{"$f":"Engagés!$E$3","v":"BF Promo"}]
[]
["NOM",null,null,"NOM",null,null,"NOM",null,null,"NOM"]
[]
[]
["SIGLE",null,null,"SIGLE",null,null,"SIGLE",null,null,"SIGLE"]
[]
[]
["1er set",null,null,null,null,null,"1er set"]
["2ème set",null,null,null,null,null,"2ème set"]
["3ème set",null,null,null,null,null,"3ème set"]
[]
["Vainqueur",null,null,null,null,null,"Vainqueur"]
[]
[]
[null,"Tennis de Table",null,null,null,null,null,"Tennis de Table"]
[]
["Catégorie",null,null,{"$f":"Engagés!$E$3","v":"BF Promo"},null,null,"Catégorie",null,null,{"$f":"Engagés!$E$3","v":"BF Promo"}]
[]
["NOM",null,null,"NOM",null,null,"NOM",null,null,"NOM"]
[]
[]
["SIGLE",null,null,"SIGLE",null,null,"SIGLE",null,null,"SIGLE"]
[]
[]
["1er set",null,null,null,null,null,"1er set"]
["2ème set",null,null,null,null,null,"2ème set"]
["3ème set",null,null,null,null,null,"3ème set"]
[]
["Vainqueur",null,null,null,null,null,"Vainqueur"]

{"sheet":"Feuilles","index":13,"n_rows":37,"n_cols":13,"rows_kept":37,"cut":false,"hidden":false,"merged":[[2,0,2,1],[37,0,38,5],[6,0,6,5],[26,0,26,5],[36,0,36,5],[37,7,38,12],[25,0,25,1],[22,0,22,1],[24,0,24,1],[7,0,8,5],[12,0,12,1],[16,0,16,5],[27,0,28,5],[15,0,15,1],[15,7,15,8],[7,7,8,12],[12,7,12,8],[13,0,13,1],[13,7,13,8],[14,0,14,1],[14,7,14,8],[0,4,0,5],[0,0,0,3],[0,7,0,10],[0,11,0,12],[10,0,10,3],[10,4,10,5],[10,7,10,10],[10,11,10,12],[2,7,2,8],[3,7,3,8],[4,7,4,8],[5,7,5,8],[6,7,6,12],[4,0,4,1],[5,0,5,1],[3,0,3,1],[26,7,26,12],[16,7,16,12],[17,0,18,5],[17,7,18,12],[20,0,20,3],[20,4,20,5],[20,7,20,10],[20,11,20,12],[22,7,22,8],[23,0,23,1],[23,7,23,8],[24,7,24,8],[25,7,25,8],[36,7,36,12],[27,7,28,12],[30,0,30,3],[30,4,30,5],[30,7,30,10],[30,11,30,12],[32,0,32,1],[32,7,32,8],[33,0,33,1],[33,7,33,8],[34,0,34,1],[34,7,34,8],[35,0,35,1],[35,7,35,8]]}
["Tennis de Table",null,null,null,{"$f":"Engagés!$E$3","v":"BF Promo"},null,null,"Tennis de Table",null,null,null,{"$f":"Engagés!$E$3","v":"BF Promo"}]
[]
["JOUEUR 1",null,"SIGLE","SET 1","SET 2","SET 3",null,"JOUEUR 1",null,"SIGLE","SET 1","SET 2","SET 3"]
[]
["JOUEUR 2",null,"SIGLE","SET 1","SET 2","SET 3",null,"JOUEUR 2",null,"SIGLE","SET 1","SET 2","SET 3"]
[]
["Vainqueur",null,null,null,null,null,null,"Vainqueur"]
[]
[]
[]
["Tennis de Table",null,null,null,{"$f":"Engagés!$E$3","v":"BF Promo"},null,null,"Tennis de Table",null,null,null,{"$f":"Engagés!$E$3","v":"BF Promo"}]
[]
["JOUEUR 1",null,"SIGLE","SET 1","SET 2","SET 3",null,"JOUEUR 1",null,"SIGLE","SET 1","SET 2","SET 3"]
[]
["JOUEUR 2",null,"SIGLE","SET 1","SET 2","SET 3",null,"JOUEUR 2",null,"SIGLE","SET 1","SET 2","SET 3"]
[]
["Vainqueur",null,null,null,null,null,null,"Vainqueur"]
[]
[]
[]
["Tennis de Table",null,null,null,{"$f":"Engagés!$E$3","v":"BF Promo"},null,null,"Tennis de Table",null,null,null,{"$f":"Engagés!$E$3","v":"BF Promo"}]
[]
["JOUEUR 1",null,"SIGLE","SET 1","SET 2","SET 3",null,"JOUEUR 1",null,"SIGLE","SET 1","SET 2","SET 3"]
[]
["JOUEUR 2",null,"SIGLE","SET 1","SET 2","SET 3",null,"JOUEUR 2",null,"SIGLE","SET 1","SET 2","SET 3"]
[]
["Vainqueur",null,null,null,null,null,null,"Vainqueur"]
[]
[]
[]
["Tennis de Table",null,null,null,{"$f":"Engagés!$E$3","v":"BF Promo"},null,null,"Tennis de Table",null,null,null,{"$f":"Engagés!$E$3","v":"BF Promo"}]
[]
["JOUEUR 1",null,"SIGLE","SET 1","SET 2","SET 3",null,"JOUEUR 1",null,"SIGLE","SET 1","SET 2","SET 3"]
[]
["JOUEUR 2",null,"SIGLE","SET 1","SET 2","SET 3",null,"JOUEUR 2",null,"SIGLE","SET 1","SET 2","SET 3"]
[]
["Vainqueur",null,null,null,null,null,null,"Vainqueur"]