{"text_format":"1","workbook":"xlsx","n_sheets":12,"sheets":["Engagés","Poule 1","Poule 2","Poule 3","Poule 4","Poule 5","Poule 6","Poule 7","Poule 8","Résultats de poule","Tableau","Tableau perdants"],"not_rendered":{"charts":0,"images":3,"macros":1,"external_links":0,"defined_names":1,"comments":0,"pivot_tables":0},"unopened":[],"bounds":{"document_bytes":16777216,"sheet_cells":100000,"rows_first":2000,"rows_last":500,"rows_between":2000,"halvings":0,"cell_chars":16384,"cell_head_chars":4096},"cells_cut":0,"cells_raw":0,"read":"whole","date_system":"1900"}

{"sheet":"Engagés","index":0,"n_rows":37,"n_cols":15,"rows_kept":37,"cut":false,"hidden":false,"merged":[[19,7,19,10],[19,11,19,14],[26,7,26,10],[26,11,26,14],[5,11,5,14],[12,11,12,14],[0,0,2,2],[0,4,0,5],[1,4,1,5],[2,4,2,5],[5,7,5,10],[12,7,12,10]]}
["Rencontre Mixte Equipe TT",null,null,"DATE :","2023-11-29"]
[null,null,null,"LIEU :","Stanislas"]
[null,null,null,"CATEGORIE :","Mixte"]
["Tête de série","ETABLISSEMENT","NOM","PRENOM","SIGLE"]
[]
[1,null,"STAN 1","STAN 1","STAN 1",null,null,"Poule 1",null,null,null,"Poule 2"]
[2,null,"ALMA 1","ALMA 1","ALMA 1",null,null,1,{"$f":"VLOOKUP($H7,$A$1:$F$37,3,FALSE)","v":"STAN 1"},{"$f":"VLOOKUP($H7,$A$1:$F$37,4,FALSE)","v":"STAN 1"},{"$f":"VLOOKUP($H7,$A$1:$F$37,5,FALSE)","v":"STAN 1"},2,{"$f":"VLOOKUP($L7,$A$1:$F$37,3,FALSE)","v":"ALMA 1"},{"$f":"VLOOKUP($L7,$A$1:$F$37,4,FALSE)","v":"ALMA 1"},{"$f":"VLOOKUP($L7,$A$1:$F$37,5,FALSE)","v":"ALMA 1"}]
[3,null,"STAN 2","STAN 2","STAN 2",null,null,16,"ALMA 5","ALMA 5","ALMA 5",15,"PCH 3","PCH 3","PCH 3"]
[4,null,"ALMA 2","ALMA 2","ALMA 2",null,null,17,"PCH 5","PCH 5","PCH 5",18,"STAN 6","STAN 6","STAN 6"]
[5,null,"PCH 1","PCH 1","PCH 1",null,null,32,0,0,0,31,0,0,0]
[6,null,"BLOP 1","BLOP 1","BLOP 1"]
[7,null,"STAN 3","STAN 3","STAN 3"]
[8,null,"SLM 1","SLM 1","SLM 1",null,null,"Poule 3",null,null,null,"Poule 4"]
[9,null,"ALMA 3","ALMA 3","ALMA 3",null,null,3,{"$f":"VLOOKUP($H14,$A$1:$F$37,3,FALSE)","v":"STAN 2"},{"$f":"VLOOKUP($H14,$A$1:$F$37,4,FALSE)","v":"STAN 2"},{"$f":"VLOOKUP($H14,$A$1:$F$37,5,FALSE)","v":"STAN 2"},4,{"$f":"VLOOKUP($L14,$A$1:$F$37,3,FALSE)","v":"ALMA 2"},{"$f":"VLOOKUP($L14,$A$1:$F$37,4,FALSE)","v":"ALMA 2"},{"$f":"VLOOKUP($L14,$A$1:$F$37,5,FALSE)","v":"ALMA 2"}]
[10,null,"PCH 2","PCH 2","PCH 2",null,null,14,"BLOP 2","BLOP 2","BLOP 2",13,"STAN 5","STAN 5","STAN 5"]
[12,null,"STAN 4","STAN 4","STAN 4",null,null,19,"ALMA 6","ALMA 6","ALMA 6",20,"PCH 4","PCH 4","PCH 4"]
[11,null,"ALMA 4","ALMA 4","ALMA 4",null,null,30,0,0,0,29,0,0,0]
[14,null,"BLOP 2","BLOP 2","BLOP 2"]
[15,null,"PCH 3","PCH 3","PCH 3"]
[13,null,"STAN 5","STAN 5","STAN 5",null,null,"Poule 5",null,null,null,"Poule 6"]
[16,null,"ALMA 5","ALMA 5","ALMA 5",null,null,5,{"$f":"VLOOKUP($H21,$A$1:$F$37,3,FALSE)","v":"PCH 1"},{"$f":"VLOOKUP($H21,$A$1:$F$37,4,FALSE)","v":"PCH 1"},{"$f":"VLOOKUP($H21,$A$1:$F$37,5,FALSE)","v":"PCH 1"},6,{"$f":"VLOOKUP($L21,$A$1:$F$37,3,FALSE)","v":"BLOP 1"},{"$f":"VLOOKUP($L21,$A$1:$F$37,4,FALSE)","v":"BLOP 1"},{"$f":"VLOOKUP($L21,$A$1:$F$37,5,FALSE)","v":"BLOP 1"}]
[18,null,"STAN 6","STAN 6","STAN 6",null,null,12,"STAN 4","STAN 4","STAN 4",11,"ALMA 4","ALMA 4","ALMA 4"]
[19,null,"ALMA 6","ALMA 6","ALMA 6",null,null,21,"BLOP 3","BLOP 3","BLOP 3",22,"ALMA 7","ALMA 7","ALMA 7"]
[20,null,"PCH 4","PCH 4","PCH 4",null,null,28,"ALMA 10","ALMA 10","ALMA 10",27,0,0,0]
[17,null,"PCH 5","PCH 5","PCH 5"]
[21,null,"BLOP 3","BLOP 3","BLOP 3"]
[22,null,"ALMA 7","ALMA 7","ALMA 7",null,null,"Poule 7",null,null,null,"Poule 8"]
[23,null,"ALMA 9","ALMA 9","ALMA 9",null,null,7,{"$f":"VLOOKUP($H28,$A$1:$F$37,3,FALSE)","v":"STAN 3"},{"$f":"VLOOKUP($H28,$A$1:$F$37,4,FALSE)","v":"STAN 3"},{"$f":"VLOOKUP($H28,$A$1:$F$37,5,FALSE)","v":"STAN 3"},8,{"$f":"VLOOKUP($L28,$A$1:$F$37,3,FALSE)","v":"SLM 1"},{"$f":"VLOOKUP($L28,$A$1:$F$37,4,FALSE)","v":"SLM 1"},{"$f":"VLOOKUP($L28,$A$1:$F$37,5,FALSE)","v":"SLM 1"}]
[24,null,"ALMA 8","ALMA 8","ALMA 8",null,null,10,"PCH 2","PCH 2","PCH 2",9,"ALMA 3","ALMA 3","ALMA 3"]
[25,null,null,null,null,null,null,23,"ALMA 9","ALMA 9","ALMA 9",24,"ALMA 8","ALMA 8","ALMA 8"]
[26,null,null,null,null,null,null,26,0,0,0,25,0,0,0]
[28,null,"ALMA 10","ALMA 10","ALMA 10"]
[27]
[29]
[30]
[31]
[32]

{"sheet":"Poule 1","index":1,"n_rows":24,"n_cols":7,"rows_kept":24,"cut":false,"hidden":false,"merged":[[0,0,0,6],[1,0,1,2],[1,3,1,6],[7,0,7,6],[8,0,8,2],[8,3,8,4],[9,0,9,2],[10,0,10,2],[11,0,11,2],[12,0,12,2],[13,0,13,6],[14,0,14,2],[14,3,14,4],[15,0,15,2],[16,0,16,2],[17,0,17,2],[18,0,18,3],[18,4,18,6],[19,0,19,1],[19,2,19,3],[19,4,19,5],[22,2,22,3],[22,4,22,5],[23,0,23,1],[23,2,23,3],[23,4,23,5],[22,0,22,1],[20,0,20,1],[20,2,20,3],[20,4,20,5],[21,0,21,1],[21,2,21,3],[21,4,21,5]]}
["TENNIS DE TABLE"]
["POULE 1",null,null,"TABLE N°"]
[null,"NOM","Prénom","Sigle","Vict","Def","Classement"]
[1,{"$f":"Engagés!I7","v":"STAN 1"},{"$f":"Engagés!J7","v":"STAN 1"},{"$f":"Engagés!K7","v":"STAN 1"},null,null,"1er"]
[16,{"$f":"Engagés!I8","v":"ALMA 5"},{"$f":"Engagés!J8","v":"ALMA 5"},{"$f":"Engagés!K8","v":"ALMA 5"},null,null,"2ème"]
[17,{"$f":"Engagés!I9","v":"PCH 5"},{"$f":"Engagés!J9","v":"PCH 5"},{"$f":"Engagés!K9","v":"PCH 5"},null,null,"3ème"]
[32,{"$f":"Engagés!I10","v":0},{"$f":"Engagés!J10","v":0},{"$f":"Engagés!K10","v":0},null,null,"4ème"]
["Si poule de 4 joueurs alors…"]
["Déroulement",null,null,"Joueurs A contre Joueur B",null,"Vainqueur","Score"]
["Match 1",null,null,{"$f":"B4","v":"STAN 1"},{"$f":"B7","v":0}]
["Match 2",null,null,"ALMA 5",{"$f":"B6","v":"PCH 5"}]
["Finale vainqueur Match 1 contre vainqueur Match 2",null,null,{"$f":"IF(F10=\"\",\"\",F10)","v":""},{"$f":"IF(F11=\"\",\"\",F11)","v":""}]
["Petite finale entre les deux perdants des matchs 1 et 2",null,null,{"$f":"IF(D12=\"\",\"\",IF(D12=D10,E10,D10))","v":""},{"$f":"IF(E12=\"\",\"\",IF(E12=D11,E11,D11))","v":""}]
["Si poule de 3 joueurs alors…"]
["Déroulement",null,null,"Joueurs A contre Joueur B",null,"Vainqueur","Score"]
["Match 1",null,null,{"$f":"B4","v":"STAN 1"},{"$f":"B6","v":"PCH 5"},"STAN 1"]
["Match 2",null,null,"ALMA 5",{"$f":"B6","v":"PCH 5"},"ALMA 5"]
["Match 3",null,null,{"$f":"B4","v":"STAN 1"},{"$f":"B5","v":"ALMA 5"},"STAN 1"]
["CLASSEMENT",null,null,null,{"$f":"A2","v":"POULE 1"}]
[null,null,"NOM",null,"PRENOM",null,"SIGLE"]
["1er",null,{"$f":"IF($G$4=\"1er\", $B$4,IF($G$5=\"1er\",$B$5,IF($G$6=\"1er\",$B$6,IF($G$7=\"1er\",$B$7,\"\"))))","v":"STAN 1"},null,{"$f":"IF($G$4=\"1er\", $C$4,IF($G$5=\"1er\",$C$5,IF($G$6=\"1er\",$C$6,IF($G$7=\"1er\",$C$7,\"\"))))","v":"STAN 1"},null,{"$f":"IF($G$4=\"1er\", $D$4,IF($G$5=\"1er\",$D$5,IF($G$6=\"1er\",$D$6,IF($G$7=\"1er\",$D$7,\"\"))))","v":"STAN 1"}]
["2ème",null,{"$f":"IF($G$4=\"2ème\", $B$4,IF($G$5=\"2ème\",$B$5,IF($G$6=\"2ème\",$B$6,IF($G$7=\"2ème\",$B$7,\"\"))))","v":"ALMA 5"},null,{"$f":"IF($G$4=\"2ème\", $C$4,IF($G$5=\"2ème\",$C$5,IF($G$6=\"2ème\",$C$6,IF($G$7=\"2ème\",$C$7,\"\"))))","v":"ALMA 5"},null,{"$f":"IF($G$4=\"2ème\", $D$4,IF($G$5=\"2ème\",$D$5,IF($G$6=\"2ème\",$D$6,IF($G$7=\"2ème\",$D$7,\"\"))))","v":"ALMA 5"}]
["3ème",null,{"$f":"IF($G$4=\"3ème\", $B$4,IF($G$5=\"3ème\",$B$5,IF($G$6=\"3ème\",$B$6,IF($G$7=\"3ème\",$B$7,\"\"))))","v":"PCH 5"},null,{"$f":"IF($G$4=\"3ème\", $C$4,IF($G$5=\"3ème\",$C$5,IF($G$6=\"3ème\",$C$6,IF($G$7=\"3ème\",$C$7,\"\"))))","v":"PCH 5"},null,{"$f":"IF($G$4=\"3ème\", $D$4,IF($G$5=\"3ème\",$D$5,IF($G$6=\"3ème\",$D$6,IF($G$7=\"3ème\",$D$7,\"\"))))","v":"PCH 5"}]
["4ème",null,{"$f":"IF($G$4=\"4ème\", $B$4,IF($G$5=\"4ème\",$B$5,IF($G$6=\"4ème\",$B$6,IF($G$7=\"4ème\",$B$7,\"\"))))","v":0},null,{"$f":"IF($G$4=\"4ème\", $C$4,IF($G$5=\"4ème\",$C$5,IF($G$6=\"4ème\",$C$6,IF($G$7=\"4ème\",$C$7,\"\"))))","v":0},null,{"$f":"IF($G$4=\"4ème\", $D$4,IF($G$5=\"4ème\",$D$5,IF($G$6=\"4ème\",$D$6,IF($G$7=\"4ème\",$D$7,\"\"))))","v":0}]

{"sheet":"Poule 2","index":2,"n_rows":24,"n_cols":7,"rows_kept":24,"cut":false,"hidden":false,"merged":[[0,0,0,6],[1,0,1,2],[1,3,1,6],[7,0,7,6],[8,0,8,2],[8,3,8,4],[9,0,9,2],[10,0,10,2],[11,0,11,2],[12,0,12,2],[13,0,13,6],[14,0,14,2],[14,3,14,4],[15,0,15,2],[16,0,16,2],[17,0,17,2],[18,0,18,3],[18,4,18,6],[19,0,19,1],[19,2,19,3],[19,4,19,5],[22,2,22,3],[22,4,22,5],[23,0,23,1],[23,2,23,3],[23,4,23,5],[22,0,22,1],[20,0,20,1],[20,2,20,3],[20,4,20,5],[21,0,21,1],[21,2,21,3],[21,4,21,5]]}
["               BADMINTON "]
["POULE 2",null,null,"TERRAIN N°"]
[null,"NOM","Prénom","Sigle","Vict","Def","Classement"]
[2,{"$f":"Engagés!M7","v":"ALMA 1"},{"$f":"Engagés!N7","v":"ALMA 1"},{"$f":"Engagés!O7","v":"ALMA 1"},null,null,"1er"]
[15,{"$f":"Engagés!M8","v":"PCH 3"},{"$f":"Engagés!N8","v":"PCH 3"},{"$f":"Engagés!O8","v":"PCH 3"},null,null,"3ème"]
[18,{"$f":"Engagés!M9","v":"STAN 6"},{"$f":"Engagés!N9","v":"STAN 6"},{"$f":"Engagés!O9","v":"STAN 6"},null,null,"2ème"]
[31,{"$f":"Engagés!M10","v":0},{"$f":"Engagés!N10","v":0},{"$f":"Engagés!O10","v":0},null,null,"4ème"]
["Si poule de 4 joueurs alors…"]
["Déroulement",null,null,"Joueurs A contre Joueur B",null,"Vainqueur","Score"]
["Match 1",null,null,{"$f":"B4","v":"ALMA 1"},{"$f":"B7","v":0}]
["Match 2",null,null,"PCH 3",{"$f":"B6","v":"STAN 6"}]
["Finale vainqueur Match 1 contre vainqueur Match 2",null,null,{"$f":"IF(F10=\"\",\"\",F10)","v":""},{"$f":"IF(F11=\"\",\"\",F11)","v":""}]
["Petite finale entre les deux perdants des matchs 1 et 2",null,null,{"$f":"IF(D12=\"\",\"\",IF(D12=D10,E10,D10))","v":""},{"$f":"IF(E12=\"\",\"\",IF(E12=D11,E11,D11))","v":""}]
["Si poule de 3 joueurs alors…"]
["Déroulement",null,null,"Joueurs A contre Joueur B",null,"Vainqueur","Score"]
["Match 1",null,null,{"$f":"B4","v":"ALMA 1"},{"$f":"B6","v":"STAN 6"},"ALMA 1"]
["Match 2",null,null,"PCH 3",{"$f":"B6","v":"STAN 6"},"STAN 6"]
["Match 3",null,null,{"$f":"B4","v":"ALMA 1"},{"$f":"B5","v":"PCH 3"}]
["CLASSEMENT",null,null,null,{"$f":"A2","v":"POULE 2"}]
[null,null,"NOM",null,"PRENOM",null,"SIGLE"]
["1er",null,{"$f":"IF($G$4=\"1er\", $B$4,IF($G$5=\"1er\",$B$5,IF($G$6=\"1er\",$B$6,IF($G$7=\"1er\",$B$7,\"\"))))","v":"ALMA 1"},null,{"$f":"IF($G$4=\"1er\", $C$4,IF($G$5=\"1er\",$C$5,IF($G$6=\"1er\",$C$6,IF($G$7=\"1er\",$C$7,\"\"))))","v":"ALMA 1"},null,{"$f":"IF($G$4=\"1er\", $D$4,IF($G$5=\"1er\",$D$5,IF($G$6=\"1er\",$D$6,IF($G$7=\"1er\",$D$7,\"\"))))","v":"ALMA 1"}]
["2ème",null,{"$f":"IF($G$4=\"2ème\", $B$4,IF($G$5=\"2ème\",$B$5,IF($G$6=\"2ème\",$B$6,IF($G$7=\"2ème\",$B$7,\"\"))))","v":"STAN 6"},null,{"$f":"IF($G$4=\"2ème\", $C$4,IF($G$5=\"2ème\",$C$5,IF($G$6=\"2ème\",$C$6,IF($G$7=\"2ème\",$C$7,\"\"))))","v":"STAN 6"},null,{"$f":"IF($G$4=\"2ème\", $D$4,IF($G$5=\"2ème\",$D$5,IF($G$6=\"2ème\",$D$6,IF($G$7=\"2ème\",$D$7,\"\"))))","v":"STAN 6"}]
["3ème",null,{"$f":"IF($G$4=\"3ème\", $B$4,IF($G$5=\"3ème\",$B$5,IF($G$6=\"3ème\",$B$6,IF($G$7=\"3ème\",$B$7,\"\"))))","v":"PCH 3"},null,{"$f":"IF($G$4=\"3ème\", $C$4,IF($G$5=\"3ème\",$C$5,IF($G$6=\"3ème\",$C$6,IF($G$7=\"3ème\",$C$7,\"\"))))","v":"PCH 3"},null,{"$f":"IF($G$4=\"3ème\", $D$4,IF($G$5=\"3ème\",$D$5,IF($G$6=\"3ème\",$D$6,IF($G$7=\"3ème\",$D$7,\"\"))))","v":"PCH 3"}]
["4ème",null,{"$f":"IF($G$4=\"4ème\", $B$4,IF($G$5=\"4ème\",$B$5,IF($G$6=\"4ème\",$B$6,IF($G$7=\"4ème\",$B$7,\"\"))))","v":0},null,{"$f":"IF($G$4=\"4ème\", $C$4,IF($G$5=\"4ème\",$C$5,IF($G$6=\"4ème\",$C$6,IF($G$7=\"4ème\",$C$7,\"\"))))","v":0},null,{"$f":"IF($G$4=\"4ème\", $D$4,IF($G$5=\"4ème\",$D$5,IF($G$6=\"4ème\",$D$6,IF($G$7=\"4ème\",$D$7,\"\"))))","v":0}]

{"sheet":"Poule 3","index":3,"n_rows":24,"n_cols":7,"rows_kept":24,"cut":false,"hidden":false,"merged":[[0,0,0,6],[1,0,1,2],[1,3,1,6],[7,0,7,6],[8,0,8,2],[8,3,8,4],[9,0,9,2],[10,0,10,2],[11,0,11,2],[12,0,12,2],[13,0,13,6],[14,0,14,2],[14,3,14,4],[15,0,15,2],[16,0,16,2],[17,0,17,2],[18,0,18,3],[18,4,18,6],[19,0,19,1],[19,2,19,3],[19,4,19,5],[22,2,22,3],[22,4,22,5],[23,0,23,1],[23,2,23,3],[23,4,23,5],[22,0,22,1],[20,0,20,1],[20,2,20,3],[20,4,20,5],[21,0,21,1],[21,2,21,3],[21,4,21,5]]}
["               BADMINTON "]
["POULE 3",null,null,"TERRAIN N°"]
[null,"NOM","Prénom","Sigle","Vict","Def","Classement"]
[3,{"$f":"Engagés!I14","v":"STAN 2"},{"$f":"Engagés!J14","v":"STAN 2"},{"$f":"Engagés!K14","v":"STAN 2"},null,null,"1er"]
[14,{"$f":"Engagés!I15","v":"BLOP 2"},{"$f":"Engagés!J15","v":"BLOP 2"},{"$f":"Engagés!K15","v":"BLOP 2"},null,null,"2ème"]
[19,{"$f":"Engagés!I16","v":"ALMA 6"},{"$f":"Engagés!J16","v":"ALMA 6"},{"$f":"Engagés!K16","v":"ALMA 6"},null,null,"3ème"]
[30,{"$f":"Engagés!I17","v":0},{"$f":"Engagés!J17","v":0},{"$f":"Engagés!K17","v":0},null,null,"4ème"]
["Si poule de 4 joueurs alors…"]
["Déroulement",null,null,"Joueurs A contre Joueur B",null,"Vainqueur","Score"]
["Match 1",null,null,{"$f":"B4","v":"STAN 2"},{"$f":"B7","v":0}]
["Match 2",null,null,"BLOP 2",{"$f":"B6","v":"ALMA 6"}]
["Finale vainqueur Match 1 contre vainqueur Match 2",null,null,{"$f":"IF(F10=\"\",\"\",F10)","v":""},{"$f":"IF(F11=\"\",\"\",F11)","v":""}]
["Petite finale entre les deux perdants des matchs 1 et 2",null,null,{"$f":"IF(D12=\"\",\"\",IF(D12=D10,E10,D10))","v":""},{"$f":"IF(E12=\"\",\"\",IF(E12=D11,E11,D11))","v":""}]
["Si poule de 3 joueurs alors…"]
["Déroulement",null,null,"Joueurs A contre Joueur B",null,"Vainqueur","Score"]
["Match 1",null,null,{"$f":"B4","v":"STAN 2"},{"$f":"B6","v":"ALMA 6"},"STAN 2"]
["Match 2",null,null,"BLOP 2",{"$f":"B6","v":"ALMA 6"},"BLOP 2"]
["Match 3",null,null,{"$f":"B4","v":"STAN 2"},{"$f":"B5","v":"BLOP 2"},"STAN 2"]
["CLASSEMENT",null,null,null,{"$f":"A2","v":"POULE 3"}]
[null,null,"NOM",null,"PRENOM",null,"SIGLE"]
["1er",null,{"$f":"IF($G$4=\"1er\", $B$4,IF($G$5=\"1er\",$B$5,IF($G$6=\"1er\",$B$6,IF($G$7=\"1er\",$B$7,\"\"))))","v":"STAN 2"},null,{"$f":"IF($G$4=\"1er\", $C$4,IF($G$5=\"1er\",$C$5,IF($G$6=\"1er\",$C$6,IF($G$7=\"1er\",$C$7,\"\"))))","v":"STAN 2"},null,{"$f":"IF($G$4=\"1er\", $D$4,IF($G$5=\"1er\",$D$5,IF($G$6=\"1er\",$D$6,IF($G$7=\"1er\",$D$7,\"\"))))","v":"STAN 2"}]
["2ème",null,{"$f":"IF($G$4=\"2ème\", $B$4,IF($G$5=\"2ème\",$B$5,IF($G$6=\"2ème\",$B$6,IF($G$7=\"2ème\",$B$7,\"\"))))","v":"BLOP 2"},null,{"$f":"IF($G$4=\"2ème\", $C$4,IF($G$5=\"2ème\",$C$5,IF($G$6=\"2ème\",$C$6,IF($G$7=\"2ème\",$C$7,\"\"))))","v":"BLOP 2"},null,{"$f":"IF($G$4=\"2ème\", $D$4,IF($G$5=\"2ème\",$D$5,IF($G$6=\"2ème\",$D$6,IF($G$7=\"2ème\",$D$7,\"\"))))","v":"BLOP 2"}]
["3ème",null,{"$f":"IF($G$4=\"3ème\", $B$4,IF($G$5=\"3ème\",$B$5,IF($G$6=\"3ème\",$B$6,IF($G$7=\"3ème\",$B$7,\"\"))))","v":"ALMA 6"},null,{"$f":"IF($G$4=\"3ème\", $C$4,IF($G$5=\"3ème\",$C$5,IF($G$6=\"3ème\",$C$6,IF($G$7=\"3ème\",$C$7,\"\"))))","v":"ALMA 6"},null,{"$f":"IF($G$4=\"3ème\", $D$4,IF($G$5=\"3ème\",$D$5,IF($G$6=\"3ème\",$D$6,IF($G$7=\"3ème\",$D$7,\"\"))))","v":"ALMA 6"}]
["4ème",null,{"$f":"IF($G$4=\"4ème\", $B$4,IF($G$5=\"4ème\",$B$5,IF($G$6=\"4ème\",$B$6,IF($G$7=\"4ème\",$B$7,\"\"))))","v":0},null,{"$f":"IF($G$4=\"4ème\", $C$4,IF($G$5=\"4ème\",$C$5,IF($G$6=\"4ème\",$C$6,IF($G$7=\"4ème\",$C$7,\"\"))))","v":0},null,{"$f":"IF($G$4=\"4ème\", $D$4,IF($G$5=\"4ème\",$D$5,IF($G$6=\"4ème\",$D$6,IF($G$7=\"4ème\",$D$7,\"\"))))","v":0}]

{"sheet":"Poule 4","index":4,"n_rows":24,"n_cols":7,"rows_kept":24,"cut":false,"hidden":false,"merged":[[0,0,0,6],[1,0,1,2],[1,3,1,6],[7,0,7,6],[8,0,8,2],[8,3,8,4],[9,0,9,2],[10,0,10,2],[11,0,11,2],[12,0,12,2],[13,0,13,6],[14,0,14,2],[14,3,14,4],[15,0,15,2],[16,0,16,2],[17,0,17,2],[18,0,18,3],[18,4,18,6],[19,0,19,1],[19,2,19,3],[19,4,19,5],[22,2,22,3],[22,4,22,5],[23,0,23,1],[23,2,23,3],[23,4,23,5],[22,0,22,1],[20,0,20,1],[20,2,20,3],[20,4,20,5],[21,0,21,1],[21,2,21,3],[21,4,21,5]]}
["               BADMINTON "]
["POULE 4",null,null,"TERRAIN N°"]
[null,"NOM","Prénom","Sigle","Vict","Def","Classement"]
[4,{"$f":"Engagés!M14","v":"ALMA 2"},{"$f":"Engagés!N14","v":"ALMA 2"},{"$f":"Engagés!O14","v":"ALMA 2"},null,null,"1er"]
[13,{"$f":"Engagés!M15","v":"STAN 5"},{"$f":"Engagés!N15","v":"STAN 5"},{"$f":"Engagés!O15","v":"STAN 5"},null,null,"3ème"]
[20,{"$f":"Engagés!M16","v":"PCH 4"},{"$f":"Engagés!N16","v":"PCH 4"},{"$f":"Engagés!O16","v":"PCH 4"},null,null,"2ème"]
[29,{"$f":"Engagés!M17","v":0},{"$f":"Engagés!N17","v":0},{"$f":"Engagés!O17","v":0},null,null,"4ème"]
["Si poule de 4 joueurs alors…"]
["Déroulement",null,null,"Joueurs A contre Joueur B",null,"Vainqueur","Score"]
["Match 1",null,null,{"$f":"B4","v":"ALMA 2"},{"$f":"B7","v":0}]
["Match 2",null,null,"STAN 5",{"$f":"B6","v":"PCH 4"}]
["Finale vainqueur Match 1 contre vainqueur Match 2",null,null,{"$f":"IF(F10=\"\",\"\",F10)","v":""},{"$f":"IF(F11=\"\",\"\",F11)","v":""}]
["Petite finale entre les deux perdants des matchs 1 et 2",null,null,{"$f":"IF(D12=\"\",\"\",IF(D12=D10,E10,D10))","v":""},{"$f":"IF(E12=\"\",\"\",IF(E12=D11,E11,D11))","v":""}]
["Si poule de 3 joueurs alors…"]
["Déroulement",null,null,"Joueurs A contre Joueur B",null,"Vainqueur","Score"]
["Match 1",null,null,{"$f":"B4","v":"ALMA 2"},{"$f":"B6","v":"PCH 4"},"ALMA 2"]
["Match 2",null,null,"STAN 5",{"$f":"B6","v":"PCH 4"},"PCH 4"]
["Match 3",null,null,{"$f":"B4","v":"ALMA 2"},{"$f":"B5","v":"STAN 5"}]
["CLASSEMENT",null,null,null,{"$f":"A2","v":"POULE 4"}]
[null,null,"NOM",null,"PRENOM",null,"SIGLE"]
["1er",null,{"$f":"IF($G$4=\"1er\", $B$4,IF($G$5=\"1er\",$B$5,IF($G$6=\"1er\",$B$6,IF($G$7=\"1er\",$B$7,\"\"))))","v":"ALMA 2"},null,{"$f":"IF($G$4=\"1er\", $C$4,IF($G$5=\"1er\",$C$5,IF($G$6=\"1er\",$C$6,IF($G$7=\"1er\",$C$7,\"\"))))","v":"ALMA 2"},null,{"$f":"IF($G$4=\"1er\", $D$4,IF($G$5=\"1er\",$D$5,IF($G$6=\"1er\",$D$6,IF($G$7=\"1er\",$D$7,\"\"))))","v":"ALMA 2"}]
["2ème",null,{"$f":"IF($G$4=\"2ème\", $B$4,IF($G$5=\"2ème\",$B$5,IF($G$6=\"2ème\",$B$6,IF($G$7=\"2ème\",$B$7,\"\"))))","v":"PCH 4"},null,{"$f":"IF($G$4=\"2ème\", $C$4,IF($G$5=\"2ème\",$C$5,IF($G$6=\"2ème\",$C$6,IF($G$7=\"2ème\",$C$7,\"\"))))","v":"PCH 4"},null,{"$f":"IF($G$4=\"2ème\", $D$4,IF($G$5=\"2ème\",$D$5,IF($G$6=\"2ème\",$D$6,IF($G$7=\"2ème\",$D$7,\"\"))))","v":"PCH 4"}]
["3ème",null,{"$f":"IF($G$4=\"3ème\", $B$4,IF($G$5=\"3ème\",$B$5,IF($G$6=\"3ème\",$B$6,IF($G$7=\"3ème\",$B$7,\"\"))))","v":"STAN 5"},null,{"$f":"IF($G$4=\"3ème\", $C$4,IF($G$5=\"3ème\",$C$5,IF($G$6=\"3ème\",$C$6,IF($G$7=\"3ème\",$C$7,\"\"))))","v":"STAN 5"},null,{"$f":"IF($G$4=\"3ème\", $D$4,IF($G$5=\"3ème\",$D$5,IF($G$6=\"3ème\",$D$6,IF($G$7=\"3ème\",$D$7,\"\"))))","v":"STAN 5"}]
["4ème",null,{"$f":"IF($G$4=\"4ème\", $B$4,IF($G$5=\"4ème\",$B$5,IF($G$6=\"4ème\",$B$6,IF($G$7=\"4ème\",$B$7,\"\"))))","v":0},null,{"$f":"IF($G$4=\"4ème\", $C$4,IF($G$5=\"4ème\",$C$5,IF($G$6=\"4ème\",$C$6,IF($G$7=\"4ème\",$C$7,\"\"))))","v":0},null,{"$f":"IF($G$4=\"4ème\", $D$4,IF($G$5=\"4ème\",$D$5,IF($G$6=\"4ème\",$D$6,IF($G$7=\"4ème\",$D$7,\"\"))))","v":0}]

{"sheet":"Poule 5","index":5,"n_rows":24,"n_cols":7,"rows_kept":24,"cut":false,"hidden":false,"merged":[[0,0,0,6],[1,0,1,2],[1,3,1,6],[7,0,7,6],[8,0,8,2],[8,3,8,4],[9,0,9,2],[10,0,10,2],[11,0,11,2],[12,0,12,2],[13,0,13,6],[14,0,14,2],[14,3,14,4],[15,0,15,2],[16,0,16,2],[17,0,17,2],[18,0,18,3],[18,4,18,6],[19,0,19,1],[19,2,19,3],[19,4,19,5],[22,2,22,3],[22,4,22,5],[23,0,23,1],[23,2,23,3],[23,4,23,5],[22,0,22,1],[20,0,20,1],[20,2,20,3],[20,4,20,5],[21,0,21,1],[21,2,21,3],[21,4,21,5]]}
["TENNIS DE TABLE"]
["POULE 5",null,null,"TABLE N°"]
[null,"NOM","Prénom","Sigle","Vict","Def","Classement"]
[5,{"$f":"Engagés!I21","v":"PCH 1"},{"$f":"Engagés!J21","v":"PCH 1"},{"$f":"Engagés!K21","v":"PCH 1"},null,null,"1er"]
[12,{"$f":"Engagés!I22","v":"STAN 4"},{"$f":"Engagés!J22","v":"STAN 4"},{"$f":"Engagés!K22","v":"STAN 4"},null,null,"2ème"]
[21,{"$f":"Engagés!I23","v":"BLOP 3"},{"$f":"Engagés!J23","v":"BLOP 3"},{"$f":"Engagés!K23","v":"BLOP 3"},null,null,"3ème"]
[28,{"$f":"Engagés!I24","v":"ALMA 10"},{"$f":"Engagés!J24","v":"ALMA 10"},{"$f":"Engagés!K24","v":"ALMA 10"},null,null,"4ème"]
["Si poule de 4 joueurs alors…"]
["Déroulement",null,null,"Joueurs A contre Joueur B",null,"Vainqueur","Score"]
["Match 1",null,null,{"$f":"B4","v":"PCH 1"},{"$f":"B7","v":"ALMA 10"},"PCH 1"]
["Match 2",null,null,"STAN 4",{"$f":"B6","v":"BLOP 3"},"STAN 4"]
["Finale vainqueur Match 1 contre vainqueur Match 2",null,null,{"$f":"IF(F10=\"\",\"\",F10)","v":"PCH 1"},{"$f":"IF(F11=\"\",\"\",F11)","v":"STAN 4"},"PCH 1"]
["Petite finale entre les deux perdants des matchs 1 et 2",null,null,{"$f":"IF(D12=\"\",\"\",IF(D12=D10,E10,D10))","v":"ALMA 10"},{"$f":"IF(E12=\"\",\"\",IF(E12=D11,E11,D11))","v":"BLOP 3"},"BLOP 3"]
["Si poule de 3 joueurs alors…"]
["Déroulement",null,null,"Joueurs A contre Joueur B",null,"Vainqueur","Score"]
["Match 1",null,null,{"$f":"B4","v":"PCH 1"},{"$f":"B6","v":"BLOP 3"}]
["Match 2",null,null,"STAN 4",{"$f":"B6","v":"BLOP 3"}]
["Match 3",null,null,{"$f":"B4","v":"PCH 1"},{"$f":"B5","v":"STAN 4"}]
["CLASSEMENT",null,null,null,{"$f":"A2","v":"POULE 5"}]
[null,null,"NOM",null,"PRENOM",null,"SIGLE"]
["1er",null,{"$f":"IF($G$4=\"1er\", $B$4,IF($G$5=\"1er\",$B$5,IF($G$6=\"1er\",$B$6,IF($G$7=\"1er\",$B$7,\"\"))))","v":"PCH 1"},null,{"$f":"IF($G$4=\"1er\", $C$4,IF($G$5=\"1er\",$C$5,IF($G$6=\"1er\",$C$6,IF($G$7=\"1er\",$C$7,\"\"))))","v":"PCH 1"},null,{"$f":"IF($G$4=\"1er\", $D$4,IF($G$5=\"1er\",$D$5,IF($G$6=\"1er\",$D$6,IF($G$7=\"1er\",$D$7,\"\"))))","v":"PCH 1"}]
["2ème",null,{"$f":"IF($G$4=\"2ème\", $B$4,IF($G$5=\"2ème\",$B$5,IF($G$6=\"2ème\",$B$6,IF($G$7=\"2ème\",$B$7,\"\"))))","v":"STAN 4"},null,{"$f":"IF($G$4=\"2ème\", $C$4,IF($G$5=\"2ème\",$C$5,IF($G$6=\"2ème\",$C$6,IF($G$7=\"2ème\",$C$7,\"\"))))","v":"STAN 4"},null,{"$f":"IF($G$4=\"2ème\", $D$4,IF($G$5=\"2ème\",$D$5,IF($G$6=\"2ème\",$D$6,IF($G$7=\"2ème\",$D$7,\"\"))))","v":"STAN 4"}]
["3ème",null,{"$f":"IF($G$4=\"3ème\", $B$4,IF($G$5=\"3ème\",$B$5,IF($G$6=\"3ème\",$B$6,IF($G$7=\"3ème\",$B$7,\"\"))))","v":"BLOP 3"},null,{"$f":"IF($G$4=\"3ème\", $C$4,IF($G$5=\"3ème\",$C$5,IF($G$6=\"3ème\",$C$6,IF($G$7=\"3ème\",$C$7,\"\"))))","v":"BLOP 3"},null,{"$f":"IF($G$4=\"3ème\", $D$4,IF($G$5=\"3ème\",$D$5,IF($G$6=\"3ème\",$D$6,IF($G$7=\"3ème\",$D$7,\"\"))))","v":"BLOP 3"}]
["4ème",null,{"$f":"IF($G$4=\"4ème\", $B$4,IF($G$5=\"4ème\",$B$5,IF($G$6=\"4ème\",$B$6,IF($G$7=\"4ème\",$B$7,\"\"))))","v":"ALMA 10"},null,{"$f":"IF($G$4=\"4ème\", $C$4,IF($G$5=\"4ème\",$C$5,IF($G$6=\"4ème\",$C$6,IF($G$7=\"4ème\",$C$7,\"\"))))","v":"ALMA 10"},null,{"$f":"IF($G$4=\"4ème\", $D$4,IF($G$5=\"4ème\",$D$5,IF($G$6=\"4ème\",$D$6,IF($G$7=\"4ème\",$D$7,\"\"))))","v":"ALMA 10"}]

{"sheet":"Poule 6","index":6,"n_rows":24,"n_cols":7,"rows_kept":24,"cut":false,"hidden":false,"merged":[[0,0,0,6],[1,0,1,2],[1,3,1,6],[7,0,7,6],[8,0,8,2],[8,3,8,4],[9,0,9,2],[10,0,10,2],[11,0,11,2],[12,0,12,2],[13,0,13,6],[14,0,14,2],[14,3,14,4],[15,0,15,2],[16,0,16,2],[17,0,17,2],[18,0,18,3],[18,4,18,6],[19,0,19,1],[19,2,19,3],[19,4,19,5],[22,2,22,3],[22,4,22,5],[23,0,23,1],[23,2,23,3],[23,4,23,5],[22,0,22,1],[20,0,20,1],[20,2,20,3],[20,4,20,5],[21,0,21,1],[21,2,21,3],[21,4,21,5]]}
["TENNIS DE TABLE"]
["POULE 6",null,null,"TABLE N°"]
[null,"NOM","Prénom","Sigle","Vict","Def","Classement"]
[6,{"$f":"Engagés!M21","v":"BLOP 1"},{"$f":"Engagés!N21","v":"BLOP 1"},{"$f":"Engagés!O21","v":"BLOP 1"},null,null,"3ème"]
[11,{"$f":"Engagés!M22","v":"ALMA 4"},{"$f":"Engagés!N22","v":"ALMA 4"},{"$f":"Engagés!O22","v":"ALMA 4"},null,null,"2ème"]
[22,{"$f":"Engagés!M23","v":"ALMA 7"},{"$f":"Engagés!N23","v":"ALMA 7"},{"$f":"Engagés!O23","v":"ALMA 7"},null,null,"1er"]
[27,{"$f":"Engagés!M24","v":0},{"$f":"Engagés!N24","v":0},{"$f":"Engagés!O24","v":0},null,null,"4ème"]
["Si poule de 4 joueurs alors…"]
["Déroulement",null,null,"Joueurs A contre Joueur B",null,"Vainqueur","Score"]
["Match 1",null,null,{"$f":"B4","v":"BLOP 1"},{"$f":"B7","v":0}]
["Match 2",null,null,"ALMA 4",{"$f":"B6","v":"ALMA 7"}]
["Finale vainqueur Match 1 contre vainqueur Match 2",null,null,{"$f":"IF(F10=\"\",\"\",F10)","v":""},{"$f":"IF(F11=\"\",\"\",F11)","v":""}]
["Petite finale entre les deux perdants des matchs 1 et 2",null,null,{"$f":"IF(D12=\"\",\"\",IF(D12=D10,E10,D10))","v":""},{"$f":"IF(E12=\"\",\"\",IF(E12=D11,E11,D11))","v":""}]
["Si poule de 3 joueurs alors…"]
["Déroulement",null,null,"Joueurs A contre Joueur B",null,"Vainqueur","Score"]
["Match 1",null,null,{"$f":"B4","v":"BLOP 1"},{"$f":"B6","v":"ALMA 7"},"ALMA 7"]
["Match 2",null,null,"ALMA 4",{"$f":"B6","v":"ALMA 7"},"ALMA 7"]
["Match 3",null,null,{"$f":"B4","v":"BLOP 1"},{"$f":"B5","v":"ALMA 4"},"ALMA 4"]
["CLASSEMENT",null,null,null,{"$f":"A2","v":"POULE 6"}]
[null,null,"NOM",null,"PRENOM",null,"SIGLE"]
["1er",null,{"$f":"IF($G$4=\"1er\", $B$4,IF($G$5=\"1er\",$B$5,IF($G$6=\"1er\",$B$6,IF($G$7=\"1er\",$B$7,\"\"))))","v":"ALMA 7"},null,{"$f":"IF($G$4=\"1er\", $C$4,IF($G$5=\"1er\",$C$5,IF($G$6=\"1er\",$C$6,IF($G$7=\"1er\",$C$7,\"\"))))","v":"ALMA 7"},null,{"$f":"IF($G$4=\"1er\", $D$4,IF($G$5=\"1er\",$D$5,IF($G$6=\"1er\",$D$6,IF($G$7=\"1er\",$D$7,\"\"))))","v":"ALMA 7"}]
["2ème",null,{"$f":"IF($G$4=\"2ème\", $B$4,IF($G$5=\"2ème\",$B$5,IF($G$6=\"2ème\",$B$6,IF($G$7=\"2ème\",$B$7,\"\"))))","v":"ALMA 4"},null,{"$f":"IF($G$4=\"2ème\", $C$4,IF($G$5=\"2ème\",$C$5,IF($G$6=\"2ème\",$C$6,IF($G$7=\"2ème\",$C$7,\"\"))))","v":"ALMA 4"},null,{"$f":"IF($G$4=\"2ème\", $D$4,IF($G$5=\"2ème\",$D$5,IF($G$6=\"2ème\",$D$6,IF($G$7=\"2ème\",$D$7,\"\"))))","v":"ALMA 4"}]
["3ème",null,{"$f":"IF($G$4=\"3ème\", $B$4,IF($G$5=\"3ème\",$B$5,IF($G$6=\"3ème\",$B$6,IF($G$7=\"3ème\",$B$7,\"\"))))","v":"BLOP 1"},null,{"$f":"IF($G$4=\"3ème\", $C$4,IF($G$5=\"3ème\",$C$5,IF($G$6=\"3ème\",$C$6,IF($G$7=\"3ème\",$C$7,\"\"))))","v":"BLOP 1"},null,{"$f":"IF($G$4=\"3ème\", $D$4,IF($G$5=\"3ème\",$D$5,IF($G$6=\"3ème\",$D$6,IF($G$7=\"3ème\",$D$7,\"\"))))","v":"BLOP 1"}]
["4ème",null,{"$f":"IF($G$4=\"4ème\", $B$4,IF($G$5=\"4ème\",$B$5,IF($G$6=\"4ème\",$B$6,IF($G$7=\"4ème\",$B$7,\"\"))))","v":0},null,{"$f":"IF($G$4=\"4ème\", $C$4,IF($G$5=\"4ème\",$C$5,IF($G$6=\"4ème\",$C$6,IF($G$7=\"4ème\",$C$7,\"\"))))","v":0},null,{"$f":"IF($G$4=\"4ème\", $D$4,IF($G$5=\"4ème\",$D$5,IF($G$6=\"4ème\",$D$6,IF($G$7=\"4ème\",$D$7,\"\"))))","v":0}]

{"sheet":"Poule 7","index":7,"n_rows":24,"n_cols":7,"rows_kept":24,"cut":false,"hidden":false,"merged":[[0,0,0,6],[1,0,1,2],[1,3,1,6],[7,0,7,6],[8,0,8,2],[8,3,8,4],[9,0,9,2],[10,0,10,2],[11,0,11,2],[12,0,12,2],[13,0,13,6],[14,0,14,2],[14,3,14,4],[15,0,15,2],[16,0,16,2],[17,0,17,2],[18,0,18,3],[18,4,18,6],[19,0,19,1],[19,2,19,3],[19,4,19,5],[22,2,22,3],[22,4,22,5],[23,0,23,1],[23,2,23,3],[23,4,23,5],[22,0,22,1],[20,0,20,1],[20,2,20,3],[20,4,20,5],[21,0,21,1],[21,2,21,3],[21,4,21,5]]}
["TENNIS DE TABLE"]
["POULE 7",null,null,"TABLE N°"]
[null,"NOM","Prénom","Sigle","Vict","Def","Classement"]
[7,{"$f":"Engagés!I28","v":"STAN 3"},{"$f":"Engagés!J28","v":"STAN 3"},{"$f":"Engagés!K28","v":"STAN 3"},null,null,"1er"]
[10,{"$f":"Engagés!I29","v":"PCH 2"},{"$f":"Engagés!J29","v":"PCH 2"},{"$f":"Engagés!K29","v":"PCH 2"},null,null,"2ème"]
[23,{"$f":"Engagés!I30","v":"ALMA 9"},{"$f":"Engagés!J30","v":"ALMA 9"},{"$f":"Engagés!K30","v":"ALMA 9"},null,null,"3ème"]
[26,{"$f":"Engagés!I31","v":0},{"$f":"Engagés!J31","v":0},{"$f":"Engagés!K31","v":0},null,null,"4ème"]
["Si poule de 4 joueurs alors…"]
["Déroulement",null,null,"Joueurs A contre Joueur B",null,"Vainqueur","Score"]
["Match 1",null,null,{"$f":"B4","v":"STAN 3"},{"$f":"B7","v":0}]
["Match 2",null,null,"PCH 2",{"$f":"B6","v":"ALMA 9"}]
["Finale vainqueur Match 1 contre vainqueur Match 2",null,null,{"$f":"IF(F10=\"\",\"\",F10)","v":""},{"$f":"IF(F11=\"\",\"\",F11)","v":""}]
["Petite finale entre les deux perdants des matchs 1 et 2",null,null,{"$f":"IF(D12=\"\",\"\",IF(D12=D10,E10,D10))","v":""},{"$f":"IF(E12=\"\",\"\",IF(E12=D11,E11,D11))","v":""}]
["Si poule de 3 joueurs alors…"]
["Déroulement",null,null,"Joueurs A contre Joueur B",null,"Vainqueur","Score"]
["Match 1",null,null,{"$f":"B4","v":"STAN 3"},{"$f":"B6","v":"ALMA 9"},"STAN 3"]
["Match 2",null,null,"PCH 2",{"$f":"B6","v":"ALMA 9"},"PCH 2"]
["Match 3",null,null,{"$f":"B4","v":"STAN 3"},{"$f":"B5","v":"PCH 2"},"STAN 3"]
["CLASSEMENT",null,null,null,{"$f":"A2","v":"POULE 7"}]
[null,null,"NOM",null,"PRENOM",null,"SIGLE"]
["1er",null,{"$f":"IF($G$4=\"1er\", $B$4,IF($G$5=\"1er\",$B$5,IF($G$6=\"1er\",$B$6,IF($G$7=\"1er\",$B$7,\"\"))))","v":"STAN 3"},null,{"$f":"IF($G$4=\"1er\", $C$4,IF($G$5=\"1er\",$C$5,IF($G$6=\"1er\",$C$6,IF($G$7=\"1er\",$C$7,\"\"))))","v":"STAN 3"},null,{"$f":"IF($G$4=\"1er\", $D$4,IF($G$5=\"1er\",$D$5,IF($G$6=\"1er\",$D$6,IF($G$7=\"1er\",$D$7,\"\"))))","v":"STAN 3"}]
["2ème",null,{"$f":"IF($G$4=\"2ème\", $B$4,IF($G$5=\"2ème\",$B$5,IF($G$6=\"2ème\",$B$6,IF($G$7=\"2ème\",$B$7,\"\"))))","v":"PCH 2"},null,{"$f":"IF($G$4=\"2ème\", $C$4,IF($G$5=\"2ème\",$C$5,IF($G$6=\"2ème\",$C$6,IF($G$7=\"2ème\",$C$7,\"\"))))","v":"PCH 2"},null,{"$f":"IF($G$4=\"2ème\", $D$4,IF($G$5=\"2ème\",$D$5,IF($G$6=\"2ème\",$D$6,IF($G$7=\"2ème\",$D$7,\"\"))))","v":"PCH 2"}]
["3ème",null,{"$f":"IF($G$4=\"3ème\", $B$4,IF($G$5=\"3ème\",$B$5,IF($G$6=\"3ème\",$B$6,IF($G$7=\"3ème\",$B$7,\"\"))))","v":"ALMA 9"},null,{"$f":"IF($G$4=\"3ème\", $C$4,IF($G$5=\"3ème\",$C$5,IF($G$6=\"3ème\",$C$6,IF($G$7=\"3ème\",$C$7,\"\"))))","v":"ALMA 9"},null,{"$f":"IF($G$4=\"3ème\", $D$4,IF($G$5=\"3ème\",$D$5,IF($G$6=\"3ème\",$D$6,IF($G$7=\"3ème\",$D$7,\"\"))))","v":"ALMA 9"}]
["4ème",null,{"$f":"IF($G$4=\"4ème\", $B$4,IF($G$5=\"4ème\",$B$5,IF($G$6=\"4ème\",$B$6,IF($G$7=\"4ème\",$B$7,\"\"))))","v":0},null,{"$f":"IF($G$4=\"4ème\", $C$4,IF($G$5=\"4ème\",$C$5,IF($G$6=\"4ème\",$C$6,IF($G$7=\"4ème\",$C$7,\"\"))))","v":0},null,{"$f":"IF($G$4=\"4ème\", $D$4,IF($G$5=\"4ème\",$D$5,IF($G$6=\"4ème\",$D$6,IF($G$7=\"4ème\",$D$7,\"\"))))","v":0}]

{"sheet":"Poule 8","index":8,"n_rows":24,"n_cols":7,"rows_kept":24,"cut":false,"hidden":false,"merged":[[0,0,0,6],[1,0,1,2],[1,3,1,6],[7,0,7,6],[8,0,8,2],[8,3,8,4],[9,0,9,2],[10,0,10,2],[11,0,11,2],[12,0,12,2],[13,0,13,6],[14,0,14,2],[14,3,14,4],[15,0,15,2],[16,0,16,2],[17,0,17,2],[18,0,18,3],[18,4,18,6],[19,0,19,1],[19,2,19,3],[19,4,19,5],[22,2,22,3],[22,4,22,5],[23,0,23,1],[23,2,23,3],[23,4,23,5],[22,0,22,1],[20,0,20,1],[20,2,20,3],[20,4,20,5],[21,0,21,1],[21,2,21,3],[21,4,21,5]]}
["TENNIS DE TABLE"]
["POULE 8",null,null,"TABLE N°"]
[null,"NOM","Prénom","Sigle","Vict","Def","Classement"]
[8,{"$f":"Engagés!M28","v":"SLM 1"},{"$f":"Engagés!N28","v":"SLM 1"},{"$f":"Engagés!O28","v":"SLM 1"},null,null,"3ème"]
[9,{"$f":"Engagés!M29","v":"ALMA 3"},{"$f":"Engagés!N29","v":"ALMA 3"},{"$f":"Engagés!O29","v":"ALMA 3"},null,null,"1er"]
[24,{"$f":"Engagés!M30","v":"ALMA 8"},{"$f":"Engagés!N30","v":"ALMA 8"},{"$f":"Engagés!O30","v":"ALMA 8"},null,null,"2ème"]
[25,{"$f":"Engagés!M31","v":0},{"$f":"Engagés!N31","v":0},{"$f":"Engagés!O31","v":0},null,null,"4ème"]
["Si poule de 4 joueurs alors…"]
["Déroulement",null,null,"Joueurs A contre Joueur B",null,"Vainqueur","Score"]
["Match 1",null,null,{"$f":"B4","v":"SLM 1"},{"$f":"B7","v":0}]
["Match 2",null,null,"ALMA 3",{"$f":"B6","v":"ALMA 8"}]
["Finale vainqueur Match 1 contre vainqueur Match 2",null,null,{"$f":"IF(F10=\"\",\"\",F10)","v":""},{"$f":"IF(F11=\"\",\"\",F11)","v":""}]
["Petite finale entre les deux perdants des matchs 1 et 2",null,null,{"$f":"IF(D12=\"\",\"\",IF(D12=D10,E10,D10))","v":""},{"$f":"IF(E12=\"\",\"\",IF(E12=D11,E11,D11))","v":""}]
["Si poule de 3 joueurs alors…"]
["Déroulement",null,null,"Joueurs A contre Joueur B",null,"Vainqueur","Score"]
["Match 1",null,null,{"$f":"B4","v":"SLM 1"},{"$f":"B6","v":"ALMA 8"},"ALMA 8"]
["Match 2",null,null,"ALMA 3",{"$f":"B6","v":"ALMA 8"},"ALMA 3"]
["Match 3",null,null,{"$f":"B4","v":"SLM 1"},{"$f":"B5","v":"ALMA 3"},"ALMA 3"]
["CLASSEMENT",null,null,null,{"$f":"A2","v":"POULE 8"}]
[null,null,"NOM",null,"PRENOM",null,"SIGLE"]
["1er",null,{"$f":"IF($G$4=\"1er\", $B$4,IF($G$5=\"1er\",$B$5,IF($G$6=\"1er\",$B$6,IF($G$7=\"1er\",$B$7,\"\"))))","v":"ALMA 3"},null,{"$f":"IF($G$4=\"1er\", $C$4,IF($G$5=\"1er\",$C$5,IF($G$6=\"1er\",$C$6,IF($G$7=\"1er\",$C$7,\"\"))))","v":"ALMA 3"},null,{"$f":"IF($G$4=\"1er\", $D$4,IF($G$5=\"1er\",$D$5,IF($G$6=\"1er\",$D$6,IF($G$7=\"1er\",$D$7,\"\"))))","v":"ALMA 3"}]
["2ème",null,{"$f":"IF($G$4=\"2ème\", $B$4,IF($G$5=\"2ème\",$B$5,IF($G$6=\"2ème\",$B$6,IF($G$7=\"2ème\",$B$7,\"\"))))","v":"ALMA 8"},null,{"$f":"IF($G$4=\"2ème\", $C$4,IF($G$5=\"2ème\",$C$5,IF($G$6=\"2ème\",$C$6,IF($G$7=\"2ème\",$C$7,\"\"))))","v":"ALMA 8"},null,{"$f":"IF($G$4=\"2ème\", $D$4,IF($G$5=\"2ème\",$D$5,IF($G$6=\"2ème\",$D$6,IF($G$7=\"2ème\",$D$7,\"\"))))","v":"ALMA 8"}]
["3ème",null,{"$f":"IF($G$4=\"3ème\", $B$4,IF($G$5=\"3ème\",$B$5,IF($G$6=\"3ème\",$B$6,IF($G$7=\"3ème\",$B$7,\"\"))))","v":"SLM 1"},null,{"$f":"IF($G$4=\"3ème\", $C$4,IF($G$5=\"3ème\",$C$5,IF($G$6=\"3ème\",$C$6,IF($G$7=\"3ème\",$C$7,\"\"))))","v":"SLM 1"},null,{"$f":"IF($G$4=\"3ème\", $D$4,IF($G$5=\"3ème\",$D$5,IF($G$6=\"3ème\",$D$6,IF($G$7=\"3ème\",$D$7,\"\"))))","v":"SLM 1"}]
["4ème",null,{"$f":"IF($G$4=\"4ème\", $B$4,IF($G$5=\"4ème\",$B$5,IF($G$6=\"4ème\",$B$6,IF($G$7=\"4ème\",$B$7,\"\"))))","v":0},null,{"$f":"IF($G$4=\"4ème\", $C$4,IF($G$5=\"4ème\",$C$5,IF($G$6=\"4ème\",$C$6,IF($G$7=\"4ème\",$C$7,\"\"))))","v":0},null,{"$f":"IF($G$4=\"4ème\", $D$4,IF($G$5=\"4ème\",$D$5,IF($G$6=\"4ème\",$D$6,IF($G$7=\"4ème\",$D$7,\"\"))))","v":0}]

{"sheet":"Résultats de poule","index":9,"n_rows":11,"n_cols":16,"rows_kept":11,"cut":false,"hidden":false,"merged":[[0,0,0,3],[0,4,0,7],[0,8,0,11],[0,12,0,15],[6,0,6,3],[6,4,6,7],[6,8,6,11],[6,12,6,15]]}
["Poule 1",null,null,null,"Poule 2",null,null,null,"Poule 3",null,null,null,"Poule 4"]
["1er",{"$f":"'Poule 1'!$C21","v":"STAN 1"},{"$f":"'Poule 1'!$E21","v":"STAN 1"},{"$f":"'Poule 1'!$G21","v":"STAN 1"},"1er",{"$f":"'Poule 2'!$C21","v":"ALMA 1"},{"$f":"'Poule 2'!$E21","v":"ALMA 1"},{"$f":"'Poule 2'!$G21","v":"ALMA 1"},"1er",{"$f":"'Poule 3'!$C21","v":"STAN 2"},{"$f":"'Poule 3'!$E21","v":"STAN 2"},{"$f":"'Poule 3'!$G21","v":"STAN 2"},"1er",{"$f":"'Poule 4'!$C21","v":"ALMA 2"},{"$f":"'Poule 4'!$E21","v":"ALMA 2"},{"$f":"'Poule 4'!$G21","v":"ALMA 2"}]
["2ème",{"$f":"'Poule 1'!$C22","v":"ALMA 5"},{"$f":"'Poule 1'!$E22","v":"ALMA 5"},{"$f":"'Poule 1'!$G22","v":"ALMA 5"},"2ème",{"$f":"'Poule 2'!$C22","v":"STAN 6"},{"$f":"'Poule 2'!$E22","v":"STAN 6"},{"$f":"'Poule 2'!$G22","v":"STAN 6"},"2ème",{"$f":"'Poule 3'!$C22","v":"BLOP 2"},{"$f":"'Poule 3'!$E22","v":"BLOP 2"},{"$f":"'Poule 3'!$G22","v":"BLOP 2"},"2ème",{"$f":"'Poule 4'!$C22","v":"PCH 4"},{"$f":"'Poule 4'!$E22","v":"PCH 4"},{"$f":"'Poule 4'!$G22","v":"PCH 4"}]
["3ème",{"$f":"'Poule 1'!$C23","v":"PCH 5"},{"$f":"'Poule 1'!$E23","v":"PCH 5"},{"$f":"'Poule 1'!$G23","v":"PCH 5"},"3ème",{"$f":"'Poule 2'!$C23","v":"PCH 3"},{"$f":"'Poule 2'!$E23","v":"PCH 3"},{"$f":"'Poule 2'!$G23","v":"PCH 3"},"3ème",{"$f":"'Poule 3'!$C23","v":"ALMA 6"},{"$f":"'Poule 3'!$E23","v":"ALMA 6"},{"$f":"'Poule 3'!$G23","v":"ALMA 6"},"3ème",{"$f":"'Poule 4'!$C23","v":"STAN 5"},{"$f":"'Poule 4'!$E23","v":"STAN 5"},{"$f":"'Poule 4'!$G23","v":"STAN 5"}]
["4ème",{"$f":"'Poule 1'!$C24","v":0},{"$f":"'Poule 1'!$E24","v":0},{"$f":"'Poule 1'!$G24","v":0},"4ème",{"$f":"'Poule 2'!$C24","v":0},{"$f":"'Poule 2'!$E24","v":0},{"$f":"'Poule 2'!$G24","v":0},"4ème",{"$f":"'Poule 3'!$C24","v":0},{"$f":"'Poule 3'!$E24","v":0},{"$f":"'Poule 3'!$G24","v":0},"4ème",{"$f":"'Poule 4'!$C24","v":0},{"$f":"'Poule 4'!$E24","v":0},{"$f":"'Poule 4'!$G24","v":0}]
[]
["Poule 5",null,null,null,"Poule 6",null,null,null,"Poule 7",null,null,null,"Poule 8"]
["1er",{"$f":"'Poule 5'!$C21","v":"PCH 1"},{"$f":"'Poule 5'!$E21","v":"PCH 1"},{"$f":"'Poule 5'!$G21","v":"PCH 1"},"1er",{"$f":"'Poule 6'!$C21","v":"ALMA 7"},{"$f":"'Poule 6'!$E21","v":"ALMA 7"},{"$f":"'Poule 6'!$G21","v":"ALMA 7"},"1er",{"$f":"'Poule 7'!$C21","v":"STAN 3"},{"$f":"'Poule 7'!$E21","v":"STAN 3"},{"$f":"'Poule 7'!$G21","v":"STAN 3"},"1er",{"$f":"'Poule 8'!$C21","v":"ALMA 3"},{"$f":"'Poule 8'!$E21","v":"ALMA 3"},{"$f":"'Poule 8'!$G21","v":"ALMA 3"}]
["2ème",{"$f":"'Poule 5'!$C22","v":"STAN 4"},{"$f":"'Poule 5'!$E22","v":"STAN 4"},{"$f":"'Poule 5'!$G22","v":"STAN 4"},"2ème",{"$f":"'Poule 6'!$C22","v":"ALMA 4"},{"$f":"'Poule 6'!$E22","v":"ALMA 4"},{"$f":"'Poule 6'!$G22","v":"ALMA 4"},"2ème",{"$f":"'Poule 7'!$C22","v":"PCH 2"},{"$f":"'Poule 7'!$E22","v":"PCH 2"},{"$f":"'Poule 7'!$G22","v":"PCH 2"},"2ème",{"$f":"'Poule 8'!$C22","v":"ALMA 8"},{"$f":"'Poule 8'!$E22","v":"ALMA 8"},{"$f":"'Poule 8'!$G22","v":"ALMA 8"}]
["3ème",{"$f":"'Poule 5'!$C23","v":"BLOP 3"},{"$f":"'Poule 5'!$E23","v":"BLOP 3"},{"$f":"'Poule 5'!$G23","v":"BLOP 3"},"3ème",{"$f":"'Poule 6'!$C23","v":"BLOP 1"},{"$f":"'Poule 6'!$E23","v":"BLOP 1"},{"$f":"'Poule 6'!$G23","v":"BLOP 1"},"3ème",{"$f":"'Poule 7'!$C23","v":"ALMA 9"},{"$f":"'Poule 7'!$E23","v":"ALMA 9"},{"$f":"'Poule 7'!$G23","v":"ALMA 9"},"3ème",{"$f":"'Poule 8'!$C23","v":"SLM 1"},{"$f":"'Poule 8'!$E23","v":"SLM 1"},{"$f":"'Poule 8'!$G23","v":"SLM 1"}]
["4ème",{"$f":"'Poule 5'!$C24","v":"ALMA 10"},{"$f":"'Poule 5'!$E24","v":"ALMA 10"},{"$f":"'Poule 5'!$G24","v":"ALMA 10"},"4ème",{"$f":"'Poule 6'!$C24","v":0},{"$f":"'Poule 6'!$E24","v":0},{"$f":"'Poule 6'!$G24","v":0},"4ème",{"$f":"'Poule 7'!$C24","v":0},{"$f":"'Poule 7'!$E24","v":0},{"$f":"'Poule 7'!$G24","v":0},"4ème",{"$f":"'Poule 8'!$C24","v":0},{"$f":"'Poule 8'!$E24","v":0},{"$f":"'Poule 8'!$G24","v":0}]

{"sheet":"Tableau","index":10,"n_rows":63,"n_cols":27,"rows_kept":63,"cut":false,"hidden":false,"merged":[[0,0,0,10],[0,12,0,15],[0,16,0,26],[1,0,1,1],[1,6,1,7],[3,16,3,17],[8,6,8,7],[9,19,9,20],[10,16,10,17],[15,25,15,26],[16,6,16,7],[16,22,16,23],[18,16,18,17],[23,6,23,7],[23,19,23,20],[25,16,25,17],[29,19,29,20],[30,4,31,9],[33,0,34,7],[33,8,33,10],[34,8,34,10],[35,2,35,3],[36,2,36,3],[37,2,37,3],[38,2,38,3],[39,2,39,3],[40,2,40,3],[41,2,41,3],[49,2,49,3],[50,2,50,3],[42,2,42,3],[43,2,43,3],[44,2,44,3],[45,2,45,3],[46,2,46,3],[47,2,47,3],[48,2,48,3]]}
["REPECHAGES",null,null,null,null,null,null,null,null,null,null,null,"1er tour de tableau",null,null,null,"Tableau principal"]
[null,null,null,null,null,null,"Perdant 1/4 de finale 2"]
[null,null,null,null,null,null,{"$f":"IF(S12=\"\",\"\",IF(S12=\"p\",R12,R14))","v":""},{"$f":"Q12","v":"PCH 1"}]
[null,null,null,null,null,null,null,null,null,null,null,null,"1er poule 1",{"$f":"'Résultats de poule'!B2","v":"STAN 1"},{"$f":"'Résultats de poule'!D2","v":"STAN 1"},null,"1/4 de finale 1"]
[null,null,null,{"$f":"IF(F3=\"\",\"\",IF(F3=\"v\",G3,G6))","v":""},{"$f":"H3","v":"PCH 1"},null,null,null,null,{"$f":"IF(P4=\"\",\"\",IF(P4=\"p\",O4,O5))","v":""},{"$f":"N5","v":"STAN 6"},null,"2ème poule 2",{"$f":"'Résultats de poule'!F3","v":"STAN 6"},{"$f":"'Résultats de poule'!P5","v":0},null,{"$f":"N4","v":"STAN 1"},{"$f":"IF(P4=\"\",\"\",IF(P4=\"v\",O4,O5))","v":""}]
[null,null,null,null,null,null,{"$f":"IF(I5=\"\",\"\",IF(I5=\"v\",J5,J7))","v":""},{"$f":"K7","v":"PCH 2"},null,null,null,null,null,null,null,null,null,null,null,{"$f":"Q5","v":"STAN 1"},{"$f":"IF(S5=\"\",\"\",IF(S5=\"v\",R5,R7))","v":""}]
[null,null,null,null,null,null,null,null,null,{"$f":"IF(P7=\"\",\"\",IF(P7=\"p\",O7,O8))","v":""},{"$f":"N7","v":"PCH 2"},null,"2ème poule 7",{"$f":"'Résultats de poule'!J9","v":"PCH 2"},{"$f":"'Résultats de poule'!H4","v":"PCH 3"},null,{"$f":"N8","v":"ALMA 3"},{"$f":"IF(P7=\"\",\"\",IF(P7=\"v\",O7,O8))","v":""}]
[{"$f":"IF(C5=\"\",\"\",IF(C5=\"v\",D5,D12))","v":""},{"$f":"E5","v":"PCH 1"},null,null,null,null,null,null,null,null,null,null,"1er poule 8",{"$f":"'Résultats de poule'!N8","v":"ALMA 3"},{"$f":"'Résultats de poule'!L3","v":"BLOP 2"}]
[null,null,null,null,null,null,"Perdant 1/4 de finale 1"]
[null,null,null,null,null,null,{"$f":"IF(S5=\"\",\"\",IF(S5=\"p\",R5,R7))","v":""},{"$f":"Q7","v":"ALMA 3"},null,null,null,null,null,null,null,null,null,null,null,"1/2 finale A",null,null,{"$f":"T6","v":"STAN 1"},{"$f":"IF(V6=\"\",\"\",IF(V6=\"v\",U6,U13))","v":""}]
[null,null,null,null,null,null,null,null,null,null,null,null,"1er poule 5",{"$f":"'Résultats de poule'!B8","v":"PCH 1"},{"$f":"'Résultats de poule'!H3","v":"STAN 6"},null,"1/4 de finale 2"]
[null,null,null,{"$f":"IF(F10=\"\",\"\",IF(F10=\"v\",G10,G13))","v":""},{"$f":"H10","v":"ALMA 3"},null,null,null,null,{"$f":"IF(P11=\"\",\"\",IF(P11=\"p\",O11,O12))","v":""},{"$f":"N12","v":"ALMA 4"},null,"2ème poule 6",{"$f":"'Résultats de poule'!F9","v":"ALMA 4"},{"$f":"'Résultats de poule'!L4","v":"ALMA 6"},null,{"$f":"N11","v":"PCH 1"},{"$f":"IF(P11=\"\",\"\",IF(P11=\"v\",O11,O12))","v":""}]
[null,null,null,null,null,null,{"$f":"IF(I12=\"\",\"\",IF(I12=\"v\",J12,J14))","v":""},{"$f":"K14","v":"BLOP 2"},null,null,null,null,null,null,null,null,null,null,null,{"$f":"Q14","v":"ALMA 2"},{"$f":"IF(S12=\"\",\"\",IF(S12=\"v\",R12,R14))","v":""}]
[null,null,null,null,null,null,null,null,null,{"$f":"IF(P14=\"\",\"\",IF(P14=\"p\",O14,O15))","v":""},{"$f":"N14","v":"BLOP 2"},null,"2ème poule 3",{"$f":"'Résultats de poule'!J3","v":"BLOP 2"},{"$f":"'Résultats de poule'!D5","v":0},null,{"$f":"N15","v":"ALMA 2"},{"$f":"IF(P14=\"\",\"\",IF(P14=\"v\",O14,O15))","v":""}]
[null,null,null,null,null,null,null,null,null,null,null,null,"1er poule 4",{"$f":"'Résultats de poule'!N2","v":"ALMA 2"},{"$f":"'Résultats de poule'!P2","v":"ALMA 2"}]
[null,null,null,null,null,null,null,null,null,null,null,null,null,null,null,null,null,null,null,null,null,null,null,null,null,"Vainqueur"]
[null,null,null,null,null,null,"Perdant 1/4 de finale 4",null,null,null,null,null,null,null,null,null,null,null,null,null,null,null,"FINALE",null,null,{"$f":"IF(Y10=\"\",\"\",IF(Y10=\"v\",W10,W24))","v":""},{"$f":"IF(Y10=\"\",\"\",IF(Y10=\"v\",X10,X24))","v":""}]
[null,null,null,null,null,null,{"$f":"IF(S27=\"\",\"\",IF(S27=\"p\",R27,R29))","v":""},{"$f":"Q27","v":"STAN 3"}]
[null,null,null,null,null,null,null,null,null,null,null,null,"1er poule 3",{"$f":"'Résultats de poule'!J2","v":"STAN 2"},{"$f":"'Résultats de poule'!L2","v":"STAN 2"},null,"1/4 de finale 3"]
[null,null,null,{"$f":"IF(F18=\"\",\"\",IF(F18=\"v\",G18,G21))","v":""},{"$f":"H18","v":"STAN 3"},null,null,null,null,{"$f":"IF(P19=\"\",\"\",IF(P19=\"p\",O19,O20))","v":""},{"$f":"N20","v":"PCH 4"},null,"2ème poule 4",{"$f":"'Résultats de poule'!N3","v":"PCH 4"},{"$f":"'Résultats de poule'!H5","v":0},null,{"$f":"N19","v":"STAN 2"},{"$f":"IF(P19=\"\",\"\",IF(P19=\"v\",O19,O20))","v":""}]
[null,null,null,null,null,null,{"$f":"IF(I20=\"\",\"\",IF(I20=\"v\",J20,J22))","v":""},{"$f":"K22","v":"STAN 4"},null,null,null,null,null,null,null,null,null,null,null,{"$f":"Q22","v":"ALMA 7"},{"$f":"IF(S20=\"\",\"\",IF(S20=\"v\",R20,R22))","v":""}]
[null,null,null,null,null,null,null,null,null,{"$f":"IF(P22=\"\",\"\",IF(P22=\"p\",O22,O23))","v":""},{"$f":"N23","v":"STAN 4"},null,"1er poule 6",{"$f":"'Résultats de poule'!F8","v":"ALMA 7"},{"$f":"'Résultats de poule'!P4","v":"STAN 5"},null,{"$f":"N22","v":"ALMA 7"},{"$f":"IF(P22=\"\",\"\",IF(P22=\"v\",O22,O23))","v":""}]
[null,null,null,null,null,null,null,null,null,null,null,null,"2ème poule 5",{"$f":"'Résultats de poule'!B9","v":"STAN 4"},{"$f":"'Résultats de poule'!D3","v":"ALMA 5"}]
[{"$f":"IF(C20=\"\",\"\",IF(C20=\"v\",D20,D27))","v":""},{"$f":"E27","v":"STAN 2"},null,null,null,null,"Perdant 1/4 de finale 3",null,null,null,null,null,null,null,null,null,null,null,null,"1/2 finale B",null,null,{"$f":"T28","v":"ALMA 1"},{"$f":"IF(V21=\"\",\"\",IF(V21=\"v\",U21,U28))","v":""}]
[null,null,null,null,null,null,{"$f":"IF(S20=\"\",\"\",IF(S20=\"p\",R20,R22))","v":""},{"$f":"Q20","v":"STAN 2"}]
[null,null,null,null,null,null,null,null,null,null,null,null,"1er poule 7",{"$f":"'Résultats de poule'!J8","v":"STAN 3"},{"$f":"'Résultats de poule'!P3","v":"PCH 4"},null,"1/4 de finale 4"]
[null,null,null,{"$f":"IF(F25=\"\",\"\",IF(F25=\"v\",G25,G28))","v":""},{"$f":"H25","v":"STAN 2"},null,null,null,null,{"$f":"IF(P26=\"\",\"\",IF(P26=\"p\",O26,O27))","v":""},{"$f":"N27","v":"ALMA 8"},null,"2ème poule 8",{"$f":"'Résultats de poule'!N9","v":"ALMA 8"},{"$f":"'Résultats de poule'!D4","v":"PCH 5"},null,{"$f":"N26","v":"STAN 3"},{"$f":"IF(P26=\"\",\"\",IF(P26=\"v\",O26,O27))","v":""}]
[null,null,null,null,null,null,{"$f":"IF(I27=\"\",\"\",IF(I27=\"v\",J27,J29))","v":""},{"$f":"K29","v":"ALMA 5"},null,null,null,null,null,null,null,null,null,null,null,{"$f":"Q29","v":"ALMA 1"},{"$f":"IF(S27=\"\",\"\",IF(S27=\"v\",R27,R29))","v":""}]
[null,null,null,null,null,null,null,null,null,{"$f":"IF(P29=\"\",\"\",IF(P29=\"p\",O29,O30))","v":""},{"$f":"N29","v":"ALMA 5"},null,"2ème poule 1",{"$f":"'Résultats de poule'!B3","v":"ALMA 5"},{"$f":"'Résultats de poule'!L5","v":0},null,{"$f":"N30","v":"ALMA 1"},{"$f":"IF(P29=\"\",\"\",IF(P29=\"v\",O29,O30))","v":""}]
[null,null,null,null,null,null,null,null,null,null,null,null,"1er poule 2",{"$f":"'Résultats de poule'!F2","v":"ALMA 1"},{"$f":"'Résultats de poule'!H2","v":"ALMA 1"},null,null,null,null,"Place de 3ème/4ème"]
[null,null,null,null,"MATCHS DE CLASSEMENT",null,null,null,null,null,null,null,null,null,null,null,null,null,null,"ALMA 2",{"$f":"IF(V21=\"\",\"\",IF(V21=\"p\",U21,U28))","v":""}]
[null,null,null,null,null,null,null,null,null,null,null,null,null,null,null,null,null,null,null,null,null,null,{"$f":"T31","v":"ALMA 2"},{"$f":"IF(V31=\"\",\"\",IF(V31=\"v\",U31,U33))","v":""},"3ème"]
[null,null,null,null,null,null,null,null,null,null,null,null,null,null,null,null,null,null,null,"ALMA 7",{"$f":"IF(V6=\"\",\"\",IF(V6=\"p\",U6,U13))","v":""}]
[{"$f":"Engagés!A1","v":"Rencontre Mixte Equipe TT"},null,null,null,null,null,null,null,"CATEGORIE",null,null,null,null,"Place de 5-6",null,null,null,null,null,null,null,null,"Place de 7-8"]
[null,null,null,null,null,null,null,null,{"$f":"IF(Engagés!E3=\"\",\"\",Engagés!E3)","v":"Mixte"},null,null,null,null,{"$f":"B8","v":"PCH 1"},{"$f":"A8","v":""},null,null,null,null,null,null,null,{"$f":"IF(C5=\"\",\"\",IF(C5=\"p\",E5,E12))","v":""},{"$f":"IF(C5=\"\",\"\",IF(C5=\"p\",D5,D12))","v":""},null,null,"7ème"]
["1er","ALMA 1",{"$f":"IF(AA17=\"\",\"\",AA17)","v":""},null,null,null,null,null,null,null,null,null,null,null,null,null,{"$f":"N37","v":"STAN 2"},{"$f":"IF(P35=\"\",\"\",IF(P35=\"v\",O35,O37))","v":""},"5ème",null,null,null,null,null,null,{"$f":"IF(Y35=\"\",\"\",IF(Y35=\"v\",W35,W37))","v":""},{"$f":"IF(Y35=\"\",\"\",IF(Y35=\"v\",X35,X37))","v":""}]
["2ème","STAN 1",{"$f":"IF(Y10=\"\",\"\",IF(Y10=\"p\",X10,X24))","v":""},null,null,null,null,null,null,null,null,null,null,{"$f":"B24","v":"STAN 2"},{"$f":"A24","v":""},null,null,null,null,null,null,null,{"$f":"IF(C20=\"\",\"\",IF(C20=\"p\",E20,E27))","v":""},{"$f":"IF(C20=\"\",\"\",IF(C20=\"p\",D20,D27))","v":""}]
["3ème",{"$f":"IF(W32=\"\",\"\",W32)","v":"ALMA 2"},""]
["4ème","ALMA 7",{"$f":"IF(V31=\"\",\"\",IF(V31=\"p\",U31,U33))","v":""},null,null,null,null,null,null,null,null,null,null,"Place de 9 à 12"]
["5ème",{"$f":"IF(Q36=\"\",\"\",Q36)","v":"STAN 2"},"",null,null,null,null,null,null,null,null,null,null,{"$f":"H6","v":"PCH 2"},{"$f":"IF(F3=\"\",\"\",IF(F3=\"p\",G3,G6))","v":""},null,"Place de 9-10"]
["6ème","PCH 1",{"$f":"IF(P35=\"\",\"\",IF(P35=\"p\",O35,O37))","v":""},null,null,null,null,null,null,null,null,null,null,null,null,null,"PCH 2",{"$f":"IF(P40=\"\",\"\",IF(P40=\"v\",O40,O42))","v":""}]
["7ème","STAN 3",{"$f":"IF(AA36=\"\",\"\",AA36)","v":""},null,null,null,null,null,null,null,null,null,null,"BLO 2",{"$f":"IF(F10=\"\",\"\",IF(F10=\"p\",G10,G13))","v":""}]
["8ème","ALMA 3",{"$f":"IF(Y35=\"\",\"\",IF(Y35=\"p\",X35,X37))","v":""},null,null,null,null,null,null,null,null,null,null,null,null,null,null,null,null,"STAN 4",{"$f":"IF(S41=\"\",\"\",IF(S41=\"v\",R41,R45))","v":""},"9ème"]
["9ème",{"$f":"IF(T43=\"\",\"\",T43)","v":"STAN 4"},"",null,null,null,null,null,null,null,null,null,null,"STAN 4",{"$f":"IF(F18=\"\",\"\",IF(F18=\"p\",G18,G21))","v":""}]
["10ème","PCH 2",{"$f":"IF(S41=\"\",\"\",IF(S41=\"p\",R41,R45))","v":""},null,null,null,null,null,null,null,null,null,null,null,null,null,"STAN 4",{"$f":"IF(P44=\"\",\"\",IF(P44=\"v\",O44,O46))","v":""}]
["11ème",{"$f":"IF(T49=\"\",\"\",T49)","v":"ALMA 5"},"",null,null,null,null,null,null,null,null,null,null,"ALMA 5",{"$f":"IF(F25=\"\",\"\",IF(F25=\"p\",G25,G28))","v":""}]
["12ème","BLO 2",{"$f":"IF(S48=\"\",\"\",IF(S48=\"p\",R48,R50))","v":""},null,null,null,null,null,null,null,null,null,null,null,null,null,"Place de 11-12"]
["13ème",{"$f":"IF(T56=\"\",\"\",T56)","v":"ALMA 4"},"",null,null,null,null,null,null,null,null,null,null,null,null,null,"BLO 2",{"$f":"IF(P42=\"\",\"\",IF(P42=\"p\",O42,O40))","v":""}]
["14ème","ALMA 8",{"$f":"IF(S54=\"\",\"\",IF(S54=\"p\",R54,R58))","v":""},null,null,null,null,null,null,null,null,null,null,null,null,null,null,null,null,"ALMA 5",{"$f":"IF(S48=\"\",\"\",IF(S48=\"v\",R48,R50))","v":""},"11ème"]
["15ème",{"$f":"IF(T62=\"\",\"\",T62)","v":"STAN 6"},"",null,null,null,null,null,null,null,null,null,null,null,null,null,"ALMA 5",{"$f":"IF(P44=\"\",\"\",IF(P44=\"p\",O44,O46))","v":""}]
["16ème","PCH 4",{"$f":"IF(S61=\"\",\"\",IF(S61=\"p\",R61,R63))","v":""}]
[null,null,null,null,null,null,null,null,null,null,null,null,null,"Place de 13 à 16"]
[null,null,null,null,null,null,null,null,null,null,null,null,null,{"$f":"K5","v":"STAN 6"},{"$f":"IF(I5=\"\",\"\",IF(I5=\"p\",J5,J7))","v":""},null,"Place de 13-14"]
[null,null,null,null,null,null,null,null,null,null,null,null,null,null,null,null,{"$f":"N55","v":"ALMA 4"},{"$f":"IF(P53=\"\",\"\",IF(P53=\"v\",O53,O55))","v":""}]
[null,null,null,null,null,null,null,null,null,null,null,null,null,{"$f":"K12","v":"ALMA 4"},{"$f":"IF(I12=\"\",\"\",IF(I12=\"p\",J12,J14))","v":""}]
[null,null,null,null,null,null,null,null,null,null,null,null,null,null,null,null,null,null,null,{"$f":"Q54","v":"ALMA 4"},{"$f":"IF(S54=\"\",\"\",IF(S54=\"v\",R54,R58))","v":""},"13ème"]
[null,null,null,null,null,null,null,null,null,null,null,null,null,{"$f":"K20","v":"PCH 4"},{"$f":"IF(I20=\"\",\"\",IF(I20=\"p\",J20,J22))","v":""}]
[null,null,null,null,null,null,null,null,null,null,null,null,null,null,null,null,{"$f":"N59","v":"ALMA 8"},{"$f":"IF(P57=\"\",\"\",IF(P57=\"v\",O57,O59))","v":""}]
[null,null,null,null,null,null,null,null,null,null,null,null,null,{"$f":"K27","v":"ALMA 8"},{"$f":"IF(I27=\"\",\"\",IF(I27=\"p\",J27,J29))","v":""}]
[null,null,null,null,null,null,null,null,null,null,null,null,null,null,null,null,"Place de 15-16"]
[null,null,null,null,null,null,null,null,null,null,null,null,null,null,null,null,{"$f":"N53","v":"STAN 6"},{"$f":"IF(P53=\"\",\"\",IF(P53=\"p\",O53,O55))","v":""}]
[null,null,null,null,null,null,null,null,null,null,null,null,null,null,null,null,null,null,null,{"$f":"Q61","v":"STAN 6"},{"$f":"IF(S61=\"\",\"\",IF(S61=\"v\",R61,R63))","v":""},"15ème"]
[null,null,null,null,null,null,null,null,null,null,null,null,null,null,null,null,{"$f":"N57","v":"PCH 4"},{"$f":"IF(P57=\"\",\"\",IF(P57=\"p\",O57,O59))","v":""}]

{"sheet":"Tableau perdants","index":11,"n_rows":63,"n_cols":27,"rows_kept":63,"cut":false,"hidden":false,"merged":[[3,16,3,17],[0,0,0,10],[0,12,0,15],[0,16,0,26],[1,0,1,1],[1,6,1,7],[30,4,31,9],[8,6,8,7],[9,19,9,20],[10,16,10,17],[15,25,15,26],[16,6,16,7],[16,22,16,23],[18,16,18,17],[23,6,23,7],[23,19,23,20],[25,16,25,17],[29,19,29,20],[43,2,43,3],[33,0,34,7],[33,8,33,10],[34,8,34,10],[35,2,35,3],[36,2,36,3],[37,2,37,3],[38,2,38,3],[39,2,39,3],[40,2,40,3],[41,2,41,3],[42,2,42,3],[50,2,50,3],[44,2,44,3],[45,2,45,3],[46,2,46,3],[47,2,47,3],[48,2,48,3],[49,2,49,3]]}
["REPECHAGES",null,null,null,null,null,null,null,null,null,null,null,"1er tour de tableau",null,null,null,"Tableau principal"]
[null,null,null,null,null,null,"Perdant 1/4 de finale 2"]
[null,null,null,null,null,null,{"$f":"IF(S12=\"\",\"\",IF(S12=\"p\",R12,R14))","v":""},{"$f":"Q12","v":"BLOP 3"}]
[null,null,null,null,null,null,null,null,null,null,null,null,"3ème poule 1",{"$f":"'Résultats de poule'!B4","v":"PCH 5"},{"$f":"'Résultats de poule'!D2","v":"STAN 1"},null,"1/4 de finale 1"]
[null,null,null,{"$f":"IF(F3=\"\",\"\",IF(F3=\"v\",G3,G6))","v":""},{"$f":"H3","v":"BLOP 3"},null,null,null,null,{"$f":"IF(P4=\"\",\"\",IF(P4=\"p\",O4,O5))","v":""},{"$f":"IF(P4=\"\",\"\",IF(P4=\"p\",N4,N5))","v":""},null,"4ème poule 2",{"$f":"'Résultats de poule'!F5","v":0},{"$f":"'Résultats de poule'!P5","v":0},null,{"$f":"N4","v":"PCH 5"},{"$f":"IF(P4=\"\",\"\",IF(P4=\"v\",O4,O5))","v":""}]
[null,null,null,null,null,null,{"$f":"IF(I5=\"\",\"\",IF(I5=\"v\",J5,J7))","v":""},{"$f":"IF(I5=\"\",\"\",IF(I5=\"v\",K5,K7))","v":""},null,null,null,null,null,null,null,null,null,null,null,{"$f":"Q5","v":"PCH 5"},{"$f":"IF(S5=\"\",\"\",IF(S5=\"v\",R5,R7))","v":""}]
[null,null,null,null,null,null,null,null,null,{"$f":"IF(P7=\"\",\"\",IF(P7=\"p\",O7,O8))","v":""},{"$f":"IF(P7=\"\",\"\",IF(P7=\"p\",N7,N8))","v":""},null,"4ème poule 7",{"$f":"'Résultats de poule'!J11","v":0},{"$f":"'Résultats de poule'!H4","v":"PCH 3"},null,{"$f":"N8","v":"SLM 1"},{"$f":"IF(P7=\"\",\"\",IF(P7=\"v\",O7,O8))","v":""}]
[{"$f":"IF(C5=\"\",\"\",IF(C5=\"v\",D5,D12))","v":""},{"$f":"E12","v":"SLM 1"},null,null,null,null,null,null,null,null,null,null,"3ème poule 8",{"$f":"'Résultats de poule'!N10","v":"SLM 1"},{"$f":"'Résultats de poule'!L3","v":"BLOP 2"}]
[null,null,null,null,null,null,"Perdant 1/4 de finale 1"]
[null,null,null,null,null,null,{"$f":"IF(S5=\"\",\"\",IF(S5=\"p\",R5,R7))","v":""},{"$f":"Q7","v":"SLM 1"},null,null,null,null,null,null,null,null,null,null,null,"1/2 finale A",null,null,{"$f":"T6","v":"PCH 5"},{"$f":"IF(V6=\"\",\"\",IF(V6=\"v\",U6,U13))","v":""}]
[null,null,null,null,null,null,null,null,null,null,null,null,"3ème poule 5",{"$f":"'Résultats de poule'!B10","v":"BLOP 3"},{"$f":"'Résultats de poule'!H3","v":"STAN 6"},null,"1/4 de finale 2"]
[null,null,null,{"$f":"IF(F10=\"\",\"\",IF(F10=\"v\",G10,G13))","v":""},{"$f":"H10","v":"SLM 1"},null,null,null,null,{"$f":"IF(P11=\"\",\"\",IF(P11=\"p\",O11,O12))","v":""},{"$f":"IF(P11=\"\",\"\",IF(P11=\"p\",N11,N12))","v":""},null,"4ème poule 6",{"$f":"'Résultats de poule'!F11","v":0},{"$f":"'Résultats de poule'!L4","v":"ALMA 6"},null,{"$f":"N11","v":"BLOP 3"},{"$f":"IF(P11=\"\",\"\",IF(P11=\"v\",O11,O12))","v":""}]
[null,null,null,null,null,null,{"$f":"IF(I12=\"\",\"\",IF(I12=\"v\",J12,J14))","v":""},{"$f":"IF(I12=\"\",\"\",IF(I12=\"v\",K12,K14))","v":""},null,null,null,null,null,null,null,null,null,null,null,{"$f":"Q14","v":"STAN 5"},{"$f":"IF(S12=\"\",\"\",IF(S12=\"v\",R12,R14))","v":""}]
[null,null,null,null,null,null,null,null,null,{"$f":"IF(P14=\"\",\"\",IF(P14=\"p\",O14,O15))","v":""},{"$f":"IF(P14=\"\",\"\",IF(P14=\"p\",N14,N15))","v":""},null,"4ème poule 3",{"$f":"'Résultats de poule'!J5","v":0},{"$f":"'Résultats de poule'!D5","v":0},null,{"$f":"N15","v":"STAN 5"},{"$f":"IF(P14=\"\",\"\",IF(P14=\"v\",O14,O15))","v":""}]
[null,null,null,null,null,null,null,null,null,null,null,null,"3ème poule 4",{"$f":"'Résultats de poule'!N4","v":"STAN 5"},{"$f":"'Résultats de poule'!P2","v":"ALMA 2"}]
[null,null,null,null,null,null,null,null,null,null,null,null,null,null,null,null,null,null,null,null,null,null,null,null,null,"Vainqueur"]
[null,null,null,null,null,null,"Perdant 1/4 de finale 4",null,null,null,null,null,null,null,null,null,null,null,null,null,null,null,"FINALE",null,null,{"$f":"W24","v":"ALMA 6"},{"$f":"IF(Y10=\"\",\"\",IF(Y10=\"v\",X10,X24))","v":""}]
[null,null,null,null,null,null,{"$f":"IF(S27=\"\",\"\",IF(S27=\"p\",R27,R29))","v":""},{"$f":"Q29","v":"PCH 3"}]
[null,null,null,null,null,null,null,null,null,null,null,null,"3ème poule 3",{"$f":"'Résultats de poule'!J4","v":"ALMA 6"},{"$f":"'Résultats de poule'!L2","v":"STAN 2"},null,"1/4 de finale 3"]
[null,null,null,{"$f":"IF(F18=\"\",\"\",IF(F18=\"v\",G18,G21))","v":""},{"$f":"H18","v":"PCH 3"},null,null,null,null,{"$f":"IF(P19=\"\",\"\",IF(P19=\"p\",O19,O20))","v":""},{"$f":"IF(P19=\"\",\"\",IF(P19=\"p\",N19,N20))","v":""},null,"4ème poule 4",{"$f":"'Résultats de poule'!N5","v":0},{"$f":"'Résultats de poule'!H5","v":0},null,{"$f":"N19","v":"ALMA 6"},{"$f":"IF(P19=\"\",\"\",IF(P19=\"v\",O19,O20))","v":""}]
[null,null,null,null,null,null,{"$f":"IF(I20=\"\",\"\",IF(I20=\"v\",J20,J22))","v":""},{"$f":"K22","v":"ALMA 10"},null,null,null,null,null,null,null,null,null,null,null,{"$f":"Q20","v":"ALMA 6"},{"$f":"IF(S20=\"\",\"\",IF(S20=\"v\",R20,R22))","v":""}]
[null,null,null,null,null,null,null,null,null,{"$f":"IF(P22=\"\",\"\",IF(P22=\"p\",O22,O23))","v":""},{"$f":"N23","v":"ALMA 10"},null,"3ème poule 6",{"$f":"'Résultats de poule'!F10","v":"BLOP 1"},{"$f":"'Résultats de poule'!P4","v":"STAN 5"},null,{"$f":"N22","v":"BLOP 1"},{"$f":"IF(P22=\"\",\"\",IF(P22=\"v\",O22,O23))","v":""}]
[null,null,null,null,null,null,null,null,null,null,null,null,"4ème poule 5",{"$f":"'Résultats de poule'!B11","v":"ALMA 10"},{"$f":"'Résultats de poule'!D3","v":"ALMA 5"}]
[{"$f":"IF(C20=\"\",\"\",IF(C20=\"v\",D20,D27))","v":""},{"$f":"E20","v":"PCH 3"},null,null,null,null,"Perdant 1/4 de finale 3",null,null,null,null,null,null,null,null,null,null,null,null,"1/2 finale B",null,null,{"$f":"T21","v":"ALMA 6"},{"$f":"IF(V21=\"\",\"\",IF(V21=\"v\",U21,U28))","v":""}]
[null,null,null,null,null,null,{"$f":"IF(S20=\"\",\"\",IF(S20=\"p\",R20,R22))","v":""},{"$f":"Q22","v":"BLOP 1"}]
[null,null,null,null,null,null,null,null,null,null,null,null,"3ème poule 7",{"$f":"'Résultats de poule'!J10","v":"ALMA 9"},{"$f":"'Résultats de poule'!P3","v":"PCH 4"},null,"1/4 de finale 4"]
[null,null,null,{"$f":"IF(F25=\"\",\"\",IF(F25=\"v\",G25,G28))","v":""},{"$f":"H25","v":"BLOP 1"},null,null,null,null,{"$f":"IF(P26=\"\",\"\",IF(P26=\"p\",O26,O27))","v":""},{"$f":"IF(P26=\"\",\"\",IF(P26=\"p\",N26,N27))","v":""},null,"4ème poule 8",{"$f":"'Résultats de poule'!N11","v":0},{"$f":"'Résultats de poule'!D4","v":"PCH 5"},null,{"$f":"N26","v":"ALMA 9"},{"$f":"IF(P26=\"\",\"\",IF(P26=\"v\",O26,O27))","v":""}]
[null,null,null,null,null,null,{"$f":"IF(I27=\"\",\"\",IF(I27=\"v\",J27,J29))","v":""},{"$f":"IF(I27=\"\",\"\",IF(I27=\"v\",K27,K29))","v":""},null,null,null,null,null,null,null,null,null,null,null,{"$f":"Q27","v":"ALMA 9"},{"$f":"IF(S27=\"\",\"\",IF(S27=\"v\",R27,R29))","v":""}]
[null,null,null,null,null,null,null,null,null,{"$f":"IF(P29=\"\",\"\",IF(P29=\"p\",O29,O30))","v":""},{"$f":"IF(P29=\"\",\"\",IF(P29=\"p\",N29,N30))","v":""},null,"4ème poule 1",{"$f":"'Résultats de poule'!B5","v":0},{"$f":"'Résultats de poule'!L5","v":0},null,{"$f":"N30","v":"PCH 3"},{"$f":"IF(P29=\"\",\"\",IF(P29=\"v\",O29,O30))","v":""}]
[null,null,null,null,null,null,null,null,null,null,null,null,"3ème poule 2",{"$f":"'Résultats de poule'!F4","v":"PCH 3"},{"$f":"'Résultats de poule'!H2","v":"ALMA 1"},null,null,null,null,"Place de 3ème/4ème"]
[null,null,null,null,"MATCHS DE CLASSEMENT",null,null,null,null,null,null,null,null,null,null,null,null,null,null,"STAN 5",{"$f":"IF(V21=\"\",\"\",IF(V21=\"p\",U21,U28))","v":""}]
[null,null,null,null,null,null,null,null,null,null,null,null,null,null,null,null,null,null,null,null,null,null,"STAN 5",{"$f":"IF(V31=\"\",\"\",IF(V31=\"v\",U31,U33))","v":""},"3ème"]
[null,null,null,null,null,null,null,null,null,null,null,null,null,null,null,null,null,null,null,{"$f":"T28","v":"ALMA 9"},{"$f":"IF(V6=\"\",\"\",IF(V6=\"p\",U6,U13))","v":""}]
[{"$f":"Engagés!A1","v":"Rencontre Mixte Equipe TT"},null,null,null,null,null,null,null,"CATEGORIE",null,null,null,null,"Place de 5-6",null,null,null,null,null,null,null,null,"Place de 7-8"]
[null,null,null,null,null,null,null,null,{"$f":"IF(Engagés!E3=\"\",\"\",Engagés!E3)","v":"Mixte"},null,null,null,null,{"$f":"B8","v":"SLM 1"},{"$f":"A8","v":""},null,null,null,null,null,null,null,"BLO 3",{"$f":"IF(C5=\"\",\"\",IF(C5=\"p\",D5,D12))","v":""},null,null,"7ème"]
["17ème",{"$f":"IF(Z17=\"\",\"\",Z17)","v":"ALMA 6"},"",null,null,null,null,null,null,null,null,null,null,null,null,null,{"$f":"N35","v":"SLM 1"},{"$f":"IF(P35=\"\",\"\",IF(P35=\"v\",O35,O37))","v":""},"5ème",null,null,null,null,null,null,{"$f":"IF(Y35=\"\",\"\",IF(Y35=\"v\",W35,W37))","v":""},{"$f":"IF(Y35=\"\",\"\",IF(Y35=\"v\",X35,X37))","v":""}]
["18ème","PCH 5",{"$f":"IF(Y10=\"\",\"\",IF(Y10=\"p\",X10,X24))","v":""},null,null,null,null,null,null,null,null,null,null,{"$f":"B24","v":"PCH 3"},{"$f":"A24","v":""},null,null,null,null,null,null,null,"BLO 1",{"$f":"IF(C20=\"\",\"\",IF(C20=\"p\",D20,D27))","v":""}]
["19ème",{"$f":"IF(W32=\"\",\"\",W32)","v":"STAN 5"},""]
["20ème","ALMA 9",{"$f":"IF(V31=\"\",\"\",IF(V31=\"p\",U31,U33))","v":""},null,null,null,null,null,null,null,null,null,null,"Place de 9 à 12"]
["21er",{"$f":"IF(Q36=\"\",\"\",Q36)","v":"SLM 1"},"",null,null,null,null,null,null,null,null,null,null,{"$f":"IF(F3=\"\",\"\",IF(F3=\"p\",H3,H6))","v":""},{"$f":"IF(F3=\"\",\"\",IF(F3=\"p\",G3,G6))","v":""},null,"Place de 9-10"]
["22ème","PCH 3",{"$f":"IF(P35=\"\",\"\",IF(P35=\"p\",O35,O37))","v":""},null,null,null,null,null,null,null,null,null,null,null,null,null,{"$f":"IF(P40=\"\",\"\",IF(P40=\"v\",N40,N42))","v":""},{"$f":"IF(P40=\"\",\"\",IF(P40=\"v\",O40,O42))","v":""}]
["23ème","BLO 3",{"$f":"IF(AA36=\"\",\"\",AA36)","v":""},null,null,null,null,null,null,null,null,null,null,{"$f":"IF(F10=\"\",\"\",IF(F10=\"p\",H10,H13))","v":""},{"$f":"IF(F10=\"\",\"\",IF(F10=\"p\",G10,G13))","v":""}]
["24ème","BLO 1",{"$f":"IF(Y35=\"\",\"\",IF(Y35=\"p\",X35,X37))","v":""},null,null,null,null,null,null,null,null,null,null,null,null,null,null,null,null,{"$f":"Q45","v":"ALMA 10"},{"$f":"IF(S41=\"\",\"\",IF(S41=\"v\",R41,R45))","v":""},"9ème"]
["25ème",{"$f":"IF(T43=\"\",\"\",T43)","v":"ALMA 10"},"",null,null,null,null,null,null,null,null,null,null,{"$f":"IF(F18=\"\",\"\",IF(F18=\"p\",H18,H21))","v":""},{"$f":"IF(F18=\"\",\"\",IF(F18=\"p\",G18,G21))","v":""}]
["26ème",{"$f":"IF(S41=\"\",\"\",IF(S41=\"p\",Q41,Q45))","v":""},{"$f":"IF(S41=\"\",\"\",IF(S41=\"p\",R41,R45))","v":""},null,null,null,null,null,null,null,null,null,null,null,null,null,{"$f":"N46","v":"ALMA 10"},{"$f":"IF(P44=\"\",\"\",IF(P44=\"v\",O44,O46))","v":""}]
["27ème",{"$f":"IF(T49=\"\",\"\",T49)","v":""},"",null,null,null,null,null,null,null,null,null,null,{"$f":"K22","v":"ALMA 10"},{"$f":"IF(F25=\"\",\"\",IF(F25=\"p\",G25,G28))","v":""}]
["28ème",{"$f":"IF(S48=\"\",\"\",IF(S48=\"p\",Q48,Q50))","v":""},{"$f":"IF(S48=\"\",\"\",IF(S48=\"p\",R48,R50))","v":""},null,null,null,null,null,null,null,null,null,null,null,null,null,"Place de 11-12"]
["29ème",{"$f":"IF(T56=\"\",\"\",T56)","v":""},"",null,null,null,null,null,null,null,null,null,null,null,null,null,{"$f":"IF(P40=\"\",\"\",IF(P40=\"p\",N40,N42))","v":""},{"$f":"IF(P42=\"\",\"\",IF(P42=\"p\",O42,O40))","v":""}]
["30ème",{"$f":"IF(S54=\"\",\"\",IF(S54=\"p\",Q54,Q58))","v":""},{"$f":"IF(S54=\"\",\"\",IF(S54=\"p\",R54,R58))","v":""},null,null,null,null,null,null,null,null,null,null,null,null,null,null,null,null,{"$f":"IF(S48=\"\",\"\",IF(S48=\"v\",Q48,Q50))","v":""},{"$f":"IF(S48=\"\",\"\",IF(S48=\"v\",R48,R50))","v":""},"11ème"]
["31er",{"$f":"IF(T62=\"\",\"\",T62)","v":""},"",null,null,null,null,null,null,null,null,null,null,null,null,null,{"$f":"IF(P44=\"\",\"\",IF(P44=\"p\",N44,N46))","v":""},{"$f":"IF(P44=\"\",\"\",IF(P44=\"p\",O44,O46))","v":""}]
["32ème",{"$f":"IF(S61=\"\",\"\",IF(S61=\"p\",Q61,Q63))","v":""},{"$f":"IF(S61=\"\",\"\",IF(S61=\"p\",R61,R63))","v":""}]
[null,null,null,null,null,null,null,null,null,null,null,null,null,"Place de 13 à 16"]
[null,null,null,null,null,null,null,null,null,null,null,null,null,{"$f":"IF(I5=\"\",\"\",IF(I5=\"p\",K5,K7))","v":""},{"$f":"IF(I5=\"\",\"\",IF(I5=\"p\",J5,J7))","v":""},null,"Place de 13-14"]
[null,null,null,null,null,null,null,null,null,null,null,null,null,null,null,null,{"$f":"IF(P53=\"\",\"\",IF(P53=\"v\",N53,N55))","v":""},{"$f":"IF(P53=\"\",\"\",IF(P53=\"v\",O53,O55))","v":""}]
[null,null,null,null,null,null,null,null,null,null,null,null,null,{"$f":"IF(I12=\"\",\"\",IF(I12=\"p\",K12,K14))","v":""},{"$f":"IF(I12=\"\",\"\",IF(I12=\"p\",J12,J14))","v":""}]
[null,null,null,null,null,null,null,null,null,null,null,null,null,null,null,null,null,null,null,{"$f":"IF(S54=\"\",\"\",IF(S54=\"v\",Q54,Q58))","v":""},{"$f":"IF(S54=\"\",\"\",IF(S54=\"v\",R54,R58))","v":""},"13ème"]
[null,null,null,null,null,null,null,null,null,null,null,null,null,{"$f":"IF(I20=\"\",\"\",IF(I20=\"p\",K20,K22))","v":""},{"$f":"IF(I20=\"\",\"\",IF(I20=\"p\",J20,J22))","v":""}]
[null,null,null,null,null,null,null,null,null,null,null,null,null,null,null,null,{"$f":"IF(P57=\"\",\"\",IF(P57=\"v\",N57,N59))","v":""},{"$f":"IF(P57=\"\",\"\",IF(P57=\"v\",O57,O59))","v":""}]
[null,null,null,null,null,null,null,null,null,null,null,null,null,{"$f":"IF(I27=\"\",\"\",IF(I27=\"p\",K27,K29))","v":""},{"$f":"IF(I27=\"\",\"\",IF(I27=\"p\",J27,J29))","v":""}]
[null,null,null,null,null,null,null,null,null,null,null,null,null,null,null,null,"Place de 15-16"]
[null,null,null,null,null,null,null,null,null,null,null,null,null,null,null,null,{"$f":"IF(P53=\"\",\"\",IF(P53=\"p\",N53,N55))","v":""},{"$f":"IF(P53=\"\",\"\",IF(P53=\"p\",O53,O55))","v":""}]
[null,null,null,null,null,null,null,null,null,null,null,null,null,null,null,null,null,null,null,{"$f":"IF(S61=\"\",\"\",IF(S61=\"v\",Q61,Q63))","v":""},{"$f":"IF(S61=\"\",\"\",IF(S61=\"v\",R61,R63))","v":""},"15ème"]
[null,null,null,null,null,null,null,null,null,null,null,null,null,null,null,null,{"$f":"IF(P57=\"\",\"\",IF(P57=\"p\",N57,N59))","v":""},{"$f":"IF(P57=\"\",\"\",IF(P57=\"p\",O57,O59))","v":""}]