{"text_format":"1","workbook":"xlsx","n_sheets":12,"sheets":["Engagés","Poule 17","Poule 18","Poule 19","Poule 20","Poule 21","Poule 22","Poule 23","Poule 24","Résultats de poule","Tableau","Classement"],"not_rendered":{"charts":0,"images":81,"macros":1,"external_links":0,"defined_names":1,"comments":0,"pivot_tables":0},"unopened":[],"bounds":{"document_bytes":16777216,"sheet_cells":100000,"rows_first":2000,"rows_last":500,"rows_between":2000,"halvings":0,"cell_chars":16384,"cell_head_chars":4096},"cells_cut":0,"cells_raw":0,"read":"whole","date_system":"1900"}

{"sheet":"Engagés","index":0,"n_rows":37,"n_cols":14,"rows_kept":37,"cut":false,"hidden":false,"merged":[[0,0,2,1],[0,2,1,2],[23,6,23,9],[23,10,23,13],[5,10,5,13],[5,6,5,9],[11,6,11,9],[11,10,11,13],[17,6,17,9],[17,10,17,13]]}
["Qualifications championnat Comité de Paris ",null,"TENNIS DE TABLE","DATE :","13 dec"]
[null,null,null,"LIEU :","Stanislas"]
[null,null,"TABLEAU C","CATEGORIE :","MG Promo"]
["Tête de série","ETABLISSEMENT","NOM","PRENOM","SIGLE"]
[]
[1,null,"PINCEMIN","PAUL","75-4-FENP",null,"Poule 17",null,null,null,"Poule 18"]
[2,null,"RODIER","MATTEO","75-4-LMAP",null,1,{"$f":"VLOOKUP($G7,$A$1:$E$37,3,FALSE)","v":"PINCEMIN"},{"$f":"VLOOKUP($G7,$A$1:$E$37,4,FALSE)","v":"PAUL"},{"$f":"VLOOKUP($G7,$A$1:$E$37,5,FALSE)","v":"75-4-FENP"},2,{"$f":"VLOOKUP($K7,$A$1:$E$37,3,FALSE)","v":"RODIER"},{"$f":"VLOOKUP($K7,$A$1:$E$37,4,FALSE)","v":"MATTEO"},{"$f":"VLOOKUP($K7,$A$1:$E$37,5,FALSE)","v":"75-4-LMAP"}]
[3,null,"GILLIS--JOLIVET","ARTHUR","75-2-NDLP",null,16,{"$f":"VLOOKUP($G8,$A$1:$E$37,3,FALSE)","v":"REMONDELLI"},{"$f":"VLOOKUP($G8,$A$1:$E$37,4,FALSE)","v":"SACHA"},{"$f":"VLOOKUP($G8,$A$1:$E$37,5,FALSE)","v":"75-2-SPFP"},15,{"$f":"VLOOKUP($K8,$A$1:$E$37,3,FALSE)","v":0},{"$f":"VLOOKUP($K8,$A$1:$E$37,4,FALSE)","v":0},{"$f":"VLOOKUP($K8,$A$1:$E$37,5,FALSE)","v":0}]
[4,null,"LERICHE","GAETAN","75-4-STAP",null,17,{"$f":"VLOOKUP($G9,$A$1:$E$37,3,FALSE)","v":0},{"$f":"VLOOKUP($G9,$A$1:$E$37,4,FALSE)","v":0},{"$f":"VLOOKUP($G9,$A$1:$E$37,5,FALSE)","v":0},18,{"$f":"VLOOKUP($K9,$A$1:$E$37,3,FALSE)","v":"IFATUROTI"},{"$f":"VLOOKUP($K9,$A$1:$E$37,4,FALSE)","v":"PIERRE"},{"$f":"VLOOKUP($K9,$A$1:$E$37,5,FALSE)","v":"75-2-SPFP"}]
[5,null,"CHOTARD","MARCUS","75-4-LMAP",null,32,{"$f":"VLOOKUP($G10,$A$1:$E$37,3,FALSE)","v":0},{"$f":"VLOOKUP($G10,$A$1:$E$37,4,FALSE)","v":0},{"$f":"VLOOKUP($G10,$A$1:$E$37,5,FALSE)","v":0},31,{"$f":"VLOOKUP($K10,$A$1:$E$37,3,FALSE)","v":"GUILLEMETTE"},{"$f":"VLOOKUP($K10,$A$1:$E$37,4,FALSE)","v":"BAPTISTE"},{"$f":"VLOOKUP($K10,$A$1:$E$37,5,FALSE)","v":"75-4-PCHP"}]
{"$rows_left_out":28}
{"sheet":"Poule 17","index":1,"n_rows":24,"n_cols":7,"rows_kept":24,"cut":false,"hidden":false,"merged":[[0,0,0,2],[0,3,0,4],[22,0,22,1],[20,2,20,3],[23,4,23,5],[22,4,22,5],[13,0,13,6],[14,3,14,4],[23,2,23,3],[21,0,21,1],[23,0,23,1],[21,2,21,3],[19,4,19,5],[20,4,20,5],[7,0,7,6],[8,3,8,4],[8,0,8,2],[9,0,9,2],[10,0,10,2],[1,0,1,2],[1,3,1,6],[22,2,22,3],[20,0,20,1],[18,4,18,6],[11,0,11,2],[12,0,12,2],[14,0,14,2],[17,0,17,2],[18,0,18,3],[21,4,21,5],[19,0,19,1],[15,0,15,2],[16,0,16,2],[19,2,19,3]]}
["TENNIS DE TABLE",null,null,{"$f":"Engagés!C3","v":"TABLEAU C"}]
[{"$f":"Engagés!G6","v":"Poule 17"}]
[null,"NOM","Prénom","Sigle","Vict","Def","Classement"]
[1,{"$f":"VLOOKUP($A4,Engagés!$A$1:$E$380,3,FALSE)","v":"PINCEMIN"},{"$f":"VLOOKUP($A4,Engagés!$A$1:$E$380,4,FALSE)","v":"PAUL"},{"$f":"VLOOKUP($A4,Engagés!$A$1:$E$380,5,FALSE)","v":"75-4-FENP"},null,null,"1er"]
[16,{"$f":"VLOOKUP($A5,Engagés!$A$1:$E$380,3,FALSE)","v":"REMONDELLI"},{"$f":"VLOOKUP($A5,Engagés!$A$1:$E$380,4,FALSE)","v":"SACHA"},{"$f":"VLOOKUP($A5,Engagés!$A$1:$E$380,5,FALSE)","v":"75-2-SPFP"},null,null,"2ème"]
[17,{"$f":"VLOOKUP($A6,Engagés!$A$1:$E$380,3,FALSE)","v":0},{"$f":"VLOOKUP($A6,Engagés!$A$1:$E$380,4,FALSE)","v":0},{"$f":"VLOOKUP($A6,Engagés!$A$1:$E$380,5,FALSE)","v":0},null,null,"3ème"]
[32,{"$f":"VLOOKUP($A7,Engagés!$A$1:$E$380,3,FALSE)","v":0},{"$f":"VLOOKUP($A7,Engagés!$A$1:$E$380,4,FALSE)","v":0},{"$f":"VLOOKUP($A7,Engagés!$A$1:$E$380,5,FALSE)","v":0},null,null,"4ème"]
["Si poule de 4 joueurs alors…"]
["Déroulement",null,null,"Joueurs A contre Joueur B",null,"Vainqueur","Score"]
["Match 1",null,null,{"$f":"B4","v":"PINCEMIN"},{"$f":"B7","v":0}]
{"$rows_left_out":15}
{"sheet":"Poule 18","index":2,"n_rows":24,"n_cols":7,"rows_kept":24,"cut":false,"hidden":false,"merged":[[0,3,0,4],[15,0,15,2],[16,0,16,2],[1,0,1,2],[1,3,1,6],[7,0,7,6],[8,0,8,2],[8,3,8,4],[9,0,9,2],[10,0,10,2],[11,0,11,2],[12,0,12,2],[13,0,13,6],[14,0,14,2],[14,3,14,4],[0,0,0,2],[17,0,17,2],[18,0,18,3],[18,4,18,6],[20,0,20,1],[20,2,20,3],[20,4,20,5],[19,0,19,1],[19,2,19,3],[19,4,19,5],[23,0,23,1],[23,2,23,3],[23,4,23,5],[21,0,21,1],[21,2,21,3],[21,4,21,5],[22,0,22,1],[22,2,22,3],[22,4,22,5]]}
["TENNIS DE TABLE",null,null,{"$f":"Engagés!C3","v":"TABLEAU C"}]
[{"$f":"Engagés!K6","v":"Poule 18"}]
[null,"NOM","Prénom","Sigle","Vict","Def","Classement"]
[2,{"$f":"VLOOKUP($A4,Engagés!$A$1:$E$380,3,FALSE)","v":"RODIER"},{"$f":"VLOOKUP($A4,Engagés!$A$1:$E$380,4,FALSE)","v":"MATTEO"},{"$f":"VLOOKUP($A4,Engagés!$A$1:$E$380,5,FALSE)","v":"75-4-LMAP"},null,null,"1er"]
[15,{"$f":"VLOOKUP($A5,Engagés!$A$1:$E$380,3,FALSE)","v":0},{"$f":"VLOOKUP($A5,Engagés!$A$1:$E$380,4,FALSE)","v":0},{"$f":"VLOOKUP($A5,Engagés!$A$1:$E$380,5,FALSE)","v":0},null,null,"4ème"]
[18,{"$f":"VLOOKUP($A6,Engagés!$A$1:$E$380,3,FALSE)","v":"IFATUROTI"},{"$f":"VLOOKUP($A6,Engagés!$A$1:$E$380,4,FALSE)","v":"PIERRE"},{"$f":"VLOOKUP($A6,Engagés!$A$1:$E$380,5,FALSE)","v":"75-2-SPFP"},null,null,"3ème"]
[31,{"$f":"VLOOKUP($A7,Engagés!$A$1:$E$380,3,FALSE)","v":"GUILLEMETTE"},{"$f":"VLOOKUP($A7,Engagés!$A$1:$E$380,4,FALSE)","v":"BAPTISTE"},{"$f":"VLOOKUP($A7,Engagés!$A$1:$E$380,5,FALSE)","v":"75-4-PCHP"},null,null,"2ème"]
["Si poule de 4 joueurs alors…"]
["Déroulement",null,null,"Joueurs A contre Joueur B",null,"Vainqueur","Score"]
["Match 1",null,null,{"$f":"B4","v":"RODIER"},{"$f":"B7","v":"GUILLEMETTE"}]
{"$rows_left_out":15}
{"sheet":"Poule 19","index":3,"n_rows":24,"n_cols":7,"rows_kept":24,"cut":false,"hidden":false,"merged":[[0,3,0,4],[15,0,15,2],[16,0,16,2],[1,0,1,2],[1,3,1,6],[7,0,7,6],[8,0,8,2],[8,3,8,4],[9,0,9,2],[10,0,10,2],[11,0,11,2],[12,0,12,2],[13,0,13,6],[14,0,14,2],[14,3,14,4],[0,0,0,2],[17,0,17,2],[18,0,18,3],[18,4,18,6],[20,0,20,1],[20,2,20,3],[20,4,20,5],[19,0,19,1],[19,2,19,3],[19,4,19,5],[23,0,23,1],[23,2,23,3],[23,4,23,5],[21,0,21,1],[21,2,21,3],[21,4,21,5],[22,0,22,1],[22,2,22,3],[22,4,22,5]]}
["TENNIS DE TABLE",null,null,{"$f":"Engagés!C3","v":"TABLEAU C"}]
[{"$f":"Engagés!G12","v":"Poule 19"}]
[null,"NOM","Prénom","Sigle","Vict","Def","Classement"]
[3,{"$f":"VLOOKUP($A4,Engagés!$A$1:$E$380,3,FALSE)","v":"GILLIS--JOLIVET"},{"$f":"VLOOKUP($A4,Engagés!$A$1:$E$380,4,FALSE)","v":"ARTHUR"},{"$f":"VLOOKUP($A4,Engagés!$A$1:$E$380,5,FALSE)","v":"75-2-NDLP"},null,null,"1er"]
[14,{"$f":"VLOOKUP($A5,Engagés!$A$1:$E$380,3,FALSE)","v":"LE ROY"},{"$f":"VLOOKUP($A5,Engagés!$A$1:$E$380,4,FALSE)","v":"CLEMENT"},{"$f":"VLOOKUP($A5,Engagés!$A$1:$E$380,5,FALSE)","v":"75-4-LMAP"},null,null,"3ème"]
[19,{"$f":"VLOOKUP($A6,Engagés!$A$1:$E$380,3,FALSE)","v":"BRICOGNE"},{"$f":"VLOOKUP($A6,Engagés!$A$1:$E$380,4,FALSE)","v":"ARTHUS"},{"$f":"VLOOKUP($A6,Engagés!$A$1:$E$380,5,FALSE)","v":"75-4-FENP"},null,null,"2ème"]
[30,{"$f":"VLOOKUP($A7,Engagés!$A$1:$E$380,3,FALSE)","v":0},{"$f":"VLOOKUP($A7,Engagés!$A$1:$E$380,4,FALSE)","v":0},{"$f":"VLOOKUP($A7,Engagés!$A$1:$E$380,5,FALSE)","v":0},null,null,"4ème"]
["Si poule de 4 joueurs alors…"]
["Déroulement",null,null,"Joueurs A contre Joueur B",null,"Vainqueur","Score"]
["Match 1",null,null,{"$f":"B4","v":"GILLIS--JOLIVET"},{"$f":"B7","v":0}]
{"$rows_left_out":15}
{"sheet":"Poule 20","index":4,"n_rows":24,"n_cols":7,"rows_kept":24,"cut":false,"hidden":false,"merged":[[0,3,0,4],[15,0,15,2],[16,0,16,2],[1,0,1,2],[1,3,1,6],[7,0,7,6],[8,0,8,2],[8,3,8,4],[9,0,9,2],[10,0,10,2],[11,0,11,2],[12,0,12,2],[13,0,13,6],[14,0,14,2],[14,3,14,4],[0,0,0,2],[17,0,17,2],[18,0,18,3],[18,4,18,6],[20,0,20,1],[20,2,20,3],[20,4,20,5],[19,0,19,1],[19,2,19,3],[19,4,19,5],[23,0,23,1],[23,2,23,3],[23,4,23,5],[21,0,21,1],[21,2,21,3],[21,4,21,5],[22,0,22,1],[22,2,22,3],[22,4,22,5]]}
["TENNIS DE TABLE",null,null,{"$f":"Engagés!C3","v":"TABLEAU C"}]
[{"$f":"Engagés!K12","v":"Poule 20"}]
[null,"NOM","Prénom","Sigle","Vict","Def","Classement"]
[4,{"$f":"VLOOKUP($A4,Engagés!$A$1:$E$380,3,FALSE)","v":"LERICHE"},{"$f":"VLOOKUP($A4,Engagés!$A$1:$E$380,4,FALSE)","v":"GAETAN"},{"$f":"VLOOKUP($A4,Engagés!$A$1:$E$380,5,FALSE)","v":"75-4-STAP"},null,null,"1er"]
[13,{"$f":"VLOOKUP($A5,Engagés!$A$1:$E$380,3,FALSE)","v":0},{"$f":"VLOOKUP($A5,Engagés!$A$1:$E$380,4,FALSE)","v":0},{"$f":"VLOOKUP($A5,Engagés!$A$1:$E$380,5,FALSE)","v":0},null,null,"3ème"]
[20,{"$f":"VLOOKUP($A6,Engagés!$A$1:$E$380,3,FALSE)","v":"DE PREVAL"},{"$f":"VLOOKUP($A6,Engagés!$A$1:$E$380,4,FALSE)","v":"THEODORE"},{"$f":"VLOOKUP($A6,Engagés!$A$1:$E$380,5,FALSE)","v":"75-4-LMAP"},null,null,"2ème"]
[29,{"$f":"VLOOKUP($A7,Engagés!$A$1:$E$380,3,FALSE)","v":0},{"$f":"VLOOKUP($A7,Engagés!$A$1:$E$380,4,FALSE)","v":0},{"$f":"VLOOKUP($A7,Engagés!$A$1:$E$380,5,FALSE)","v":0},null,null,"4ème"]
["Si poule de 4 joueurs alors…"]
["Déroulement",null,null,"Joueurs A contre Joueur B",null,"Vainqueur","Score"]
["Match 1",null,null,{"$f":"B4","v":"LERICHE"},{"$f":"B7","v":0},0]
{"$rows_left_out":15}
{"sheet":"Poule 21","index":5,"n_rows":24,"n_cols":7,"rows_kept":24,"cut":false,"hidden":false,"merged":[[13,0,13,6],[10,0,10,2],[11,0,11,2],[1,0,1,2],[1,3,1,6],[7,0,7,6],[8,0,8,2],[8,3,8,4],[9,0,9,2],[0,0,0,2],[0,3,0,4],[20,0,20,1],[20,2,20,3],[20,4,20,5],[14,0,14,2],[14,3,14,4],[15,0,15,2],[18,4,18,6],[19,0,19,1],[19,2,19,3],[19,4,19,5],[16,0,16,2],[17,0,17,2],[18,0,18,3],[12,0,12,2],[23,0,23,1],[23,2,23,3],[23,4,23,5],[21,0,21,1],[21,2,21,3],[21,4,21,5],[22,0,22,1],[22,2,22,3],[22,4,22,5]]}
["TENNIS DE TABLE",null,null,{"$f":"Engagés!C3","v":"TABLEAU C"}]
[{"$f":"Engagés!G18","v":"Poule 21"}]
[null,"NOM","Prénom","Sigle","Vict","Def","Classement"]
[5,{"$f":"VLOOKUP($A4,Engagés!$A$1:$E$380,3,FALSE)","v":"CHOTARD"},{"$f":"VLOOKUP($A4,Engagés!$A$1:$E$380,4,FALSE)","v":"MARCUS"},{"$f":"VLOOKUP($A4,Engagés!$A$1:$E$380,5,FALSE)","v":"75-4-LMAP"},null,null,"2ème"]
[12,{"$f":"VLOOKUP($A5,Engagés!$A$1:$E$380,3,FALSE)","v":"PETROFF"},{"$f":"VLOOKUP($A5,Engagés!$A$1:$E$380,4,FALSE)","v":"MISHA"},{"$f":"VLOOKUP($A5,Engagés!$A$1:$E$380,5,FALSE)","v":"75-4-BLOP"},null,null,"1er"]
[21,{"$f":"VLOOKUP($A6,Engagés!$A$1:$E$380,3,FALSE)","v":"SUN"},{"$f":"VLOOKUP($A6,Engagés!$A$1:$E$380,4,FALSE)","v":"CESAR"},{"$f":"VLOOKUP($A6,Engagés!$A$1:$E$380,5,FALSE)","v":"75-2-SPFP"},null,null,"3ème"]
[28,{"$f":"VLOOKUP($A7,Engagés!$A$1:$E$380,3,FALSE)","v":0},{"$f":"VLOOKUP($A7,Engagés!$A$1:$E$380,4,FALSE)","v":0},{"$f":"VLOOKUP($A7,Engagés!$A$1:$E$380,5,FALSE)","v":0},null,null,"4ème"]
["Si poule de 4 joueurs alors…"]
["Déroulement",null,null,"Joueurs A contre Joueur B",null,"Vainqueur","Score"]
["Match 1",null,null,{"$f":"B4","v":"CHOTARD"},{"$f":"B7","v":0},0]
{"$rows_left_out":15}
{"sheet":"Poule 22","index":6,"n_rows":24,"n_cols":7,"rows_kept":24,"cut":false,"hidden":false,"merged":[[13,0,13,6],[10,0,10,2],[11,0,11,2],[1,0,1,2],[1,3,1,6],[7,0,7,6],[8,0,8,2],[8,3,8,4],[9,0,9,2],[0,0,0,2],[0,3,0,4],[20,0,20,1],[20,2,20,3],[20,4,20,5],[14,0,14,2],[14,3,14,4],[15,0,15,2],[18,4,18,6],[19,0,19,1],[19,2,19,3],[19,4,19,5],[16,0,16,2],[17,0,17,2],[18,0,18,3],[12,0,12,2],[23,0,23,1],[23,2,23,3],[23,4,23,5],[21,0,21,1],[21,2,21,3],[21,4,21,5],[22,0,22,1],[22,2,22,3],[22,4,22,5]]}
["TENNIS DE TABLE",null,null,{"$f":"Engagés!C3","v":"TABLEAU C"}]
[{"$f":"Engagés!K18","v":"Poule 22"}]
[null,"NOM","Prénom","Sigle","Vict","Def","Classement"]
[6,{"$f":"VLOOKUP($A4,Engagés!$A$1:$E$380,3,FALSE)","v":"KOMILIKIS"},{"$f":"VLOOKUP($A4,Engagés!$A$1:$E$380,4,FALSE)","v":"RAPHAEL"},{"$f":"VLOOKUP($A4,Engagés!$A$1:$E$380,5,FALSE)","v":"75-4-SMPP"},null,null,"2ème"]
[11,{"$f":"VLOOKUP($A5,Engagés!$A$1:$E$380,3,FALSE)","v":"PLISSON"},{"$f":"VLOOKUP($A5,Engagés!$A$1:$E$380,4,FALSE)","v":"COME"},{"$f":"VLOOKUP($A5,Engagés!$A$1:$E$380,5,FALSE)","v":"75-4-STAP"},null,null,"1er"]
[22,{"$f":"VLOOKUP($A6,Engagés!$A$1:$E$380,3,FALSE)","v":"TURION"},{"$f":"VLOOKUP($A6,Engagés!$A$1:$E$380,4,FALSE)","v":"ALEXANDRE"},{"$f":"VLOOKUP($A6,Engagés!$A$1:$E$380,5,FALSE)","v":"75-4-PCHP"},null,null,"3ème"]
[27,{"$f":"VLOOKUP($A7,Engagés!$A$1:$E$380,3,FALSE)","v":0},{"$f":"VLOOKUP($A7,Engagés!$A$1:$E$380,4,FALSE)","v":0},{"$f":"VLOOKUP($A7,Engagés!$A$1:$E$380,5,FALSE)","v":0},null,null,"4ème"]
["Si poule de 4 joueurs alors…"]
["Déroulement",null,null,"Joueurs A contre Joueur B",null,"Vainqueur","Score"]
["Match 1",null,null,{"$f":"B4","v":"KOMILIKIS"},{"$f":"B7","v":0},0]
{"$rows_left_out":15}
{"sheet":"Poule 23","index":7,"n_rows":24,"n_cols":7,"rows_kept":24,"cut":false,"hidden":false,"merged":[[13,0,13,6],[10,0,10,2],[11,0,11,2],[1,0,1,2],[1,3,1,6],[7,0,7,6],[8,0,8,2],[8,3,8,4],[9,0,9,2],[0,0,0,2],[0,3,0,4],[20,0,20,1],[20,2,20,3],[20,4,20,5],[14,0,14,2],[14,3,14,4],[15,0,15,2],[18,4,18,6],[19,0,19,1],[19,2,19,3],[19,4,19,5],[16,0,16,2],[17,0,17,2],[18,0,18,3],[12,0,12,2],[23,0,23,1],[23,2,23,3],[23,4,23,5],[21,0,21,1],[21,2,21,3],[21,4,21,5],[22,0,22,1],[22,2,22,3],[22,4,22,5]]}
["TENNIS DE TABLE",null,null,{"$f":"Engagés!C3","v":"TABLEAU C"}]
[{"$f":"Engagés!G24","v":"Poule 23"}]
[null,"NOM","Prénom","Sigle","Vict","Def","Classement"]
[7,{"$f":"VLOOKUP($A4,Engagés!$A$1:$E$380,3,FALSE)","v":"BAUD"},{"$f":"VLOOKUP($A4,Engagés!$A$1:$E$380,4,FALSE)","v":"ARISTIDE"},{"$f":"VLOOKUP($A4,Engagés!$A$1:$E$380,5,FALSE)","v":"75-2-SUPA"},null,null,"2ème"]
[10,{"$f":"VLOOKUP($A5,Engagés!$A$1:$E$380,3,FALSE)","v":"LIN"},{"$f":"VLOOKUP($A5,Engagés!$A$1:$E$380,4,FALSE)","v":"LUCAS"},{"$f":"VLOOKUP($A5,Engagés!$A$1:$E$380,5,FALSE)","v":"75-2-SLHP"},null,null,"1er"]
[23,{"$f":"VLOOKUP($A6,Engagés!$A$1:$E$380,3,FALSE)","v":0},{"$f":"VLOOKUP($A6,Engagés!$A$1:$E$380,4,FALSE)","v":0},{"$f":"VLOOKUP($A6,Engagés!$A$1:$E$380,5,FALSE)","v":0},null,null,"3ème"]
[26,{"$f":"VLOOKUP($A7,Engagés!$A$1:$E$380,3,FALSE)","v":0},{"$f":"VLOOKUP($A7,Engagés!$A$1:$E$380,4,FALSE)","v":0},{"$f":"VLOOKUP($A7,Engagés!$A$1:$E$380,5,FALSE)","v":0},null,null,"4ème"]
["Si poule de 4 joueurs alors…"]
["Déroulement",null,null,"Joueurs A contre Joueur B",null,"Vainqueur","Score"]
["Match 1",null,null,{"$f":"B4","v":"BAUD"},{"$f":"B7","v":0},0]
{"$rows_left_out":15}
{"sheet":"Poule 24","index":8,"n_rows":24,"n_cols":7,"rows_kept":24,"cut":false,"hidden":false,"merged":[[13,0,13,6],[10,0,10,2],[11,0,11,2],[1,0,1,2],[1,3,1,6],[7,0,7,6],[8,0,8,2],[8,3,8,4],[9,0,9,2],[0,0,0,2],[0,3,0,4],[20,0,20,1],[20,2,20,3],[20,4,20,5],[14,0,14,2],[14,3,14,4],[15,0,15,2],[18,4,18,6],[19,0,19,1],[19,2,19,3],[19,4,19,5],[16,0,16,2],[17,0,17,2],[18,0,18,3],[12,0,12,2],[23,0,23,1],[23,2,23,3],[23,4,23,5],[21,0,21,1],[21,2,21,3],[21,4,21,5],[22,0,22,1],[22,2,22,3],[22,4,22,5]]}
["TENNIS DE TABLE",null,null,{"$f":"Engagés!C3","v":"TABLEAU C"}]
[{"$f":"Engagés!K24","v":"Poule 24"}]
[null,"NOM","Prénom","Sigle","Vict","Def","Classement"]
[8,{"$f":"VLOOKUP($A4,Engagés!$A$1:$E$380,3,FALSE)","v":"MICOLLIER"},{"$f":"VLOOKUP($A4,Engagés!$A$1:$E$380,4,FALSE)","v":"JULES"},{"$f":"VLOOKUP($A4,Engagés!$A$1:$E$380,5,FALSE)","v":"75-4-BLOP"},null,null,"1er"]
[9,{"$f":"VLOOKUP($A5,Engagés!$A$1:$E$380,3,FALSE)","v":"CLEMOT"},{"$f":"VLOOKUP($A5,Engagés!$A$1:$E$380,4,FALSE)","v":"MAEL"},{"$f":"VLOOKUP($A5,Engagés!$A$1:$E$380,5,FALSE)","v":"75-2-SLHP"},null,null,"2ème"]
[24,{"$f":"VLOOKUP($A6,Engagés!$A$1:$E$380,3,FALSE)","v":"MANUEL"},{"$f":"VLOOKUP($A6,Engagés!$A$1:$E$380,4,FALSE)","v":"ANTOINE"},{"$f":"VLOOKUP($A6,Engagés!$A$1:$E$380,5,FALSE)","v":"75-4-LMAP"},null,null,"3ème"]
[25,{"$f":"VLOOKUP($A7,Engagés!$A$1:$E$380,3,FALSE)","v":0},{"$f":"VLOOKUP($A7,Engagés!$A$1:$E$380,4,FALSE)","v":0},{"$f":"VLOOKUP($A7,Engagés!$A$1:$E$380,5,FALSE)","v":0},null,null,"4ème"]
["Si poule de 4 joueurs alors…"]
["Déroulement",null,null,"Joueurs A contre Joueur B",null,"Vainqueur","Score"]
["Match 1",null,null,{"$f":"B4","v":"MICOLLIER"},{"$f":"B7","v":0},0]
{"$rows_left_out":15}
{"sheet":"Résultats de poule","index":9,"n_rows":10,"n_cols":16,"rows_kept":10,"cut":false,"hidden":false,"merged":[[0,0,0,3],[0,4,0,7],[0,8,0,11],[0,12,0,15],[5,0,5,3],[5,4,5,7],[5,8,5,11],[5,12,5,15]]}
[{"$f":"Engagés!G6","v":"Poule 17"},null,null,null,{"$f":"Engagés!K6","v":"Poule 18"},null,null,null,{"$f":"Engagés!G12","v":"Poule 19"},null,null,null,{"$f":"Engagés!K12","v":"Poule 20"}]
["1er",{"$f":"'Poule 17'!$C21","v":"PINCEMIN"},{"$f":"'Poule 17'!$E21","v":"PAUL"},{"$f":"'Poule 17'!$G21","v":"75-4-FENP"},"1er",{"$f":"'Poule 18'!$C21","v":"RODIER"},{"$f":"'Poule 18'!$E21","v":"MATTEO"},{"$f":"'Poule 18'!$G21","v":"75-4-LMAP"},"1er",{"$f":"'Poule 19'!$C21","v":"GILLIS--JOLIVET"},{"$f":"'Poule 19'!$E21","v":"ARTHUR"},{"$f":"'Poule 19'!$G21","v":"75-2-NDLP"},"1er",{"$f":"'Poule 20'!$C21","v":"LERICHE"},{"$f":"'Poule 20'!$E21","v":"GAETAN"},{"$f":"'Poule 20'!$G21","v":"75-4-STAP"}]
["2ème",{"$f":"'Poule 17'!$C22","v":"REMONDELLI"},{"$f":"'Poule 17'!$E22","v":"SACHA"},{"$f":"'Poule 17'!$G22","v":"75-2-SPFP"},"2ème",{"$f":"'Poule 18'!$C22","v":"GUILLEMETTE"},{"$f":"'Poule 18'!$E22","v":"BAPTISTE"},{"$f":"'Poule 18'!$G22","v":"75-4-PCHP"},"2ème",{"$f":"'Poule 19'!$C22","v":"BRICOGNE"},{"$f":"'Poule 19'!$E22","v":"ARTHUS"},{"$f":"'Poule 19'!$G22","v":"75-4-FENP"},"2ème",{"$f":"'Poule 20'!$C22","v":"DE PREVAL"},{"$f":"'Poule 20'!$E22","v":"THEODORE"},{"$f":"'Poule 20'!$G22","v":"75-4-LMAP"}]
["3ème",{"$f":"'Poule 17'!$C23","v":0},{"$f":"'Poule 17'!$E23","v":0},{"$f":"'Poule 17'!$G23","v":0},"3ème",{"$f":"'Poule 18'!$C23","v":"IFATUROTI"},{"$f":"'Poule 18'!$E23","v":"PIERRE"},{"$f":"'Poule 18'!$G23","v":"75-2-SPFP"},"3ème",{"$f":"'Poule 19'!$C23","v":"LE ROY"},{"$f":"'Poule 19'!$E23","v":"CLEMENT"},{"$f":"'Poule 19'!$G23","v":"75-4-LMAP"},"3ème",{"$f":"'Poule 20'!$C23","v":0},{"$f":"'Poule 20'!$E23","v":0},{"$f":"'Poule 20'!$G23","v":0}]
["4ème",{"$f":"'Poule 17'!$C24","v":0},{"$f":"'Poule 17'!$E24","v":0},{"$f":"'Poule 17'!$G24","v":0},"4ème",{"$f":"'Poule 18'!$C24","v":0},{"$f":"'Poule 18'!$E24","v":0},{"$f":"'Poule 18'!$G24","v":0},"4ème",{"$f":"'Poule 19'!$C24","v":0},{"$f":"'Poule 19'!$E24","v":0},{"$f":"'Poule 19'!$G24","v":0},"4ème",{"$f":"'Poule 20'!$C24","v":0},{"$f":"'Poule 20'!$E24","v":0},{"$f":"'Poule 20'!$G24","v":0}]
[{"$f":"Engagés!G18","v":"Poule 21"},null,null,null,{"$f":"Engagés!K18","v":"Poule 22"},null,null,null,{"$f":"Engagés!G24","v":"Poule 23"},null,null,null,{"$f":"Engagés!K24","v":"Poule 24"}]
["1er",{"$f":"'Poule 21'!$C21","v":"PETROFF"},{"$f":"'Poule 21'!$E21","v":"MISHA"},{"$f":"'Poule 21'!$G21","v":"75-4-BLOP"},"1er",{"$f":"'Poule 22'!$C21","v":"PLISSON"},{"$f":"'Poule 22'!$E21","v":"COME"},{"$f":"'Poule 22'!$G21","v":"75-4-STAP"},"1er",{"$f":"'Poule 23'!$C21","v":"LIN"},{"$f":"'Poule 23'!$E21","v":"LUCAS"},{"$f":"'Poule 23'!$G21","v":"75-2-SLHP"},"1er",{"$f":"'Poule 24'!$C21","v":"MICOLLIER"},{"$f":"'Poule 24'!$E21","v":"JULES"},{"$f":"'Poule 24'!$G21","v":"75-4-BLOP"}]
["2ème",{"$f":"'Poule 21'!$C22","v":"CHOTARD"},{"$f":"'Poule 21'!$E22","v":"MARCUS"},{"$f":"'Poule 21'!$G22","v":"75-4-LMAP"},"2ème",{"$f":"'Poule 22'!$C22","v":"KOMILIKIS"},{"$f":"'Poule 22'!$E22","v":"RAPHAEL"},{"$f":"'Poule 22'!$G22","v":"75-4-SMPP"},"2ème",{"$f":"'Poule 23'!$C22","v":"BAUD"},{"$f":"'Poule 23'!$E22","v":"ARISTIDE"},{"$f":"'Poule 23'!$G22","v":"75-2-SUPA"},"2ème",{"$f":"'Poule 24'!$C22","v":"CLEMOT"},{"$f":"'Poule 24'!$E22","v":"MAEL"},{"$f":"'Poule 24'!$G22","v":"75-2-SLHP"}]
["3ème",{"$f":"'Poule 21'!$C23","v":"SUN"},{"$f":"'Poule 21'!$E23","v":"CESAR"},{"$f":"'Poule 21'!$G23","v":"75-2-SPFP"},"3ème",{"$f":"'Poule 22'!$C23","v":"TURION"},{"$f":"'Poule 22'!$E23","v":"ALEXANDRE"},{"$f":"'Poule 22'!$G23","v":"75-4-PCHP"},"3ème",{"$f":"'Poule 23'!$C23","v":0},{"$f":"'Poule 23'!$E23","v":0},{"$f":"'Poule 23'!$G23","v":0},"3ème",{"$f":"'Poule 24'!$C23","v":"MANUEL"},{"$f":"'Poule 24'!$E23","v":"ANTOINE"},{"$f":"'Poule 24'!$G23","v":"75-4-LMAP"}]
["4ème",{"$f":"'Poule 21'!$C24","v":0},{"$f":"'Poule 21'!$E24","v":0},{"$f":"'Poule 21'!$G24","v":0},"4ème",{"$f":"'Poule 22'!$C24","v":0},{"$f":"'Poule 22'!$E24","v":0},{"$f":"'Poule 22'!$G24","v":0},"4ème",{"$f":"'Poule 23'!$C24","v":0},{"$f":"'Poule 23'!$E24","v":0},{"$f":"'Poule 23'!$G24","v":0},"4ème",{"$f":"'Poule 24'!$C24","v":0},{"$f":"'Poule 24'!$E24","v":0},{"$f":"'Poule 24'!$G24","v":0}]
{"$rows_left_out":1}
{"sheet":"Tableau","index":10,"n_rows":92,"n_cols":34,"rows_kept":92,"cut":false,"hidden":false,"merged":[[8,10,8,11],[50,20,50,21],[16,10,16,11],[23,10,23,11],[33,10,33,11],[40,10,40,11],[48,10,48,11],[10,20,10,21],[30,32,30,33],[0,16,0,19],[15,29,15,30],[0,0,0,14],[31,29,31,30],[10,1,10,2],[1,4,1,5],[0,20,0,33],[16,26,16,27],[23,23,23,24],[3,20,3,21],[18,20,18,21],[29,4,29,5],[25,20,25,21],[1,10,1,11],[9,23,9,24],[55,10,55,11],[33,4,33,5],[42,1,42,2],[59,29,59,30],[55,23,55,24],[47,29,47,30],[35,20,35,21],[42,20,42,21],[41,23,41,24],[48,26,48,27],[57,20,57,21]]}
["REPECHAGES ET MATCHS DE CLASSEMENT",null,null,null,null,null,null,null,null,null,null,null,null,null,null,null,"1er tour de tableau",null,null,null,"TABLEAU PRINCIPAL"]
[]
[]
[null,null,null,null,null,null,null,null,null,null,null,null,null,null,null,null,"1er poule 17",{"$f":"'Résultats de poule'!B2","v":"PINCEMIN"},{"$f":"'Résultats de poule'!D2","v":"75-4-FENP"},"V","1/8 de finale 1"]
[null,null,null,null,null,null,null,null,null,null,null,null,"P",{"$f":"IF(T4=\"\",\"\",IF(T4=\"p\",S4,S5))","v":0},{"$f":"IF(T4=\"\",\"\",IF(T4=\"p\",R4,R5))","v":0},null,"4ème poule 24",{"$f":"'Résultats de poule'!N10","v":0},{"$f":"'Résultats de poule'!P10","v":0},"P",{"$f":"IF(T4=\"\",\"\",IF(T4=\"v\",R4,R5))","v":"PINCEMIN"},{"$f":"IF(T4=\"\",\"\",IF(T4=\"v\",S4,S5))","v":"75-4-FENP"},"V"]
[null,null,null,null,null,null,null,null,null,null,{"$f":"IF(M5=\"\",\"\",IF(M5=\"v\",N5,N7))","v":"75-4-SMPP"},{"$f":"IF(M5=\"\",\"\",IF(M5=\"v\",O5,O7))","v":"KOMILIKIS"},null,null,null,null,null,null,null,null,null,null,null,{"$f":"IF(W5=\"\",\"\",IF(W5=\"v\",U5,U7))","v":"PINCEMIN"},{"$f":"IF(W5=\"\",\"\",IF(W5=\"v\",V5,V7))","v":"75-4-FENP"},"V"]
[null,null,null,null,null,null,null,null,null,null,null,null,"V",{"$f":"IF(T7=\"\",\"\",IF(T7=\"p\",S7,S8))","v":"75-4-SMPP"},{"$f":"IF(T7=\"\",\"\",IF(T7=\"p\",R7,R8))","v":"KOMILIKIS"},null,"3ème poule 19",{"$f":"'Résultats de poule'!J4","v":"LE ROY"},{"$f":"'Résultats de poule'!L4","v":"75-4-LMAP"},"V",{"$f":"IF(T7=\"\",\"\",IF(T7=\"v\",R7,R8))","v":"LE ROY"},{"$f":"IF(T7=\"\",\"\",IF(T7=\"v\",S7,S8))","v":"75-4-LMAP"},"P"]
[null,null,null,null,null,null,null,null,null,null,null,null,null,null,null,null,"2ème poule 22",{"$f":"'Résultats de poule'!F8","v":"KOMILIKIS"},{"$f":"'Résultats de poule'!H8","v":"75-4-SMPP"},"P"]
[null,null,null,null,null,null,null,{"$f":"IF(J6=\"\",\"\",IF(J6=\"v\",K6,K13))","v":""},{"$f":"IF(J6=\"\",\"\",IF(J6=\"v\",L6,L13))","v":""}]
[null,null,null,null,null,null,null,null,null,null,null,null,null,null,null,null,null,null,null,null,null,null,null,"1/4 finale 1",null,null,{"$f":"IF(Z6=\"\",\"\",IF(Z6=\"v\",X6,X13))","v":"PINCEMIN"},{"$f":"IF(Z6=\"\",\"\",IF(Z6=\"v\",Y6,Y13))","v":"75-4-FENP"},"P"]
{"$rows_left_out":83}
{"sheet":"Classement","index":11,"n_rows":35,"n_cols":3,"rows_kept":35,"cut":false,"hidden":false,"merged":[[1,0,1,2],[0,0,0,2]]}
[{"$f":"IF(Engagés!A1=\"\",\"\",Engagés!A1)","v":"Qualifications championnat Comité de Paris "}]
[{"$f":"IF(Engagés!E3=\"\",\"\",Engagés!E3)","v":"MG Promo"}]
["CLASSEMENT","NOMS","Etablissement"]
["1er",{"$f":"Tableau!AG32","v":"LERICHE"},{"$f":"Tableau!AH32","v":"75-4-STAP"}]
["2ème",{"$f":"IF(Tableau!$AF$17=\"\",\"\",IF(Tableau!$AF$17=\"p\",Tableau!$AD$17,Tableau!$AD$49))","v":"RODIER"},{"$f":"IF(Tableau!$AF$17=\"\",\"\",IF(Tableau!$AF$17=\"p\",Tableau!$AE$17,Tableau!$AE$49))","v":"75-4-LMAP"}]
["3ème",{"$f":"Tableau!AG62","v":"PINCEMIN"},{"$f":"Tableau!AH62","v":"75-4-FENP"}]
["4ème",{"$f":"IF(Tableau!AF61=\"\",\"\",IF(Tableau!$AF$61=\"p\",Tableau!$AD$61,Tableau!$AD$63))","v":"GILLIS--JOLIVET"},{"$f":"IF(Tableau!AF61=\"\",\"\",IF(Tableau!$AF$61=\"p\",Tableau!$AE$61,Tableau!$AE$63))","v":"75-2-NDLP"}]
["5ème",{"$f":"Tableau!AG79","v":"PLISSON"},{"$f":"Tableau!AH79","v":"75-4-STAP"}]
["6ème",{"$f":"IF(Tableau!AF76=\"\",\"\",IF(Tableau!$AF$76=\"p\",Tableau!$AD$76,Tableau!$AD$82))","v":"PETROFF"},{"$f":"IF(Tableau!$AF$76=\"\",\"\",IF(Tableau!$AF$76=\"p\",Tableau!$AE$76,Tableau!$AE$82))","v":"75-4-BLOP"}]
["7ème",{"$f":"Tableau!AD86","v":"MICOLLIER"},{"$f":"Tableau!AE86","v":"75-4-BLOP"}]
{"$rows_left_out":25}