{"text_format":"1","workbook":"xlsx","n_sheets":12,"sheets":["Engagés","Poule 17","Poule 18","Poule 19","Poule 20","Poule 21","Poule 22","Poule 23","Poule 24","Résultats de poule","Tableau","Classement"],"not_rendered":{"charts":0,"images":81,"macros":1,"external_links":0,"defined_names":1,"comments":0,"pivot_tables":0},"unopened":[],"bounds":{"document_bytes":16777216,"sheet_cells":100000,"rows_first":2000,"rows_last":500,"rows_between":2000,"halvings":0,"cell_chars":16384,"cell_head_chars":4096},"cells_cut":0,"cells_raw":0,"read":"whole","date_system":"1900"}

{"sheet":"Engagés","index":0,"n_rows":37,"n_cols":14,"rows_kept":37,"cut":false,"hidden":false,"merged":[[0,0,2,1],[0,2,1,2],[23,6,23,9],[23,10,23,13],[5,10,5,13],[5,6,5,9],[11,6,11,9],[11,10,11,13],[17,6,17,9],[17,10,17,13]]}
["Qualifications championnat Comité de Paris ",null,"TENNIS DE TABLE","DATE :","13 dec"]
[null,null,null,"LIEU :","Stanislas"]
[null,null,"TABLEAU C","CATEGORIE :","MG Promo"]
["Tête de série","ETABLISSEMENT","NOM","PRENOM","SIGLE"]
[]
[1,null,"PINCEMIN","PAUL","75-4-FENP",null,"Poule 17",null,null,null,"Poule 18"]
[2,null,"RODIER","MATTEO","75-4-LMAP",null,1,{"$f":"VLOOKUP($G7,$A$1:$E$37,3,FALSE)","v":"PINCEMIN"},{"$f":"VLOOKUP($G7,$A$1:$E$37,4,FALSE)","v":"PAUL"},{"$f":"VLOOKUP($G7,$A$1:$E$37,5,FALSE)","v":"75-4-FENP"},2,{"$f":"VLOOKUP($K7,$A$1:$E$37,3,FALSE)","v":"RODIER"},{"$f":"VLOOKUP($K7,$A$1:$E$37,4,FALSE)","v":"MATTEO"},{"$f":"VLOOKUP($K7,$A$1:$E$37,5,FALSE)","v":"75-4-LMAP"}]
[3,null,"GILLIS--JOLIVET","ARTHUR","75-2-NDLP",null,16,{"$f":"VLOOKUP($G8,$A$1:$E$37,3,FALSE)","v":"REMONDELLI"},{"$f":"VLOOKUP($G8,$A$1:$E$37,4,FALSE)","v":"SACHA"},{"$f":"VLOOKUP($G8,$A$1:$E$37,5,FALSE)","v":"75-2-SPFP"},15,{"$f":"VLOOKUP($K8,$A$1:$E$37,3,FALSE)","v":0},{"$f":"VLOOKUP($K8,$A$1:$E$37,4,FALSE)","v":0},{"$f":"VLOOKUP($K8,$A$1:$E$37,5,FALSE)","v":0}]
[4,null,"LERICHE","GAETAN","75-4-STAP",null,17,{"$f":"VLOOKUP($G9,$A$1:$E$37,3,FALSE)","v":0},{"$f":"VLOOKUP($G9,$A$1:$E$37,4,FALSE)","v":0},{"$f":"VLOOKUP($G9,$A$1:$E$37,5,FALSE)","v":0},18,{"$f":"VLOOKUP($K9,$A$1:$E$37,3,FALSE)","v":"IFATUROTI"},{"$f":"VLOOKUP($K9,$A$1:$E$37,4,FALSE)","v":"PIERRE"},{"$f":"VLOOKUP($K9,$A$1:$E$37,5,FALSE)","v":"75-2-SPFP"}]
[5,null,"CHOTARD","MARCUS","75-4-LMAP",null,32,{"$f":"VLOOKUP($G10,$A$1:$E$37,3,FALSE)","v":0},{"$f":"VLOOKUP($G10,$A$1:$E$37,4,FALSE)","v":0},{"$f":"VLOOKUP($G10,$A$1:$E$37,5,FALSE)","v":0},31,{"$f":"VLOOKUP($K10,$A$1:$E$37,3,FALSE)","v":"GUILLEMETTE"},{"$f":"VLOOKUP($K10,$A$1:$E$37,4,FALSE)","v":"BAPTISTE"},{"$f":"VLOOKUP($K10,$A$1:$E$37,5,FALSE)","v":"75-4-PCHP"}]
[6,null,"KOMILIKIS","RAPHAEL","75-4-SMPP"]
[7,null,"BAUD","ARISTIDE","75-2-SUPA",null,"Poule 19",null,null,null,"Poule 20"]
[8,null,"MICOLLIER","JULES","75-4-BLOP",null,3,{"$f":"VLOOKUP($G13,$A$1:$E$37,3,FALSE)","v":"GILLIS--JOLIVET"},{"$f":"VLOOKUP($G13,$A$1:$E$37,4,FALSE)","v":"ARTHUR"},{"$f":"VLOOKUP($G13,$A$1:$E$37,5,FALSE)","v":"75-2-NDLP"},4,{"$f":"VLOOKUP($K13,$A$1:$E$37,3,FALSE)","v":"LERICHE"},{"$f":"VLOOKUP($K13,$A$1:$E$37,4,FALSE)","v":"GAETAN"},{"$f":"VLOOKUP($K13,$A$1:$E$37,5,FALSE)","v":"75-4-STAP"}]
[9,null,"CLEMOT","MAEL","75-2-SLHP",null,14,{"$f":"VLOOKUP($G14,$A$1:$E$37,3,FALSE)","v":"LE ROY"},{"$f":"VLOOKUP($G14,$A$1:$E$37,4,FALSE)","v":"CLEMENT"},{"$f":"VLOOKUP($G14,$A$1:$E$37,5,FALSE)","v":"75-4-LMAP"},13,{"$f":"VLOOKUP($K14,$A$1:$E$37,3,FALSE)","v":0},{"$f":"VLOOKUP($K14,$A$1:$E$37,4,FALSE)","v":0},{"$f":"VLOOKUP($K14,$A$1:$E$37,5,FALSE)","v":0}]
[10,null,"LIN","LUCAS","75-2-SLHP",null,19,{"$f":"VLOOKUP($G15,$A$1:$E$37,3,FALSE)","v":"BRICOGNE"},{"$f":"VLOOKUP($G15,$A$1:$E$37,4,FALSE)","v":"ARTHUS"},{"$f":"VLOOKUP($G15,$A$1:$E$37,5,FALSE)","v":"75-4-FENP"},20,{"$f":"VLOOKUP($K15,$A$1:$E$37,3,FALSE)","v":"DE PREVAL"},{"$f":"VLOOKUP($K15,$A$1:$E$37,4,FALSE)","v":"THEODORE"},{"$f":"VLOOKUP($K15,$A$1:$E$37,5,FALSE)","v":"75-4-LMAP"}]
[11,null,"PLISSON","COME","75-4-STAP",null,30,{"$f":"VLOOKUP($G16,$A$1:$E$37,3,FALSE)","v":0},{"$f":"VLOOKUP($G16,$A$1:$E$37,4,FALSE)","v":0},{"$f":"VLOOKUP($G16,$A$1:$E$37,5,FALSE)","v":0},29,{"$f":"VLOOKUP($K16,$A$1:$E$37,3,FALSE)","v":0},{"$f":"VLOOKUP($K16,$A$1:$E$37,4,FALSE)","v":0},{"$f":"VLOOKUP($K16,$A$1:$E$37,5,FALSE)","v":0}]
[12,null,"PETROFF","MISHA","75-4-BLOP"]
[13,null,null,null,null,null,"Poule 21",null,null,null,"Poule 22"]
[14,null,"LE ROY","CLEMENT","75-4-LMAP",null,5,{"$f":"VLOOKUP($G19,$A$1:$E$37,3,FALSE)","v":"CHOTARD"},{"$f":"VLOOKUP($G19,$A$1:$E$37,4,FALSE)","v":"MARCUS"},{"$f":"VLOOKUP($G19,$A$1:$E$37,5,FALSE)","v":"75-4-LMAP"},6,{"$f":"VLOOKUP($K19,$A$1:$E$37,3,FALSE)","v":"KOMILIKIS"},{"$f":"VLOOKUP($K19,$A$1:$E$37,4,FALSE)","v":"RAPHAEL"},{"$f":"VLOOKUP($K19,$A$1:$E$37,5,FALSE)","v":"75-4-SMPP"}]
[15,null,null,null,null,null,12,{"$f":"VLOOKUP($G20,$A$1:$E$37,3,FALSE)","v":"PETROFF"},{"$f":"VLOOKUP($G20,$A$1:$E$37,4,FALSE)","v":"MISHA"},{"$f":"VLOOKUP($G20,$A$1:$E$37,5,FALSE)","v":"75-4-BLOP"},11,{"$f":"VLOOKUP($K20,$A$1:$E$37,3,FALSE)","v":"PLISSON"},{"$f":"VLOOKUP($K20,$A$1:$E$37,4,FALSE)","v":"COME"},{"$f":"VLOOKUP($K20,$A$1:$E$37,5,FALSE)","v":"75-4-STAP"}]
[16,null,"REMONDELLI","SACHA","75-2-SPFP",null,21,{"$f":"VLOOKUP($G21,$A$1:$E$37,3,FALSE)","v":"SUN"},{"$f":"VLOOKUP($G21,$A$1:$E$37,4,FALSE)","v":"CESAR"},{"$f":"VLOOKUP($G21,$A$1:$E$37,5,FALSE)","v":"75-2-SPFP"},22,{"$f":"VLOOKUP($K21,$A$1:$E$37,3,FALSE)","v":"TURION"},{"$f":"VLOOKUP($K21,$A$1:$E$37,4,FALSE)","v":"ALEXANDRE"},{"$f":"VLOOKUP($K21,$A$1:$E$37,5,FALSE)","v":"75-4-PCHP"}]
[17,null,null,null,null,null,28,{"$f":"VLOOKUP($G22,$A$1:$E$37,3,FALSE)","v":0},{"$f":"VLOOKUP($G22,$A$1:$E$37,4,FALSE)","v":0},{"$f":"VLOOKUP($G22,$A$1:$E$37,5,FALSE)","v":0},27,{"$f":"VLOOKUP($K22,$A$1:$E$37,3,FALSE)","v":0},{"$f":"VLOOKUP($K22,$A$1:$E$37,4,FALSE)","v":0},{"$f":"VLOOKUP($K22,$A$1:$E$37,5,FALSE)","v":0}]
[18,null,"IFATUROTI","PIERRE","75-2-SPFP"]
[19,null,"BRICOGNE","ARTHUS","75-4-FENP",null,"Poule 23",null,null,null,"Poule 24"]
[20,null,"DE PREVAL","THEODORE","75-4-LMAP",null,7,{"$f":"VLOOKUP($G25,$A$1:$E$37,3,FALSE)","v":"BAUD"},{"$f":"VLOOKUP($G25,$A$1:$E$37,4,FALSE)","v":"ARISTIDE"},{"$f":"VLOOKUP($G25,$A$1:$E$37,5,FALSE)","v":"75-2-SUPA"},8,{"$f":"VLOOKUP($K25,$A$1:$E$37,3,FALSE)","v":"MICOLLIER"},{"$f":"VLOOKUP($K25,$A$1:$E$37,4,FALSE)","v":"JULES"},{"$f":"VLOOKUP($K25,$A$1:$E$37,5,FALSE)","v":"75-4-BLOP"}]
[21,null,"SUN","CESAR","75-2-SPFP",null,10,{"$f":"VLOOKUP($G26,$A$1:$E$37,3,FALSE)","v":"LIN"},{"$f":"VLOOKUP($G26,$A$1:$E$37,4,FALSE)","v":"LUCAS"},{"$f":"VLOOKUP($G26,$A$1:$E$37,5,FALSE)","v":"75-2-SLHP"},9,{"$f":"VLOOKUP($K26,$A$1:$E$37,3,FALSE)","v":"CLEMOT"},{"$f":"VLOOKUP($K26,$A$1:$E$37,4,FALSE)","v":"MAEL"},{"$f":"VLOOKUP($K26,$A$1:$E$37,5,FALSE)","v":"75-2-SLHP"}]
[22,null,"TURION","ALEXANDRE","75-4-PCHP",null,23,{"$f":"VLOOKUP($G27,$A$1:$E$37,3,FALSE)","v":0},{"$f":"VLOOKUP($G27,$A$1:$E$37,4,FALSE)","v":0},{"$f":"VLOOKUP($G27,$A$1:$E$37,5,FALSE)","v":0},24,{"$f":"VLOOKUP($K27,$A$1:$E$37,3,FALSE)","v":"MANUEL"},{"$f":"VLOOKUP($K27,$A$1:$E$37,4,FALSE)","v":"ANTOINE"},{"$f":"VLOOKUP($K27,$A$1:$E$37,5,FALSE)","v":"75-4-LMAP"}]
[23,null,null,null,null,null,26,{"$f":"VLOOKUP($G28,$A$1:$E$37,3,FALSE)","v":0},{"$f":"VLOOKUP($G28,$A$1:$E$37,4,FALSE)","v":0},{"$f":"VLOOKUP($G28,$A$1:$E$37,5,FALSE)","v":0},25,{"$f":"VLOOKUP($K28,$A$1:$E$37,3,FALSE)","v":0},{"$f":"VLOOKUP($K28,$A$1:$E$37,4,FALSE)","v":0},{"$f":"VLOOKUP($K28,$A$1:$E$37,5,FALSE)","v":0}]
[24,null,"MANUEL","ANTOINE","75-4-LMAP"]
[25]
[26]
[27]
[28]
[29]
[30]
[31,null,"GUILLEMETTE","BAPTISTE","75-4-PCHP"]
[32]

{"sheet":"Poule 17","index":1,"n_rows":24,"n_cols":7,"rows_kept":24,"cut":false,"hidden":false,"merged":[[0,0,0,2],[0,3,0,4],[22,0,22,1],[20,2,20,3],[23,4,23,5],[22,4,22,5],[13,0,13,6],[14,3,14,4],[23,2,23,3],[21,0,21,1],[23,0,23,1],[21,2,21,3],[19,4,19,5],[20,4,20,5],[7,0,7,6],[8,3,8,4],[8,0,8,2],[9,0,9,2],[10,0,10,2],[1,0,1,2],[1,3,1,6],[22,2,22,3],[20,0,20,1],[18,4,18,6],[11,0,11,2],[12,0,12,2],[14,0,14,2],[17,0,17,2],[18,0,18,3],[21,4,21,5],[19,0,19,1],[15,0,15,2],[16,0,16,2],[19,2,19,3]]}
["TENNIS DE TABLE",null,null,{"$f":"Engagés!C3","v":"TABLEAU C"}]
[{"$f":"Engagés!G6","v":"Poule 17"}]
[null,"NOM","Prénom","Sigle","Vict","Def","Classement"]
[1,{"$f":"VLOOKUP($A4,Engagés!$A$1:$E$380,3,FALSE)","v":"PINCEMIN"},{"$f":"VLOOKUP($A4,Engagés!$A$1:$E$380,4,FALSE)","v":"PAUL"},{"$f":"VLOOKUP($A4,Engagés!$A$1:$E$380,5,FALSE)","v":"75-4-FENP"},null,null,"1er"]
[16,{"$f":"VLOOKUP($A5,Engagés!$A$1:$E$380,3,FALSE)","v":"REMONDELLI"},{"$f":"VLOOKUP($A5,Engagés!$A$1:$E$380,4,FALSE)","v":"SACHA"},{"$f":"VLOOKUP($A5,Engagés!$A$1:$E$380,5,FALSE)","v":"75-2-SPFP"},null,null,"2ème"]
[17,{"$f":"VLOOKUP($A6,Engagés!$A$1:$E$380,3,FALSE)","v":0},{"$f":"VLOOKUP($A6,Engagés!$A$1:$E$380,4,FALSE)","v":0},{"$f":"VLOOKUP($A6,Engagés!$A$1:$E$380,5,FALSE)","v":0},null,null,"3ème"]
[32,{"$f":"VLOOKUP($A7,Engagés!$A$1:$E$380,3,FALSE)","v":0},{"$f":"VLOOKUP($A7,Engagés!$A$1:$E$380,4,FALSE)","v":0},{"$f":"VLOOKUP($A7,Engagés!$A$1:$E$380,5,FALSE)","v":0},null,null,"4ème"]
["Si poule de 4 joueurs alors…"]
["Déroulement",null,null,"Joueurs A contre Joueur B",null,"Vainqueur","Score"]
["Match 1",null,null,{"$f":"B4","v":"PINCEMIN"},{"$f":"B7","v":0}]
["Match 2",null,null,{"$f":"B5","v":"REMONDELLI"},{"$f":"B6","v":0}]
["Finale vainqueur Match 1 contre vainqueur Match 2",null,null,{"$f":"IF(F10=\"\",\"\",F10)","v":""},{"$f":"IF(F11=\"\",\"\",F11)","v":""}]
["Petite finale entre les deux perdants des matchs 1 et 2",null,null,{"$f":"IF(D12=\"\",\"\",IF(D12=D10,E10,D10))","v":""},{"$f":"IF(E12=\"\",\"\",IF(E12=D11,E11,D11))","v":""}]
["Si poule de 3 joueurs alors…"]
["Déroulement",null,null,"Joueurs A contre Joueur B",null,"Vainqueur","Score"]
["Match 1",null,null,{"$f":"B4","v":"PINCEMIN"},{"$f":"B6","v":0},0]
["Match 2",null,null,{"$f":"B5","v":"REMONDELLI"},{"$f":"B6","v":0},0]
["Match 3",null,null,{"$f":"B4","v":"PINCEMIN"},{"$f":"B5","v":"REMONDELLI"},0]
["CLASSEMENT",null,null,null,{"$f":"A2","v":"Poule 17"}]
[null,null,"NOM",null,"PRENOM",null,"SIGLE"]
["1er",null,{"$f":"IF($G$4=\"1er\", $B$4,IF($G$5=\"1er\",$B$5,IF($G$6=\"1er\",$B$6,IF($G$7=\"1er\",$B$7,\"\"))))","v":"PINCEMIN"},null,{"$f":"IF($G$4=\"1er\", $C$4,IF($G$5=\"1er\",$C$5,IF($G$6=\"1er\",$C$6,IF($G$7=\"1er\",$C$7,\"\"))))","v":"PAUL"},null,{"$f":"IF($G$4=\"1er\", $D$4,IF($G$5=\"1er\",$D$5,IF($G$6=\"1er\",$D$6,IF($G$7=\"1er\",$D$7,\"\"))))","v":"75-4-FENP"}]
["2ème",null,{"$f":"IF($G$4=\"2ème\", $B$4,IF($G$5=\"2ème\",$B$5,IF($G$6=\"2ème\",$B$6,IF($G$7=\"2ème\",$B$7,\"\"))))","v":"REMONDELLI"},null,{"$f":"IF($G$4=\"2ème\", $C$4,IF($G$5=\"2ème\",$C$5,IF($G$6=\"2ème\",$C$6,IF($G$7=\"2ème\",$C$7,\"\"))))","v":"SACHA"},null,{"$f":"IF($G$4=\"2ème\", $D$4,IF($G$5=\"2ème\",$D$5,IF($G$6=\"2ème\",$D$6,IF($G$7=\"2ème\",$D$7,\"\"))))","v":"75-2-SPFP"}]
["3ème",null,{"$f":"IF($G$4=\"3ème\", $B$4,IF($G$5=\"3ème\",$B$5,IF($G$6=\"3ème\",$B$6,IF($G$7=\"3ème\",$B$7,\"\"))))","v":0},null,{"$f":"IF($G$4=\"3ème\", $C$4,IF($G$5=\"3ème\",$C$5,IF($G$6=\"3ème\",$C$6,IF($G$7=\"3ème\",$C$7,\"\"))))","v":0},null,{"$f":"IF($G$4=\"3ème\", $D$4,IF($G$5=\"3ème\",$D$5,IF($G$6=\"3ème\",$D$6,IF($G$7=\"3ème\",$D$7,\"\"))))","v":0}]
["4ème",null,{"$f":"IF($G$4=\"4ème\", $B$4,IF($G$5=\"4ème\",$B$5,IF($G$6=\"4ème\",$B$6,IF($G$7=\"4ème\",$B$7,\"\"))))","v":0},null,{"$f":"IF($G$4=\"4ème\", $C$4,IF($G$5=\"4ème\",$C$5,IF($G$6=\"4ème\",$C$6,IF($G$7=\"4ème\",$C$7,\"\"))))","v":0},null,{"$f":"IF($G$4=\"4ème\", $D$4,IF($G$5=\"4ème\",$D$5,IF($G$6=\"4ème\",$D$6,IF($G$7=\"4ème\",$D$7,\"\"))))","v":0}]

{"sheet":"Poule 18","index":2,"n_rows":24,"n_cols":7,"rows_kept":24,"cut":false,"hidden":false,"merged":[[0,3,0,4],[15,0,15,2],[16,0,16,2],[1,0,1,2],[1,3,1,6],[7,0,7,6],[8,0,8,2],[8,3,8,4],[9,0,9,2],[10,0,10,2],[11,0,11,2],[12,0,12,2],[13,0,13,6],[14,0,14,2],[14,3,14,4],[0,0,0,2],[17,0,17,2],[18,0,18,3],[18,4,18,6],[20,0,20,1],[20,2,20,3],[20,4,20,5],[19,0,19,1],[19,2,19,3],[19,4,19,5],[23,0,23,1],[23,2,23,3],[23,4,23,5],[21,0,21,1],[21,2,21,3],[21,4,21,5],[22,0,22,1],[22,2,22,3],[22,4,22,5]]}
["TENNIS DE TABLE",null,null,{"$f":"Engagés!C3","v":"TABLEAU C"}]
[{"$f":"Engagés!K6","v":"Poule 18"}]
[null,"NOM","Prénom","Sigle","Vict","Def","Classement"]
[2,{"$f":"VLOOKUP($A4,Engagés!$A$1:$E$380,3,FALSE)","v":"RODIER"},{"$f":"VLOOKUP($A4,Engagés!$A$1:$E$380,4,FALSE)","v":"MATTEO"},{"$f":"VLOOKUP($A4,Engagés!$A$1:$E$380,5,FALSE)","v":"75-4-LMAP"},null,null,"1er"]
[15,{"$f":"VLOOKUP($A5,Engagés!$A$1:$E$380,3,FALSE)","v":0},{"$f":"VLOOKUP($A5,Engagés!$A$1:$E$380,4,FALSE)","v":0},{"$f":"VLOOKUP($A5,Engagés!$A$1:$E$380,5,FALSE)","v":0},null,null,"4ème"]
[18,{"$f":"VLOOKUP($A6,Engagés!$A$1:$E$380,3,FALSE)","v":"IFATUROTI"},{"$f":"VLOOKUP($A6,Engagés!$A$1:$E$380,4,FALSE)","v":"PIERRE"},{"$f":"VLOOKUP($A6,Engagés!$A$1:$E$380,5,FALSE)","v":"75-2-SPFP"},null,null,"3ème"]
[31,{"$f":"VLOOKUP($A7,Engagés!$A$1:$E$380,3,FALSE)","v":"GUILLEMETTE"},{"$f":"VLOOKUP($A7,Engagés!$A$1:$E$380,4,FALSE)","v":"BAPTISTE"},{"$f":"VLOOKUP($A7,Engagés!$A$1:$E$380,5,FALSE)","v":"75-4-PCHP"},null,null,"2ème"]
["Si poule de 4 joueurs alors…"]
["Déroulement",null,null,"Joueurs A contre Joueur B",null,"Vainqueur","Score"]
["Match 1",null,null,{"$f":"B4","v":"RODIER"},{"$f":"B7","v":"GUILLEMETTE"}]
["Match 2",null,null,{"$f":"B5","v":0},{"$f":"B6","v":"IFATUROTI"}]
["Finale vainqueur Match 1 contre vainqueur Match 2",null,null,{"$f":"IF(F10=\"\",\"\",F10)","v":""},{"$f":"IF(F11=\"\",\"\",F11)","v":""}]
["Petite finale entre les deux perdants des matchs 1 et 2",null,null,{"$f":"IF(D12=\"\",\"\",IF(D12=D10,E10,D10))","v":""},{"$f":"IF(E12=\"\",\"\",IF(E12=D11,E11,D11))","v":""}]
["Si poule de 3 joueurs alors…"]
["Déroulement",null,null,"Joueurs A contre Joueur B",null,"Vainqueur","Score"]
["Match 1",null,null,{"$f":"B4","v":"RODIER"},{"$f":"B6","v":"IFATUROTI"},0]
["Match 2",null,null,{"$f":"B5","v":0},{"$f":"B6","v":"IFATUROTI"},0]
["Match 3",null,null,{"$f":"B4","v":"RODIER"},{"$f":"B5","v":0},0]
["CLASSEMENT",null,null,null,{"$f":"A2","v":"Poule 18"}]
[null,null,"NOM",null,"PRENOM",null,"SIGLE"]
["1er",null,{"$f":"IF($G$4=\"1er\", $B$4,IF($G$5=\"1er\",$B$5,IF($G$6=\"1er\",$B$6,IF($G$7=\"1er\",$B$7,\"\"))))","v":"RODIER"},null,{"$f":"IF($G$4=\"1er\", $C$4,IF($G$5=\"1er\",$C$5,IF($G$6=\"1er\",$C$6,IF($G$7=\"1er\",$C$7,\"\"))))","v":"MATTEO"},null,{"$f":"IF($G$4=\"1er\", $D$4,IF($G$5=\"1er\",$D$5,IF($G$6=\"1er\",$D$6,IF($G$7=\"1er\",$D$7,\"\"))))","v":"75-4-LMAP"}]
["2ème",null,{"$f":"IF($G$4=\"2ème\", $B$4,IF($G$5=\"2ème\",$B$5,IF($G$6=\"2ème\",$B$6,IF($G$7=\"2ème\",$B$7,\"\"))))","v":"GUILLEMETTE"},null,{"$f":"IF($G$4=\"2ème\", $C$4,IF($G$5=\"2ème\",$C$5,IF($G$6=\"2ème\",$C$6,IF($G$7=\"2ème\",$C$7,\"\"))))","v":"BAPTISTE"},null,{"$f":"IF($G$4=\"2ème\", $D$4,IF($G$5=\"2ème\",$D$5,IF($G$6=\"2ème\",$D$6,IF($G$7=\"2ème\",$D$7,\"\"))))","v":"75-4-PCHP"}]
["3ème",null,{"$f":"IF($G$4=\"3ème\", $B$4,IF($G$5=\"3ème\",$B$5,IF($G$6=\"3ème\",$B$6,IF($G$7=\"3ème\",$B$7,\"\"))))","v":"IFATUROTI"},null,{"$f":"IF($G$4=\"3ème\", $C$4,IF($G$5=\"3ème\",$C$5,IF($G$6=\"3ème\",$C$6,IF($G$7=\"3ème\",$C$7,\"\"))))","v":"PIERRE"},null,{"$f":"IF($G$4=\"3ème\", $D$4,IF($G$5=\"3ème\",$D$5,IF($G$6=\"3ème\",$D$6,IF($G$7=\"3ème\",$D$7,\"\"))))","v":"75-2-SPFP"}]
["4ème",null,{"$f":"IF($G$4=\"4ème\", $B$4,IF($G$5=\"4ème\",$B$5,IF($G$6=\"4ème\",$B$6,IF($G$7=\"4ème\",$B$7,\"\"))))","v":0},null,{"$f":"IF($G$4=\"4ème\", $C$4,IF($G$5=\"4ème\",$C$5,IF($G$6=\"4ème\",$C$6,IF($G$7=\"4ème\",$C$7,\"\"))))","v":0},null,{"$f":"IF($G$4=\"4ème\", $D$4,IF($G$5=\"4ème\",$D$5,IF($G$6=\"4ème\",$D$6,IF($G$7=\"4ème\",$D$7,\"\"))))","v":0}]

{"sheet":"Poule 19","index":3,"n_rows":24,"n_cols":7,"rows_kept":24,"cut":false,"hidden":false,"merged":[[0,3,0,4],[15,0,15,2],[16,0,16,2],[1,0,1,2],[1,3,1,6],[7,0,7,6],[8,0,8,2],[8,3,8,4],[9,0,9,2],[10,0,10,2],[11,0,11,2],[12,0,12,2],[13,0,13,6],[14,0,14,2],[14,3,14,4],[0,0,0,2],[17,0,17,2],[18,0,18,3],[18,4,18,6],[20,0,20,1],[20,2,20,3],[20,4,20,5],[19,0,19,1],[19,2,19,3],[19,4,19,5],[23,0,23,1],[23,2,23,3],[23,4,23,5],[21,0,21,1],[21,2,21,3],[21,4,21,5],[22,0,22,1],[22,2,22,3],[22,4,22,5]]}
["TENNIS DE TABLE",null,null,{"$f":"Engagés!C3","v":"TABLEAU C"}]
[{"$f":"Engagés!G12","v":"Poule 19"}]
[null,"NOM","Prénom","Sigle","Vict","Def","Classement"]
[3,{"$f":"VLOOKUP($A4,Engagés!$A$1:$E$380,3,FALSE)","v":"GILLIS--JOLIVET"},{"$f":"VLOOKUP($A4,Engagés!$A$1:$E$380,4,FALSE)","v":"ARTHUR"},{"$f":"VLOOKUP($A4,Engagés!$A$1:$E$380,5,FALSE)","v":"75-2-NDLP"},null,null,"1er"]
[14,{"$f":"VLOOKUP($A5,Engagés!$A$1:$E$380,3,FALSE)","v":"LE ROY"},{"$f":"VLOOKUP($A5,Engagés!$A$1:$E$380,4,FALSE)","v":"CLEMENT"},{"$f":"VLOOKUP($A5,Engagés!$A$1:$E$380,5,FALSE)","v":"75-4-LMAP"},null,null,"3ème"]
[19,{"$f":"VLOOKUP($A6,Engagés!$A$1:$E$380,3,FALSE)","v":"BRICOGNE"},{"$f":"VLOOKUP($A6,Engagés!$A$1:$E$380,4,FALSE)","v":"ARTHUS"},{"$f":"VLOOKUP($A6,Engagés!$A$1:$E$380,5,FALSE)","v":"75-4-FENP"},null,null,"2ème"]
[30,{"$f":"VLOOKUP($A7,Engagés!$A$1:$E$380,3,FALSE)","v":0},{"$f":"VLOOKUP($A7,Engagés!$A$1:$E$380,4,FALSE)","v":0},{"$f":"VLOOKUP($A7,Engagés!$A$1:$E$380,5,FALSE)","v":0},null,null,"4ème"]
["Si poule de 4 joueurs alors…"]
["Déroulement",null,null,"Joueurs A contre Joueur B",null,"Vainqueur","Score"]
["Match 1",null,null,{"$f":"B4","v":"GILLIS--JOLIVET"},{"$f":"B7","v":0}]
["Match 2",null,null,{"$f":"B5","v":"LE ROY"},{"$f":"B6","v":"BRICOGNE"}]
["Finale vainqueur Match 1 contre vainqueur Match 2",null,null,{"$f":"IF(F10=\"\",\"\",F10)","v":""},{"$f":"IF(F11=\"\",\"\",F11)","v":""}]
["Petite finale entre les deux perdants des matchs 1 et 2",null,null,{"$f":"IF(D12=\"\",\"\",IF(D12=D10,E10,D10))","v":""},{"$f":"IF(E12=\"\",\"\",IF(E12=D11,E11,D11))","v":""}]
["Si poule de 3 joueurs alors…"]
["Déroulement",null,null,"Joueurs A contre Joueur B",null,"Vainqueur","Score"]
["Match 1",null,null,{"$f":"B4","v":"GILLIS--JOLIVET"},{"$f":"B6","v":"BRICOGNE"},0]
["Match 2",null,null,{"$f":"B5","v":"LE ROY"},{"$f":"B6","v":"BRICOGNE"},0]
["Match 3",null,null,{"$f":"B4","v":"GILLIS--JOLIVET"},{"$f":"B5","v":"LE ROY"},0]
["CLASSEMENT",null,null,null,{"$f":"A2","v":"Poule 19"}]
[null,null,"NOM",null,"PRENOM",null,"SIGLE"]
["1er",null,{"$f":"IF($G$4=\"1er\", $B$4,IF($G$5=\"1er\",$B$5,IF($G$6=\"1er\",$B$6,IF($G$7=\"1er\",$B$7,\"\"))))","v":"GILLIS--JOLIVET"},null,{"$f":"IF($G$4=\"1er\", $C$4,IF($G$5=\"1er\",$C$5,IF($G$6=\"1er\",$C$6,IF($G$7=\"1er\",$C$7,\"\"))))","v":"ARTHUR"},null,{"$f":"IF($G$4=\"1er\", $D$4,IF($G$5=\"1er\",$D$5,IF($G$6=\"1er\",$D$6,IF($G$7=\"1er\",$D$7,\"\"))))","v":"75-2-NDLP"}]
["2ème",null,{"$f":"IF($G$4=\"2ème\", $B$4,IF($G$5=\"2ème\",$B$5,IF($G$6=\"2ème\",$B$6,IF($G$7=\"2ème\",$B$7,\"\"))))","v":"BRICOGNE"},null,{"$f":"IF($G$4=\"2ème\", $C$4,IF($G$5=\"2ème\",$C$5,IF($G$6=\"2ème\",$C$6,IF($G$7=\"2ème\",$C$7,\"\"))))","v":"ARTHUS"},null,{"$f":"IF($G$4=\"2ème\", $D$4,IF($G$5=\"2ème\",$D$5,IF($G$6=\"2ème\",$D$6,IF($G$7=\"2ème\",$D$7,\"\"))))","v":"75-4-FENP"}]
["3ème",null,{"$f":"IF($G$4=\"3ème\", $B$4,IF($G$5=\"3ème\",$B$5,IF($G$6=\"3ème\",$B$6,IF($G$7=\"3ème\",$B$7,\"\"))))","v":"LE ROY"},null,{"$f":"IF($G$4=\"3ème\", $C$4,IF($G$5=\"3ème\",$C$5,IF($G$6=\"3ème\",$C$6,IF($G$7=\"3ème\",$C$7,\"\"))))","v":"CLEMENT"},null,{"$f":"IF($G$4=\"3ème\", $D$4,IF($G$5=\"3ème\",$D$5,IF($G$6=\"3ème\",$D$6,IF($G$7=\"3ème\",$D$7,\"\"))))","v":"75-4-LMAP"}]
["4ème",null,{"$f":"IF($G$4=\"4ème\", $B$4,IF($G$5=\"4ème\",$B$5,IF($G$6=\"4ème\",$B$6,IF($G$7=\"4ème\",$B$7,\"\"))))","v":0},null,{"$f":"IF($G$4=\"4ème\", $C$4,IF($G$5=\"4ème\",$C$5,IF($G$6=\"4ème\",$C$6,IF($G$7=\"4ème\",$C$7,\"\"))))","v":0},null,{"$f":"IF($G$4=\"4ème\", $D$4,IF($G$5=\"4ème\",$D$5,IF($G$6=\"4ème\",$D$6,IF($G$7=\"4ème\",$D$7,\"\"))))","v":0}]

{"sheet":"Poule 20","index":4,"n_rows":24,"n_cols":7,"rows_kept":24,"cut":false,"hidden":false,"merged":[[0,3,0,4],[15,0,15,2],[16,0,16,2],[1,0,1,2],[1,3,1,6],[7,0,7,6],[8,0,8,2],[8,3,8,4],[9,0,9,2],[10,0,10,2],[11,0,11,2],[12,0,12,2],[13,0,13,6],[14,0,14,2],[14,3,14,4],[0,0,0,2],[17,0,17,2],[18,0,18,3],[18,4,18,6],[20,0,20,1],[20,2,20,3],[20,4,20,5],[19,0,19,1],[19,2,19,3],[19,4,19,5],[23,0,23,1],[23,2,23,3],[23,4,23,5],[21,0,21,1],[21,2,21,3],[21,4,21,5],[22,0,22,1],[22,2,22,3],[22,4,22,5]]}
["TENNIS DE TABLE",null,null,{"$f":"Engagés!C3","v":"TABLEAU C"}]
[{"$f":"Engagés!K12","v":"Poule 20"}]
[null,"NOM","Prénom","Sigle","Vict","Def","Classement"]
[4,{"$f":"VLOOKUP($A4,Engagés!$A$1:$E$380,3,FALSE)","v":"LERICHE"},{"$f":"VLOOKUP($A4,Engagés!$A$1:$E$380,4,FALSE)","v":"GAETAN"},{"$f":"VLOOKUP($A4,Engagés!$A$1:$E$380,5,FALSE)","v":"75-4-STAP"},null,null,"1er"]
[13,{"$f":"VLOOKUP($A5,Engagés!$A$1:$E$380,3,FALSE)","v":0},{"$f":"VLOOKUP($A5,Engagés!$A$1:$E$380,4,FALSE)","v":0},{"$f":"VLOOKUP($A5,Engagés!$A$1:$E$380,5,FALSE)","v":0},null,null,"3ème"]
[20,{"$f":"VLOOKUP($A6,Engagés!$A$1:$E$380,3,FALSE)","v":"DE PREVAL"},{"$f":"VLOOKUP($A6,Engagés!$A$1:$E$380,4,FALSE)","v":"THEODORE"},{"$f":"VLOOKUP($A6,Engagés!$A$1:$E$380,5,FALSE)","v":"75-4-LMAP"},null,null,"2ème"]
[29,{"$f":"VLOOKUP($A7,Engagés!$A$1:$E$380,3,FALSE)","v":0},{"$f":"VLOOKUP($A7,Engagés!$A$1:$E$380,4,FALSE)","v":0},{"$f":"VLOOKUP($A7,Engagés!$A$1:$E$380,5,FALSE)","v":0},null,null,"4ème"]
["Si poule de 4 joueurs alors…"]
["Déroulement",null,null,"Joueurs A contre Joueur B",null,"Vainqueur","Score"]
["Match 1",null,null,{"$f":"B4","v":"LERICHE"},{"$f":"B7","v":0},0]
["Match 2",null,null,{"$f":"B5","v":0},{"$f":"B6","v":"DE PREVAL"},0]
["Finale vainqueur Match 1 contre vainqueur Match 2",null,null,{"$f":"IF(F10=\"\",\"\",F10)","v":0},{"$f":"IF(F11=\"\",\"\",F11)","v":0},0]
["Petite finale entre les deux perdants des matchs 1 et 2",null,null,null,null,0]
["Si poule de 3 joueurs alors…"]
["Déroulement",null,null,"Joueurs A contre Joueur B",null,"Vainqueur","Score"]
["Match 1",null,null,{"$f":"B4","v":"LERICHE"},{"$f":"B6","v":"DE PREVAL"}]
["Match 2",null,null,{"$f":"B5","v":0},{"$f":"B6","v":"DE PREVAL"}]
["Match 3",null,null,{"$f":"B4","v":"LERICHE"},{"$f":"B5","v":0}]
["CLASSEMENT",null,null,null,{"$f":"A2","v":"Poule 20"}]
[null,null,"NOM",null,"PRENOM",null,"SIGLE"]
["1er",null,{"$f":"IF($G$4=\"1er\", $B$4,IF($G$5=\"1er\",$B$5,IF($G$6=\"1er\",$B$6,IF($G$7=\"1er\",$B$7,\"\"))))","v":"LERICHE"},null,{"$f":"IF($G$4=\"1er\", $C$4,IF($G$5=\"1er\",$C$5,IF($G$6=\"1er\",$C$6,IF($G$7=\"1er\",$C$7,\"\"))))","v":"GAETAN"},null,{"$f":"IF($G$4=\"1er\", $D$4,IF($G$5=\"1er\",$D$5,IF($G$6=\"1er\",$D$6,IF($G$7=\"1er\",$D$7,\"\"))))","v":"75-4-STAP"}]
["2ème",null,{"$f":"IF($G$4=\"2ème\", $B$4,IF($G$5=\"2ème\",$B$5,IF($G$6=\"2ème\",$B$6,IF($G$7=\"2ème\",$B$7,\"\"))))","v":"DE PREVAL"},null,{"$f":"IF($G$4=\"2ème\", $C$4,IF($G$5=\"2ème\",$C$5,IF($G$6=\"2ème\",$C$6,IF($G$7=\"2ème\",$C$7,\"\"))))","v":"THEODORE"},null,{"$f":"IF($G$4=\"2ème\", $D$4,IF($G$5=\"2ème\",$D$5,IF($G$6=\"2ème\",$D$6,IF($G$7=\"2ème\",$D$7,\"\"))))","v":"75-4-LMAP"}]
["3ème",null,{"$f":"IF($G$4=\"3ème\", $B$4,IF($G$5=\"3ème\",$B$5,IF($G$6=\"3ème\",$B$6,IF($G$7=\"3ème\",$B$7,\"\"))))","v":0},null,{"$f":"IF($G$4=\"3ème\", $C$4,IF($G$5=\"3ème\",$C$5,IF($G$6=\"3ème\",$C$6,IF($G$7=\"3ème\",$C$7,\"\"))))","v":0},null,{"$f":"IF($G$4=\"3ème\", $D$4,IF($G$5=\"3ème\",$D$5,IF($G$6=\"3ème\",$D$6,IF($G$7=\"3ème\",$D$7,\"\"))))","v":0}]
["4ème",null,{"$f":"IF($G$4=\"4ème\", $B$4,IF($G$5=\"4ème\",$B$5,IF($G$6=\"4ème\",$B$6,IF($G$7=\"4ème\",$B$7,\"\"))))","v":0},null,{"$f":"IF($G$4=\"4ème\", $C$4,IF($G$5=\"4ème\",$C$5,IF($G$6=\"4ème\",$C$6,IF($G$7=\"4ème\",$C$7,\"\"))))","v":0},null,{"$f":"IF($G$4=\"4ème\", $D$4,IF($G$5=\"4ème\",$D$5,IF($G$6=\"4ème\",$D$6,IF($G$7=\"4ème\",$D$7,\"\"))))","v":0}]

{"sheet":"Poule 21","index":5,"n_rows":24,"n_cols":7,"rows_kept":24,"cut":false,"hidden":false,"merged":[[13,0,13,6],[10,0,10,2],[11,0,11,2],[1,0,1,2],[1,3,1,6],[7,0,7,6],[8,0,8,2],[8,3,8,4],[9,0,9,2],[0,0,0,2],[0,3,0,4],[20,0,20,1],[20,2,20,3],[20,4,20,5],[14,0,14,2],[14,3,14,4],[15,0,15,2],[18,4,18,6],[19,0,19,1],[19,2,19,3],[19,4,19,5],[16,0,16,2],[17,0,17,2],[18,0,18,3],[12,0,12,2],[23,0,23,1],[23,2,23,3],[23,4,23,5],[21,0,21,1],[21,2,21,3],[21,4,21,5],[22,0,22,1],[22,2,22,3],[22,4,22,5]]}
["TENNIS DE TABLE",null,null,{"$f":"Engagés!C3","v":"TABLEAU C"}]
[{"$f":"Engagés!G18","v":"Poule 21"}]
[null,"NOM","Prénom","Sigle","Vict","Def","Classement"]
[5,{"$f":"VLOOKUP($A4,Engagés!$A$1:$E$380,3,FALSE)","v":"CHOTARD"},{"$f":"VLOOKUP($A4,Engagés!$A$1:$E$380,4,FALSE)","v":"MARCUS"},{"$f":"VLOOKUP($A4,Engagés!$A$1:$E$380,5,FALSE)","v":"75-4-LMAP"},null,null,"2ème"]
[12,{"$f":"VLOOKUP($A5,Engagés!$A$1:$E$380,3,FALSE)","v":"PETROFF"},{"$f":"VLOOKUP($A5,Engagés!$A$1:$E$380,4,FALSE)","v":"MISHA"},{"$f":"VLOOKUP($A5,Engagés!$A$1:$E$380,5,FALSE)","v":"75-4-BLOP"},null,null,"1er"]
[21,{"$f":"VLOOKUP($A6,Engagés!$A$1:$E$380,3,FALSE)","v":"SUN"},{"$f":"VLOOKUP($A6,Engagés!$A$1:$E$380,4,FALSE)","v":"CESAR"},{"$f":"VLOOKUP($A6,Engagés!$A$1:$E$380,5,FALSE)","v":"75-2-SPFP"},null,null,"3ème"]
[28,{"$f":"VLOOKUP($A7,Engagés!$A$1:$E$380,3,FALSE)","v":0},{"$f":"VLOOKUP($A7,Engagés!$A$1:$E$380,4,FALSE)","v":0},{"$f":"VLOOKUP($A7,Engagés!$A$1:$E$380,5,FALSE)","v":0},null,null,"4ème"]
["Si poule de 4 joueurs alors…"]
["Déroulement",null,null,"Joueurs A contre Joueur B",null,"Vainqueur","Score"]
["Match 1",null,null,{"$f":"B4","v":"CHOTARD"},{"$f":"B7","v":0},0]
["Match 2",null,null,{"$f":"B5","v":"PETROFF"},{"$f":"B6","v":"SUN"},0]
["Finale vainqueur Match 1 contre vainqueur Match 2",null,null,{"$f":"IF(F10=\"\",\"\",F10)","v":0},{"$f":"IF(F11=\"\",\"\",F11)","v":0},0]
["Petite finale entre les deux perdants des matchs 1 et 2",null,null,null,null,0]
["Si poule de 3 joueurs alors…"]
["Déroulement",null,null,"Joueurs A contre Joueur B",null,"Vainqueur","Score"]
["Match 1",null,null,{"$f":"B4","v":"CHOTARD"},{"$f":"B6","v":"SUN"}]
["Match 2",null,null,{"$f":"B5","v":"PETROFF"},{"$f":"B6","v":"SUN"}]
["Match 3",null,null,{"$f":"B4","v":"CHOTARD"},{"$f":"B5","v":"PETROFF"}]
["CLASSEMENT",null,null,null,{"$f":"A2","v":"Poule 21"}]
[null,null,"NOM",null,"PRENOM",null,"SIGLE"]
["1er",null,{"$f":"IF($G$4=\"1er\", $B$4,IF($G$5=\"1er\",$B$5,IF($G$6=\"1er\",$B$6,IF($G$7=\"1er\",$B$7,\"\"))))","v":"PETROFF"},null,{"$f":"IF($G$4=\"1er\", $C$4,IF($G$5=\"1er\",$C$5,IF($G$6=\"1er\",$C$6,IF($G$7=\"1er\",$C$7,\"\"))))","v":"MISHA"},null,{"$f":"IF($G$4=\"1er\", $D$4,IF($G$5=\"1er\",$D$5,IF($G$6=\"1er\",$D$6,IF($G$7=\"1er\",$D$7,\"\"))))","v":"75-4-BLOP"}]
["2ème",null,{"$f":"IF($G$4=\"2ème\", $B$4,IF($G$5=\"2ème\",$B$5,IF($G$6=\"2ème\",$B$6,IF($G$7=\"2ème\",$B$7,\"\"))))","v":"CHOTARD"},null,{"$f":"IF($G$4=\"2ème\", $C$4,IF($G$5=\"2ème\",$C$5,IF($G$6=\"2ème\",$C$6,IF($G$7=\"2ème\",$C$7,\"\"))))","v":"MARCUS"},null,{"$f":"IF($G$4=\"2ème\", $D$4,IF($G$5=\"2ème\",$D$5,IF($G$6=\"2ème\",$D$6,IF($G$7=\"2ème\",$D$7,\"\"))))","v":"75-4-LMAP"}]
["3ème",null,{"$f":"IF($G$4=\"3ème\", $B$4,IF($G$5=\"3ème\",$B$5,IF($G$6=\"3ème\",$B$6,IF($G$7=\"3ème\",$B$7,\"\"))))","v":"SUN"},null,{"$f":"IF($G$4=\"3ème\", $C$4,IF($G$5=\"3ème\",$C$5,IF($G$6=\"3ème\",$C$6,IF($G$7=\"3ème\",$C$7,\"\"))))","v":"CESAR"},null,{"$f":"IF($G$4=\"3ème\", $D$4,IF($G$5=\"3ème\",$D$5,IF($G$6=\"3ème\",$D$6,IF($G$7=\"3ème\",$D$7,\"\"))))","v":"75-2-SPFP"}]
["4ème",null,{"$f":"IF($G$4=\"4ème\", $B$4,IF($G$5=\"4ème\",$B$5,IF($G$6=\"4ème\",$B$6,IF($G$7=\"4ème\",$B$7,\"\"))))","v":0},null,{"$f":"IF($G$4=\"4ème\", $C$4,IF($G$5=\"4ème\",$C$5,IF($G$6=\"4ème\",$C$6,IF($G$7=\"4ème\",$C$7,\"\"))))","v":0},null,{"$f":"IF($G$4=\"4ème\", $D$4,IF($G$5=\"4ème\",$D$5,IF($G$6=\"4ème\",$D$6,IF($G$7=\"4ème\",$D$7,\"\"))))","v":0}]

{"sheet":"Poule 22","index":6,"n_rows":24,"n_cols":7,"rows_kept":24,"cut":false,"hidden":false,"merged":[[13,0,13,6],[10,0,10,2],[11,0,11,2],[1,0,1,2],[1,3,1,6],[7,0,7,6],[8,0,8,2],[8,3,8,4],[9,0,9,2],[0,0,0,2],[0,3,0,4],[20,0,20,1],[20,2,20,3],[20,4,20,5],[14,0,14,2],[14,3,14,4],[15,0,15,2],[18,4,18,6],[19,0,19,1],[19,2,19,3],[19,4,19,5],[16,0,16,2],[17,0,17,2],[18,0,18,3],[12,0,12,2],[23,0,23,1],[23,2,23,3],[23,4,23,5],[21,0,21,1],[21,2,21,3],[21,4,21,5],[22,0,22,1],[22,2,22,3],[22,4,22,5]]}
["TENNIS DE TABLE",null,null,{"$f":"Engagés!C3","v":"TABLEAU C"}]
[{"$f":"Engagés!K18","v":"Poule 22"}]
[null,"NOM","Prénom","Sigle","Vict","Def","Classement"]
[6,{"$f":"VLOOKUP($A4,Engagés!$A$1:$E$380,3,FALSE)","v":"KOMILIKIS"},{"$f":"VLOOKUP($A4,Engagés!$A$1:$E$380,4,FALSE)","v":"RAPHAEL"},{"$f":"VLOOKUP($A4,Engagés!$A$1:$E$380,5,FALSE)","v":"75-4-SMPP"},null,null,"2ème"]
[11,{"$f":"VLOOKUP($A5,Engagés!$A$1:$E$380,3,FALSE)","v":"PLISSON"},{"$f":"VLOOKUP($A5,Engagés!$A$1:$E$380,4,FALSE)","v":"COME"},{"$f":"VLOOKUP($A5,Engagés!$A$1:$E$380,5,FALSE)","v":"75-4-STAP"},null,null,"1er"]
[22,{"$f":"VLOOKUP($A6,Engagés!$A$1:$E$380,3,FALSE)","v":"TURION"},{"$f":"VLOOKUP($A6,Engagés!$A$1:$E$380,4,FALSE)","v":"ALEXANDRE"},{"$f":"VLOOKUP($A6,Engagés!$A$1:$E$380,5,FALSE)","v":"75-4-PCHP"},null,null,"3ème"]
[27,{"$f":"VLOOKUP($A7,Engagés!$A$1:$E$380,3,FALSE)","v":0},{"$f":"VLOOKUP($A7,Engagés!$A$1:$E$380,4,FALSE)","v":0},{"$f":"VLOOKUP($A7,Engagés!$A$1:$E$380,5,FALSE)","v":0},null,null,"4ème"]
["Si poule de 4 joueurs alors…"]
["Déroulement",null,null,"Joueurs A contre Joueur B",null,"Vainqueur","Score"]
["Match 1",null,null,{"$f":"B4","v":"KOMILIKIS"},{"$f":"B7","v":0},0]
["Match 2",null,null,{"$f":"B5","v":"PLISSON"},{"$f":"B6","v":"TURION"},0]
["Finale vainqueur Match 1 contre vainqueur Match 2",null,null,{"$f":"IF(F10=\"\",\"\",F10)","v":0},{"$f":"IF(F11=\"\",\"\",F11)","v":0},0]
["Petite finale entre les deux perdants des matchs 1 et 2",null,null,null,null,0]
["Si poule de 3 joueurs alors…"]
["Déroulement",null,null,"Joueurs A contre Joueur B",null,"Vainqueur","Score"]
["Match 1",null,null,{"$f":"B4","v":"KOMILIKIS"},{"$f":"B6","v":"TURION"}]
["Match 2",null,null,{"$f":"B5","v":"PLISSON"},{"$f":"B6","v":"TURION"}]
["Match 3",null,null,{"$f":"B4","v":"KOMILIKIS"},{"$f":"B5","v":"PLISSON"}]
["CLASSEMENT",null,null,null,{"$f":"A2","v":"Poule 22"}]
[null,null,"NOM",null,"PRENOM",null,"SIGLE"]
["1er",null,{"$f":"IF($G$4=\"1er\", $B$4,IF($G$5=\"1er\",$B$5,IF($G$6=\"1er\",$B$6,IF($G$7=\"1er\",$B$7,\"\"))))","v":"PLISSON"},null,{"$f":"IF($G$4=\"1er\", $C$4,IF($G$5=\"1er\",$C$5,IF($G$6=\"1er\",$C$6,IF($G$7=\"1er\",$C$7,\"\"))))","v":"COME"},null,{"$f":"IF($G$4=\"1er\", $D$4,IF($G$5=\"1er\",$D$5,IF($G$6=\"1er\",$D$6,IF($G$7=\"1er\",$D$7,\"\"))))","v":"75-4-STAP"}]
["2ème",null,{"$f":"IF($G$4=\"2ème\", $B$4,IF($G$5=\"2ème\",$B$5,IF($G$6=\"2ème\",$B$6,IF($G$7=\"2ème\",$B$7,\"\"))))","v":"KOMILIKIS"},null,{"$f":"IF($G$4=\"2ème\", $C$4,IF($G$5=\"2ème\",$C$5,IF($G$6=\"2ème\",$C$6,IF($G$7=\"2ème\",$C$7,\"\"))))","v":"RAPHAEL"},null,{"$f":"IF($G$4=\"2ème\", $D$4,IF($G$5=\"2ème\",$D$5,IF($G$6=\"2ème\",$D$6,IF($G$7=\"2ème\",$D$7,\"\"))))","v":"75-4-SMPP"}]
["3ème",null,{"$f":"IF($G$4=\"3ème\", $B$4,IF($G$5=\"3ème\",$B$5,IF($G$6=\"3ème\",$B$6,IF($G$7=\"3ème\",$B$7,\"\"))))","v":"TURION"},null,{"$f":"IF($G$4=\"3ème\", $C$4,IF($G$5=\"3ème\",$C$5,IF($G$6=\"3ème\",$C$6,IF($G$7=\"3ème\",$C$7,\"\"))))","v":"ALEXANDRE"},null,{"$f":"IF($G$4=\"3ème\", $D$4,IF($G$5=\"3ème\",$D$5,IF($G$6=\"3ème\",$D$6,IF($G$7=\"3ème\",$D$7,\"\"))))","v":"75-4-PCHP"}]
["4ème",null,{"$f":"IF($G$4=\"4ème\", $B$4,IF($G$5=\"4ème\",$B$5,IF($G$6=\"4ème\",$B$6,IF($G$7=\"4ème\",$B$7,\"\"))))","v":0},null,{"$f":"IF($G$4=\"4ème\", $C$4,IF($G$5=\"4ème\",$C$5,IF($G$6=\"4ème\",$C$6,IF($G$7=\"4ème\",$C$7,\"\"))))","v":0},null,{"$f":"IF($G$4=\"4ème\", $D$4,IF($G$5=\"4ème\",$D$5,IF($G$6=\"4ème\",$D$6,IF($G$7=\"4ème\",$D$7,\"\"))))","v":0}]

{"sheet":"Poule 23","index":7,"n_rows":24,"n_cols":7,"rows_kept":24,"cut":false,"hidden":false,"merged":[[13,0,13,6],[10,0,10,2],[11,0,11,2],[1,0,1,2],[1,3,1,6],[7,0,7,6],[8,0,8,2],[8,3,8,4],[9,0,9,2],[0,0,0,2],[0,3,0,4],[20,0,20,1],[20,2,20,3],[20,4,20,5],[14,0,14,2],[14,3,14,4],[15,0,15,2],[18,4,18,6],[19,0,19,1],[19,2,19,3],[19,4,19,5],[16,0,16,2],[17,0,17,2],[18,0,18,3],[12,0,12,2],[23,0,23,1],[23,2,23,3],[23,4,23,5],[21,0,21,1],[21,2,21,3],[21,4,21,5],[22,0,22,1],[22,2,22,3],[22,4,22,5]]}
["TENNIS DE TABLE",null,null,{"$f":"Engagés!C3","v":"TABLEAU C"}]
[{"$f":"Engagés!G24","v":"Poule 23"}]
[null,"NOM","Prénom","Sigle","Vict","Def","Classement"]
[7,{"$f":"VLOOKUP($A4,Engagés!$A$1:$E$380,3,FALSE)","v":"BAUD"},{"$f":"VLOOKUP($A4,Engagés!$A$1:$E$380,4,FALSE)","v":"ARISTIDE"},{"$f":"VLOOKUP($A4,Engagés!$A$1:$E$380,5,FALSE)","v":"75-2-SUPA"},null,null,"2ème"]
[10,{"$f":"VLOOKUP($A5,Engagés!$A$1:$E$380,3,FALSE)","v":"LIN"},{"$f":"VLOOKUP($A5,Engagés!$A$1:$E$380,4,FALSE)","v":"LUCAS"},{"$f":"VLOOKUP($A5,Engagés!$A$1:$E$380,5,FALSE)","v":"75-2-SLHP"},null,null,"1er"]
[23,{"$f":"VLOOKUP($A6,Engagés!$A$1:$E$380,3,FALSE)","v":0},{"$f":"VLOOKUP($A6,Engagés!$A$1:$E$380,4,FALSE)","v":0},{"$f":"VLOOKUP($A6,Engagés!$A$1:$E$380,5,FALSE)","v":0},null,null,"3ème"]
[26,{"$f":"VLOOKUP($A7,Engagés!$A$1:$E$380,3,FALSE)","v":0},{"$f":"VLOOKUP($A7,Engagés!$A$1:$E$380,4,FALSE)","v":0},{"$f":"VLOOKUP($A7,Engagés!$A$1:$E$380,5,FALSE)","v":0},null,null,"4ème"]
["Si poule de 4 joueurs alors…"]
["Déroulement",null,null,"Joueurs A contre Joueur B",null,"Vainqueur","Score"]
["Match 1",null,null,{"$f":"B4","v":"BAUD"},{"$f":"B7","v":0},0]
["Match 2",null,null,{"$f":"B5","v":"LIN"},{"$f":"B6","v":0},0]
["Finale vainqueur Match 1 contre vainqueur Match 2",null,null,{"$f":"IF(F10=\"\",\"\",F10)","v":0},{"$f":"IF(F11=\"\",\"\",F11)","v":0},0]
["Petite finale entre les deux perdants des matchs 1 et 2",null,null,null,null,0]
["Si poule de 3 joueurs alors…"]
["Déroulement",null,null,"Joueurs A contre Joueur B",null,"Vainqueur","Score"]
["Match 1",null,null,{"$f":"B4","v":"BAUD"},{"$f":"B6","v":0}]
["Match 2",null,null,{"$f":"B5","v":"LIN"},{"$f":"B6","v":0}]
["Match 3",null,null,{"$f":"B4","v":"BAUD"},{"$f":"B5","v":"LIN"}]
["CLASSEMENT",null,null,null,{"$f":"A2","v":"Poule 23"}]
[null,null,"NOM",null,"PRENOM",null,"SIGLE"]
["1er",null,{"$f":"IF($G$4=\"1er\", $B$4,IF($G$5=\"1er\",$B$5,IF($G$6=\"1er\",$B$6,IF($G$7=\"1er\",$B$7,\"\"))))","v":"LIN"},null,{"$f":"IF($G$4=\"1er\", $C$4,IF($G$5=\"1er\",$C$5,IF($G$6=\"1er\",$C$6,IF($G$7=\"1er\",$C$7,\"\"))))","v":"LUCAS"},null,{"$f":"IF($G$4=\"1er\", $D$4,IF($G$5=\"1er\",$D$5,IF($G$6=\"1er\",$D$6,IF($G$7=\"1er\",$D$7,\"\"))))","v":"75-2-SLHP"}]
["2ème",null,{"$f":"IF($G$4=\"2ème\", $B$4,IF($G$5=\"2ème\",$B$5,IF($G$6=\"2ème\",$B$6,IF($G$7=\"2ème\",$B$7,\"\"))))","v":"BAUD"},null,{"$f":"IF($G$4=\"2ème\", $C$4,IF($G$5=\"2ème\",$C$5,IF($G$6=\"2ème\",$C$6,IF($G$7=\"2ème\",$C$7,\"\"))))","v":"ARISTIDE"},null,{"$f":"IF($G$4=\"2ème\", $D$4,IF($G$5=\"2ème\",$D$5,IF($G$6=\"2ème\",$D$6,IF($G$7=\"2ème\",$D$7,\"\"))))","v":"75-2-SUPA"}]
["3ème",null,{"$f":"IF($G$4=\"3ème\", $B$4,IF($G$5=\"3ème\",$B$5,IF($G$6=\"3ème\",$B$6,IF($G$7=\"3ème\",$B$7,\"\"))))","v":0},null,{"$f":"IF($G$4=\"3ème\", $C$4,IF($G$5=\"3ème\",$C$5,IF($G$6=\"3ème\",$C$6,IF($G$7=\"3ème\",$C$7,\"\"))))","v":0},null,{"$f":"IF($G$4=\"3ème\", $D$4,IF($G$5=\"3ème\",$D$5,IF($G$6=\"3ème\",$D$6,IF($G$7=\"3ème\",$D$7,\"\"))))","v":0}]
["4ème",null,{"$f":"IF($G$4=\"4ème\", $B$4,IF($G$5=\"4ème\",$B$5,IF($G$6=\"4ème\",$B$6,IF($G$7=\"4ème\",$B$7,\"\"))))","v":0},null,{"$f":"IF($G$4=\"4ème\", $C$4,IF($G$5=\"4ème\",$C$5,IF($G$6=\"4ème\",$C$6,IF($G$7=\"4ème\",$C$7,\"\"))))","v":0},null,{"$f":"IF($G$4=\"4ème\", $D$4,IF($G$5=\"4ème\",$D$5,IF($G$6=\"4ème\",$D$6,IF($G$7=\"4ème\",$D$7,\"\"))))","v":0}]

{"sheet":"Poule 24","index":8,"n_rows":24,"n_cols":7,"rows_kept":24,"cut":false,"hidden":false,"merged":[[13,0,13,6],[10,0,10,2],[11,0,11,2],[1,0,1,2],[1,3,1,6],[7,0,7,6],[8,0,8,2],[8,3,8,4],[9,0,9,2],[0,0,0,2],[0,3,0,4],[20,0,20,1],[20,2,20,3],[20,4,20,5],[14,0,14,2],[14,3,14,4],[15,0,15,2],[18,4,18,6],[19,0,19,1],[19,2,19,3],[19,4,19,5],[16,0,16,2],[17,0,17,2],[18,0,18,3],[12,0,12,2],[23,0,23,1],[23,2,23,3],[23,4,23,5],[21,0,21,1],[21,2,21,3],[21,4,21,5],[22,0,22,1],[22,2,22,3],[22,4,22,5]]}
["TENNIS DE TABLE",null,null,{"$f":"Engagés!C3","v":"TABLEAU C"}]
[{"$f":"Engagés!K24","v":"Poule 24"}]
[null,"NOM","Prénom","Sigle","Vict","Def","Classement"]
[8,{"$f":"VLOOKUP($A4,Engagés!$A$1:$E$380,3,FALSE)","v":"MICOLLIER"},{"$f":"VLOOKUP($A4,Engagés!$A$1:$E$380,4,FALSE)","v":"JULES"},{"$f":"VLOOKUP($A4,Engagés!$A$1:$E$380,5,FALSE)","v":"75-4-BLOP"},null,null,"1er"]
[9,{"$f":"VLOOKUP($A5,Engagés!$A$1:$E$380,3,FALSE)","v":"CLEMOT"},{"$f":"VLOOKUP($A5,Engagés!$A$1:$E$380,4,FALSE)","v":"MAEL"},{"$f":"VLOOKUP($A5,Engagés!$A$1:$E$380,5,FALSE)","v":"75-2-SLHP"},null,null,"2ème"]
[24,{"$f":"VLOOKUP($A6,Engagés!$A$1:$E$380,3,FALSE)","v":"MANUEL"},{"$f":"VLOOKUP($A6,Engagés!$A$1:$E$380,4,FALSE)","v":"ANTOINE"},{"$f":"VLOOKUP($A6,Engagés!$A$1:$E$380,5,FALSE)","v":"75-4-LMAP"},null,null,"3ème"]
[25,{"$f":"VLOOKUP($A7,Engagés!$A$1:$E$380,3,FALSE)","v":0},{"$f":"VLOOKUP($A7,Engagés!$A$1:$E$380,4,FALSE)","v":0},{"$f":"VLOOKUP($A7,Engagés!$A$1:$E$380,5,FALSE)","v":0},null,null,"4ème"]
["Si poule de 4 joueurs alors…"]
["Déroulement",null,null,"Joueurs A contre Joueur B",null,"Vainqueur","Score"]
["Match 1",null,null,{"$f":"B4","v":"MICOLLIER"},{"$f":"B7","v":0},0]
["Match 2",null,null,{"$f":"B5","v":"CLEMOT"},{"$f":"B6","v":"MANUEL"},0]
["Finale vainqueur Match 1 contre vainqueur Match 2",null,null,{"$f":"IF(F10=\"\",\"\",F10)","v":0},{"$f":"IF(F11=\"\",\"\",F11)","v":0},0]
["Petite finale entre les deux perdants des matchs 1 et 2",null,null,null,null,0]
["Si poule de 3 joueurs alors…"]
["Déroulement",null,null,"Joueurs A contre Joueur B",null,"Vainqueur","Score"]
["Match 1",null,null,{"$f":"B4","v":"MICOLLIER"},{"$f":"B6","v":"MANUEL"}]
["Match 2",null,null,{"$f":"B5","v":"CLEMOT"},{"$f":"B6","v":"MANUEL"}]
["Match 3",null,null,{"$f":"B4","v":"MICOLLIER"},{"$f":"B5","v":"CLEMOT"}]
["CLASSEMENT",null,null,null,{"$f":"A2","v":"Poule 24"}]
[null,null,"NOM",null,"PRENOM",null,"SIGLE"]
["1er",null,{"$f":"IF($G$4=\"1er\", $B$4,IF($G$5=\"1er\",$B$5,IF($G$6=\"1er\",$B$6,IF($G$7=\"1er\",$B$7,\"\"))))","v":"MICOLLIER"},null,{"$f":"IF($G$4=\"1er\", $C$4,IF($G$5=\"1er\",$C$5,IF($G$6=\"1er\",$C$6,IF($G$7=\"1er\",$C$7,\"\"))))","v":"JULES"},null,{"$f":"IF($G$4=\"1er\", $D$4,IF($G$5=\"1er\",$D$5,IF($G$6=\"1er\",$D$6,IF($G$7=\"1er\",$D$7,\"\"))))","v":"75-4-BLOP"}]
["2ème",null,{"$f":"IF($G$4=\"2ème\", $B$4,IF($G$5=\"2ème\",$B$5,IF($G$6=\"2ème\",$B$6,IF($G$7=\"2ème\",$B$7,\"\"))))","v":"CLEMOT"},null,{"$f":"IF($G$4=\"2ème\", $C$4,IF($G$5=\"2ème\",$C$5,IF($G$6=\"2ème\",$C$6,IF($G$7=\"2ème\",$C$7,\"\"))))","v":"MAEL"},null,{"$f":"IF($G$4=\"2ème\", $D$4,IF($G$5=\"2ème\",$D$5,IF($G$6=\"2ème\",$D$6,IF($G$7=\"2ème\",$D$7,\"\"))))","v":"75-2-SLHP"}]
["3ème",null,{"$f":"IF($G$4=\"3ème\", $B$4,IF($G$5=\"3ème\",$B$5,IF($G$6=\"3ème\",$B$6,IF($G$7=\"3ème\",$B$7,\"\"))))","v":"MANUEL"},null,{"$f":"IF($G$4=\"3ème\", $C$4,IF($G$5=\"3ème\",$C$5,IF($G$6=\"3ème\",$C$6,IF($G$7=\"3ème\",$C$7,\"\"))))","v":"ANTOINE"},null,{"$f":"IF($G$4=\"3ème\", $D$4,IF($G$5=\"3ème\",$D$5,IF($G$6=\"3ème\",$D$6,IF($G$7=\"3ème\",$D$7,\"\"))))","v":"75-4-LMAP"}]
["4ème",null,{"$f":"IF($G$4=\"4ème\", $B$4,IF($G$5=\"4ème\",$B$5,IF($G$6=\"4ème\",$B$6,IF($G$7=\"4ème\",$B$7,\"\"))))","v":0},null,{"$f":"IF($G$4=\"4ème\", $C$4,IF($G$5=\"4ème\",$C$5,IF($G$6=\"4ème\",$C$6,IF($G$7=\"4ème\",$C$7,\"\"))))","v":0},null,{"$f":"IF($G$4=\"4ème\", $D$4,IF($G$5=\"4ème\",$D$5,IF($G$6=\"4ème\",$D$6,IF($G$7=\"4ème\",$D$7,\"\"))))","v":0}]

{"sheet":"Résultats de poule","index":9,"n_rows":10,"n_cols":16,"rows_kept":10,"cut":false,"hidden":false,"merged":[[0,0,0,3],[0,4,0,7],[0,8,0,11],[0,12,0,15],[5,0,5,3],[5,4,5,7],[5,8,5,11],[5,12,5,15]]}
[{"$f":"Engagés!G6","v":"Poule 17"},null,null,null,{"$f":"Engagés!K6","v":"Poule 18"},null,null,null,{"$f":"Engagés!G12","v":"Poule 19"},null,null,null,{"$f":"Engagés!K12","v":"Poule 20"}]
["1er",{"$f":"'Poule 17'!$C21","v":"PINCEMIN"},{"$f":"'Poule 17'!$E21","v":"PAUL"},{"$f":"'Poule 17'!$G21","v":"75-4-FENP"},"1er",{"$f":"'Poule 18'!$C21","v":"RODIER"},{"$f":"'Poule 18'!$E21","v":"MATTEO"},{"$f":"'Poule 18'!$G21","v":"75-4-LMAP"},"1er",{"$f":"'Poule 19'!$C21","v":"GILLIS--JOLIVET"},{"$f":"'Poule 19'!$E21","v":"ARTHUR"},{"$f":"'Poule 19'!$G21","v":"75-2-NDLP"},"1er",{"$f":"'Poule 20'!$C21","v":"LERICHE"},{"$f":"'Poule 20'!$E21","v":"GAETAN"},{"$f":"'Poule 20'!$G21","v":"75-4-STAP"}]
["2ème",{"$f":"'Poule 17'!$C22","v":"REMONDELLI"},{"$f":"'Poule 17'!$E22","v":"SACHA"},{"$f":"'Poule 17'!$G22","v":"75-2-SPFP"},"2ème",{"$f":"'Poule 18'!$C22","v":"GUILLEMETTE"},{"$f":"'Poule 18'!$E22","v":"BAPTISTE"},{"$f":"'Poule 18'!$G22","v":"75-4-PCHP"},"2ème",{"$f":"'Poule 19'!$C22","v":"BRICOGNE"},{"$f":"'Poule 19'!$E22","v":"ARTHUS"},{"$f":"'Poule 19'!$G22","v":"75-4-FENP"},"2ème",{"$f":"'Poule 20'!$C22","v":"DE PREVAL"},{"$f":"'Poule 20'!$E22","v":"THEODORE"},{"$f":"'Poule 20'!$G22","v":"75-4-LMAP"}]
["3ème",{"$f":"'Poule 17'!$C23","v":0},{"$f":"'Poule 17'!$E23","v":0},{"$f":"'Poule 17'!$G23","v":0},"3ème",{"$f":"'Poule 18'!$C23","v":"IFATUROTI"},{"$f":"'Poule 18'!$E23","v":"PIERRE"},{"$f":"'Poule 18'!$G23","v":"75-2-SPFP"},"3ème",{"$f":"'Poule 19'!$C23","v":"LE ROY"},{"$f":"'Poule 19'!$E23","v":"CLEMENT"},{"$f":"'Poule 19'!$G23","v":"75-4-LMAP"},"3ème",{"$f":"'Poule 20'!$C23","v":0},{"$f":"'Poule 20'!$E23","v":0},{"$f":"'Poule 20'!$G23","v":0}]
["4ème",{"$f":"'Poule 17'!$C24","v":0},{"$f":"'Poule 17'!$E24","v":0},{"$f":"'Poule 17'!$G24","v":0},"4ème",{"$f":"'Poule 18'!$C24","v":0},{"$f":"'Poule 18'!$E24","v":0},{"$f":"'Poule 18'!$G24","v":0},"4ème",{"$f":"'Poule 19'!$C24","v":0},{"$f":"'Poule 19'!$E24","v":0},{"$f":"'Poule 19'!$G24","v":0},"4ème",{"$f":"'Poule 20'!$C24","v":0},{"$f":"'Poule 20'!$E24","v":0},{"$f":"'Poule 20'!$G24","v":0}]
[{"$f":"Engagés!G18","v":"Poule 21"},null,null,null,{"$f":"Engagés!K18","v":"Poule 22"},null,null,null,{"$f":"Engagés!G24","v":"Poule 23"},null,null,null,{"$f":"Engagés!K24","v":"Poule 24"}]
["1er",{"$f":"'Poule 21'!$C21","v":"PETROFF"},{"$f":"'Poule 21'!$E21","v":"MISHA"},{"$f":"'Poule 21'!$G21","v":"75-4-BLOP"},"1er",{"$f":"'Poule 22'!$C21","v":"PLISSON"},{"$f":"'Poule 22'!$E21","v":"COME"},{"$f":"'Poule 22'!$G21","v":"75-4-STAP"},"1er",{"$f":"'Poule 23'!$C21","v":"LIN"},{"$f":"'Poule 23'!$E21","v":"LUCAS"},{"$f":"'Poule 23'!$G21","v":"75-2-SLHP"},"1er",{"$f":"'Poule 24'!$C21","v":"MICOLLIER"},{"$f":"'Poule 24'!$E21","v":"JULES"},{"$f":"'Poule 24'!$G21","v":"75-4-BLOP"}]
["2ème",{"$f":"'Poule 21'!$C22","v":"CHOTARD"},{"$f":"'Poule 21'!$E22","v":"MARCUS"},{"$f":"'Poule 21'!$G22","v":"75-4-LMAP"},"2ème",{"$f":"'Poule 22'!$C22","v":"KOMILIKIS"},{"$f":"'Poule 22'!$E22","v":"RAPHAEL"},{"$f":"'Poule 22'!$G22","v":"75-4-SMPP"},"2ème",{"$f":"'Poule 23'!$C22","v":"BAUD"},{"$f":"'Poule 23'!$E22","v":"ARISTIDE"},{"$f":"'Poule 23'!$G22","v":"75-2-SUPA"},"2ème",{"$f":"'Poule 24'!$C22","v":"CLEMOT"},{"$f":"'Poule 24'!$E22","v":"MAEL"},{"$f":"'Poule 24'!$G22","v":"75-2-SLHP"}]
["3ème",{"$f":"'Poule 21'!$C23","v":"SUN"},{"$f":"'Poule 21'!$E23","v":"CESAR"},{"$f":"'Poule 21'!$G23","v":"75-2-SPFP"},"3ème",{"$f":"'Poule 22'!$C23","v":"TURION"},{"$f":"'Poule 22'!$E23","v":"ALEXANDRE"},{"$f":"'Poule 22'!$G23","v":"75-4-PCHP"},"3ème",{"$f":"'Poule 23'!$C23","v":0},{"$f":"'Poule 23'!$E23","v":0},{"$f":"'Poule 23'!$G23","v":0},"3ème",{"$f":"'Poule 24'!$C23","v":"MANUEL"},{"$f":"'Poule 24'!$E23","v":"ANTOINE"},{"$f":"'Poule 24'!$G23","v":"75-4-LMAP"}]
["4ème",{"$f":"'Poule 21'!$C24","v":0},{"$f":"'Poule 21'!$E24","v":0},{"$f":"'Poule 21'!$G24","v":0},"4ème",{"$f":"'Poule 22'!$C24","v":0},{"$f":"'Poule 22'!$E24","v":0},{"$f":"'Poule 22'!$G24","v":0},"4ème",{"$f":"'Poule 23'!$C24","v":0},{"$f":"'Poule 23'!$E24","v":0},{"$f":"'Poule 23'!$G24","v":0},"4ème",{"$f":"'Poule 24'!$C24","v":0},{"$f":"'Poule 24'!$E24","v":0},{"$f":"'Poule 24'!$G24","v":0}]

{"sheet":"Tableau","index":10,"n_rows":92,"n_cols":34,"rows_kept":92,"cut":false,"hidden":false,"merged":[[8,10,8,11],[50,20,50,21],[16,10,16,11],[23,10,23,11],[33,10,33,11],[40,10,40,11],[48,10,48,11],[10,20,10,21],[30,32,30,33],[0,16,0,19],[15,29,15,30],[0,0,0,14],[31,29,31,30],[10,1,10,2],[1,4,1,5],[0,20,0,33],[16,26,16,27],[23,23,23,24],[3,20,3,21],[18,20,18,21],[29,4,29,5],[25,20,25,21],[1,10,1,11],[9,23,9,24],[55,10,55,11],[33,4,33,5],[42,1,42,2],[59,29,59,30],[55,23,55,24],[47,29,47,30],[35,20,35,21],[42,20,42,21],[41,23,41,24],[48,26,48,27],[57,20,57,21]]}
["REPECHAGES ET MATCHS DE CLASSEMENT",null,null,null,null,null,null,null,null,null,null,null,null,null,null,null,"1er tour de tableau",null,null,null,"TABLEAU PRINCIPAL"]
[]
[]
[null,null,null,null,null,null,null,null,null,null,null,null,null,null,null,null,"1er poule 17",{"$f":"'Résultats de poule'!B2","v":"PINCEMIN"},{"$f":"'Résultats de poule'!D2","v":"75-4-FENP"},"V","1/8 de finale 1"]
[null,null,null,null,null,null,null,null,null,null,null,null,"P",{"$f":"IF(T4=\"\",\"\",IF(T4=\"p\",S4,S5))","v":0},{"$f":"IF(T4=\"\",\"\",IF(T4=\"p\",R4,R5))","v":0},null,"4ème poule 24",{"$f":"'Résultats de poule'!N10","v":0},{"$f":"'Résultats de poule'!P10","v":0},"P",{"$f":"IF(T4=\"\",\"\",IF(T4=\"v\",R4,R5))","v":"PINCEMIN"},{"$f":"IF(T4=\"\",\"\",IF(T4=\"v\",S4,S5))","v":"75-4-FENP"},"V"]
[null,null,null,null,null,null,null,null,null,null,{"$f":"IF(M5=\"\",\"\",IF(M5=\"v\",N5,N7))","v":"75-4-SMPP"},{"$f":"IF(M5=\"\",\"\",IF(M5=\"v\",O5,O7))","v":"KOMILIKIS"},null,null,null,null,null,null,null,null,null,null,null,{"$f":"IF(W5=\"\",\"\",IF(W5=\"v\",U5,U7))","v":"PINCEMIN"},{"$f":"IF(W5=\"\",\"\",IF(W5=\"v\",V5,V7))","v":"75-4-FENP"},"V"]
[null,null,null,null,null,null,null,null,null,null,null,null,"V",{"$f":"IF(T7=\"\",\"\",IF(T7=\"p\",S7,S8))","v":"75-4-SMPP"},{"$f":"IF(T7=\"\",\"\",IF(T7=\"p\",R7,R8))","v":"KOMILIKIS"},null,"3ème poule 19",{"$f":"'Résultats de poule'!J4","v":"LE ROY"},{"$f":"'Résultats de poule'!L4","v":"75-4-LMAP"},"V",{"$f":"IF(T7=\"\",\"\",IF(T7=\"v\",R7,R8))","v":"LE ROY"},{"$f":"IF(T7=\"\",\"\",IF(T7=\"v\",S7,S8))","v":"75-4-LMAP"},"P"]
[null,null,null,null,null,null,null,null,null,null,null,null,null,null,null,null,"2ème poule 22",{"$f":"'Résultats de poule'!F8","v":"KOMILIKIS"},{"$f":"'Résultats de poule'!H8","v":"75-4-SMPP"},"P"]
[null,null,null,null,null,null,null,{"$f":"IF(J6=\"\",\"\",IF(J6=\"v\",K6,K13))","v":""},{"$f":"IF(J6=\"\",\"\",IF(J6=\"v\",L6,L13))","v":""}]
[null,null,null,null,null,null,null,null,null,null,null,null,null,null,null,null,null,null,null,null,null,null,null,"1/4 finale 1",null,null,{"$f":"IF(Z6=\"\",\"\",IF(Z6=\"v\",X6,X13))","v":"PINCEMIN"},{"$f":"IF(Z6=\"\",\"\",IF(Z6=\"v\",Y6,Y13))","v":"75-4-FENP"},"P"]
[null,null,null,null,null,null,null,null,null,null,null,null,null,null,null,null,"2ème poule 20",{"$f":"'Résultats de poule'!N3","v":"DE PREVAL"},{"$f":"'Résultats de poule'!P3","v":"75-4-LMAP"},"V","1/8 de finale 2"]
[null,null,null,null,null,null,null,null,null,null,null,null,"V",{"$f":"IF(T11=\"\",\"\",IF(T11=\"p\",S11,S12))","v":"75-2-SPFP"},{"$f":"IF(T11=\"\",\"\",IF(T11=\"p\",R11,R12))","v":"SUN"},null,"3ème poule 21",{"$f":"'Résultats de poule'!B9","v":"SUN"},{"$f":"'Résultats de poule'!D9","v":"75-2-SPFP"},"P",{"$f":"IF(T11=\"\",\"\",IF(T11=\"v\",R11,R12))","v":"DE PREVAL"},{"$f":"IF(T11=\"\",\"\",IF(T11=\"v\",S11,S12))","v":"75-4-LMAP"},"V"]
[null,null,null,null,null,null,null,null,null,null,{"$f":"IF(M12=\"\",\"\",IF(M12=\"v\",N12,N14))","v":"75-2-SPFP"},{"$f":"IF(M12=\"\",\"\",IF(M12=\"v\",O12,O14))","v":"SUN"},null,null,null,null,null,null,null,null,null,null,null,{"$f":"IF(W12=\"\",\"\",IF(W12=\"v\",U12,U14))","v":"DE PREVAL"},{"$f":"IF(W12=\"\",\"\",IF(W12=\"v\",V12,V14))","v":"75-4-LMAP"},"P"]
[null,null,null,null,null,null,null,null,null,null,null,null,"P",{"$f":"IF(T14=\"\",\"\",IF(T14=\"p\",S14,S15))","v":0},{"$f":"IF(T14=\"\",\"\",IF(T14=\"p\",R14,R15))","v":0},null,"4ème poule 18",{"$f":"'Résultats de poule'!F5","v":0},{"$f":"'Résultats de poule'!H5","v":0},"P",{"$f":"IF(T14=\"\",\"\",IF(T14=\"v\",R14,R15))","v":"LIN"},{"$f":"IF(T14=\"\",\"\",IF(T14=\"v\",S14,S15))","v":"75-2-SLHP"},"P"]
[null,null,null,null,null,null,null,null,null,null,null,null,null,null,null,null,"1er poule 23",{"$f":"'Résultats de poule'!J7","v":"LIN"},{"$f":"'Résultats de poule'!L7","v":"75-2-SLHP"},"V"]
[null,null,null,null,{"$f":"IF(G9=\"\",\"\",IF(G9=\"v\",H9,H24))","v":""},{"$f":"IF(G9=\"\",\"\",IF(G9=\"v\",I9,I24))","v":""}]
[null,null,null,null,null,null,null,null,null,null,null,null,null,null,null,null,null,null,null,null,null,null,null,null,null,null,"1/2 finale A",null,null,{"$f":"IF(AC10=\"\",\"\",IF(AC10=\"v\",AA10,AA24))","v":"LERICHE"},{"$f":"IF(AC10=\"\",\"\",IF(AC10=\"v\",AB10,AB24))","v":"75-4-STAP"},"V"]
[]
[null,null,null,null,null,null,null,null,null,null,null,null,null,null,null,null,"1er poule 22",{"$f":"'Résultats de poule'!F7","v":"PLISSON"},{"$f":"'Résultats de poule'!H7","v":"75-4-STAP"},"V","1/8 de finale 3"]
[null,null,null,null,null,null,null,null,null,null,null,null,"P",{"$f":"IF(T19=\"\",\"\",IF(T19=\"p\",S19,S20))","v":0},{"$f":"IF(T19=\"\",\"\",IF(T19=\"p\",R19,R20))","v":0},null,"4ème poule 19",{"$f":"'Résultats de poule'!J5","v":0},{"$f":"'Résultats de poule'!L5","v":0},"P",{"$f":"IF(T19=\"\",\"\",IF(T19=\"v\",R19,R20))","v":"PLISSON"},{"$f":"IF(T19=\"\",\"\",IF(T19=\"v\",S19,S20))","v":"75-4-STAP"},"V"]
[null,null,null,null,null,null,null,null,null,null,{"$f":"IF(M20=\"\",\"\",IF(M20=\"v\",N20,N22))","v":"75-4-LMAP"},{"$f":"IF(M20=\"\",\"\",IF(M20=\"v\",O20,O22))","v":"MANUEL"},null,null,null,null,null,null,null,null,null,null,null,{"$f":"IF(W20=\"\",\"\",IF(W20=\"v\",U20,U22))","v":"PLISSON"},{"$f":"IF(W20=\"\",\"\",IF(W20=\"v\",V20,V22))","v":"75-4-STAP"},"P"]
[null,null,null,null,null,null,null,null,null,null,null,null,"V",{"$f":"IF(T22=\"\",\"\",IF(T22=\"p\",S22,S23))","v":"75-4-LMAP"},{"$f":"IF(T22=\"\",\"\",IF(T22=\"p\",R22,R23))","v":"MANUEL"},null,"3ème poule 24",{"$f":"'Résultats de poule'!N9","v":"MANUEL"},{"$f":"'Résultats de poule'!P9","v":"75-4-LMAP"},"P",{"$f":"IF(T22=\"\",\"\",IF(T22=\"v\",R22,R23))","v":"REMONDELLI"},{"$f":"IF(T22=\"\",\"\",IF(T22=\"v\",S22,S23))","v":"75-2-SPFP"},"P"]
[null,null,null,null,null,null,null,null,null,null,null,null,null,null,null,null,"2ème poule 17",{"$f":"'Résultats de poule'!B3","v":"REMONDELLI"},{"$f":"'Résultats de poule'!D3","v":"75-2-SPFP"},"V"]
[null,null,null,null,null,null,null,{"$f":"IF(J21=\"\",\"\",IF(J21=\"v\",K21,K28))","v":""},{"$f":"IF(J21=\"\",\"\",IF(J21=\"v\",L21,L28))","v":""},null,null,null,null,null,null,null,null,null,null,null,null,null,null,"1/4 finale 2",null,null,{"$f":"IF(Z21=\"\",\"\",IF(Z21=\"v\",X21,X28))","v":"LERICHE"},{"$f":"IF(Z21=\"\",\"\",IF(Z21=\"v\",Y21,Y28))","v":"75-4-STAP"},"V"]
[]
[null,null,null,null,null,null,null,null,null,null,null,null,null,null,null,null,"2ème poule 23",{"$f":"'Résultats de poule'!J8","v":"BAUD"},{"$f":"'Résultats de poule'!L8","v":"75-2-SUPA"},"V","1/8 de finale 4"]
[null,null,null,null,null,null,null,null,null,null,null,null,"V",{"$f":"IF(T26=\"\",\"\",IF(T26=\"p\",S26,S27))","v":"75-2-SPFP"},{"$f":"IF(T26=\"\",\"\",IF(T26=\"p\",R26,R27))","v":"IFATUROTI"},null,"3ème poule 18",{"$f":"'Résultats de poule'!F4","v":"IFATUROTI"},{"$f":"'Résultats de poule'!H4","v":"75-2-SPFP"},"P",{"$f":"IF(T26=\"\",\"\",IF(T26=\"v\",R26,R27))","v":"BAUD"},{"$f":"IF(T26=\"\",\"\",IF(T26=\"v\",S26,S27))","v":"75-2-SUPA"},"P"]
[null,null,null,null,null,null,null,null,null,null,{"$f":"IF(M27=\"\",\"\",IF(M27=\"v\",N27,N29))","v":"75-2-SPFP"},{"$f":"IF(M27=\"\",\"\",IF(M27=\"v\",O27,O29))","v":"IFATUROTI"},null,null,null,null,null,null,null,null,null,null,null,{"$f":"IF(W27=\"\",\"\",IF(W27=\"v\",U27,U29))","v":"LERICHE"},{"$f":"IF(W27=\"\",\"\",IF(W27=\"v\",V27,V29))","v":"75-4-STAP"},"V"]
[null,null,null,null,null,null,null,null,null,null,null,null,"P",{"$f":"IF(T29=\"\",\"\",IF(T29=\"p\",S29,S30))","v":0},{"$f":"IF(T29=\"\",\"\",IF(T29=\"p\",R29,R30))","v":0},null,"4ème poule 21",{"$f":"'Résultats de poule'!B10","v":0},{"$f":"'Résultats de poule'!D10","v":0},"P",{"$f":"IF(T29=\"\",\"\",IF(T29=\"v\",R29,R30))","v":"LERICHE"},{"$f":"IF(T29=\"\",\"\",IF(T29=\"v\",S29,S30))","v":"75-4-STAP"},"V"]
[null,null,null,null,null,null,null,null,null,null,null,null,null,null,null,null,"1er poule 20",{"$f":"'Résultats de poule'!N2","v":"LERICHE"},{"$f":"'Résultats de poule'!P2","v":"75-4-STAP"},"V"]
[null,"17ème",null,null,null,null,null,null,null,null,null,null,null,null,null,null,null,null,null,null,null,null,null,null,null,null,null,null,null,null,null,null,"VAINQUEUR"]
[null,{"$f":"IF(D16=\"\",\"\",IF(D16=\"v\",E16,E48))","v":""},{"$f":"IF(D16=\"\",\"\",IF(D16=\"v\",F16,F48))","v":""},null,null,null,null,null,null,null,null,null,null,null,null,null,null,null,null,null,null,null,null,null,null,null,null,null,null,"FINALE",null,null,{"$f":"IF(AF17=\"\",\"\",IF(AF17=\"v\",AD17,AD49))","v":"LERICHE"},{"$f":"IF(AF17=\"\",\"\",IF(AF17=\"v\",AE17,AE49))","v":"75-4-STAP"}]
[]
[]
[]
[null,null,null,null,null,null,null,null,null,null,null,null,null,null,null,null,"1er poule 19",{"$f":"'Résultats de poule'!J2","v":"GILLIS--JOLIVET"},{"$f":"'Résultats de poule'!L2","v":"75-2-NDLP"},"V","1/8 de finale 5"]
[null,null,null,null,null,null,null,null,null,null,null,null,"V",{"$f":"IF(T36=\"\",\"\",IF(T36=\"p\",S36,S37))","v":0},{"$f":"IF(T36=\"\",\"\",IF(T36=\"p\",R36,R37))","v":0},null,"4ème poule 22",{"$f":"'Résultats de poule'!F10","v":0},{"$f":"'Résultats de poule'!H10","v":0},"P",{"$f":"IF(T36=\"\",\"\",IF(T36=\"v\",R36,R37))","v":"GILLIS--JOLIVET"},{"$f":"IF(T36=\"\",\"\",IF(T36=\"v\",S36,S37))","v":"75-2-NDLP"},"V"]
[null,null,null,null,null,null,null,null,null,"P",{"$f":"IF(M37=\"\",\"\",IF(M37=\"v\",N37,N39))","v":0},{"$f":"IF(M37=\"\",\"\",IF(M37=\"v\",O37,O39))","v":0},null,null,null,null,null,null,null,null,null,null,null,{"$f":"IF(W37=\"\",\"\",IF(W37=\"v\",U37,U39))","v":"GILLIS--JOLIVET"},{"$f":"IF(W37=\"\",\"\",IF(W37=\"v\",V37,V39))","v":"75-2-NDLP"},"V"]
[null,null,null,null,null,null,null,null,null,null,null,null,"P",{"$f":"IF(T39=\"\",\"\",IF(T39=\"p\",S39,S40))","v":0},{"$f":"IF(T39=\"\",\"\",IF(T39=\"p\",R39,R40))","v":0},null,"3ème poule 17",{"$f":"'Résultats de poule'!B4","v":0},{"$f":"'Résultats de poule'!D4","v":0},"P",{"$f":"IF(T39=\"\",\"\",IF(T39=\"v\",R39,R40))","v":"CLEMOT"},{"$f":"IF(T39=\"\",\"\",IF(T39=\"v\",S39,S40))","v":"75-2-SLHP"},"P"]
[null,null,null,null,null,null,null,null,null,null,null,null,null,null,null,null,"2ème poule 24",{"$f":"'Résultats de poule'!N8","v":"CLEMOT"},{"$f":"'Résultats de poule'!P8","v":"75-2-SLHP"},"V"]
[null,null,null,null,null,null,"P",{"$f":"IF(J38=\"\",\"\",IF(J38=\"v\",K38,K45))","v":0},{"$f":"IF(J38=\"\",\"\",IF(J38=\"v\",L38,L45))","v":0}]
[null,null,null,null,null,null,null,null,null,null,null,null,null,null,null,null,null,null,null,null,null,null,null,"1/4 finale 3",null,null,{"$f":"IF(Z38=\"\",\"\",IF(Z38=\"v\",X38,X45))","v":"GILLIS--JOLIVET"},{"$f":"IF(Z38=\"\",\"\",IF(Z38=\"v\",Y38,Y45))","v":"75-2-NDLP"},"P"]
[null,null,null,null,null,null,null,null,null,null,null,null,null,null,null,null,"2ème poule 18",{"$f":"'Résultats de poule'!F3","v":"GUILLEMETTE"},{"$f":"'Résultats de poule'!H3","v":"75-4-PCHP"},"V","1/8 de finale 6"]
[null,null,null,null,null,null,null,null,null,null,null,null,"V",{"$f":"IF(T43=\"\",\"\",IF(T43=\"p\",S43,S44))","v":0},{"$f":"IF(T43=\"\",\"\",IF(T43=\"p\",R43,R44))","v":0},null,"3ème poule 23",{"$f":"'Résultats de poule'!J9","v":0},{"$f":"'Résultats de poule'!L9","v":0},"P",{"$f":"IF(T43=\"\",\"\",IF(T43=\"v\",R43,R44))","v":"GUILLEMETTE"},{"$f":"IF(T43=\"\",\"\",IF(T43=\"v\",S43,S44))","v":"75-4-PCHP"},"P"]
[null,null,null,null,null,null,null,null,null,"V",{"$f":"IF(M44=\"\",\"\",IF(M44=\"v\",N44,N46))","v":0},{"$f":"IF(M44=\"\",\"\",IF(M44=\"v\",O44,O46))","v":0},null,null,null,null,null,null,null,null,null,null,null,{"$f":"IF(W44=\"\",\"\",IF(W44=\"v\",U44,U46))","v":"PETROFF"},{"$f":"IF(W44=\"\",\"\",IF(W44=\"v\",V44,V46))","v":"75-4-BLOP"},"P"]
[null,null,null,null,null,null,null,null,null,null,null,null,"P",{"$f":"IF(T46=\"\",\"\",IF(T46=\"p\",S46,S47))","v":0},{"$f":"IF(T46=\"\",\"\",IF(T46=\"p\",R46,R47))","v":0},null,"4ème poule 20",{"$f":"'Résultats de poule'!N5","v":0},{"$f":"'Résultats de poule'!P5","v":0},"P",{"$f":"IF(T46=\"\",\"\",IF(T46=\"v\",R46,R47))","v":"PETROFF"},{"$f":"IF(T46=\"\",\"\",IF(T46=\"v\",S46,S47))","v":"75-4-BLOP"},"V"]
[null,null,null,null,null,null,null,null,null,null,null,null,null,null,null,null,"1er poule 21",{"$f":"'Résultats de poule'!B7","v":"PETROFF"},{"$f":"'Résultats de poule'!D7","v":"75-4-BLOP"},"V"]
[null,null,null,null,{"$f":"IF(G41=\"\",\"\",IF(G41=\"v\",H41,H56))","v":"75-4-PCHP"},{"$f":"IF(G41=\"\",\"\",IF(G41=\"v\",I41,I56))","v":"TURION"}]
[null,null,null,null,null,null,null,null,null,null,null,null,null,null,null,null,null,null,null,null,null,null,null,null,null,null,"1/2 finale B",null,null,{"$f":"IF(AC42=\"\",\"\",IF(AC42=\"v\",AA42,AA56))","v":"RODIER"},{"$f":"IF(AC42=\"\",\"\",IF(AC42=\"v\",AB42,AB56))","v":"75-4-LMAP"},"P"]
[]
[null,null,null,null,null,null,null,null,null,null,null,null,null,null,null,null,"1er poule 24",{"$f":"'Résultats de poule'!N7","v":"MICOLLIER"},{"$f":"'Résultats de poule'!P7","v":"75-4-BLOP"},"V","1/8 de finale 7"]
[null,null,null,null,null,null,null,null,null,null,null,null,"P",{"$f":"IF(T51=\"\",\"\",IF(T51=\"p\",S51,S52))","v":0},{"$f":"IF(T51=\"\",\"\",IF(T51=\"p\",R51,R52))","v":0},null,"4ème poule 17",{"$f":"'Résultats de poule'!B5","v":0},{"$f":"'Résultats de poule'!D5","v":0},"P",{"$f":"IF(T51=\"\",\"\",IF(T51=\"v\",R51,R52))","v":"MICOLLIER"},{"$f":"IF(T51=\"\",\"\",IF(T51=\"v\",S51,S52))","v":"75-4-BLOP"},"V"]
[null,null,null,null,null,null,null,null,null,"V",{"$f":"IF(M52=\"\",\"\",IF(M52=\"v\",N52,N54))","v":"75-4-PCHP"},{"$f":"IF(M52=\"\",\"\",IF(M52=\"v\",O52,O54))","v":"TURION"},null,null,null,null,null,null,null,null,null,null,null,{"$f":"IF(W52=\"\",\"\",IF(W52=\"v\",U52,U54))","v":"MICOLLIER"},{"$f":"IF(W52=\"\",\"\",IF(W52=\"v\",V52,V54))","v":"75-4-BLOP"},"P"]
[null,null,null,null,null,null,null,null,null,null,null,null,"V",{"$f":"IF(T54=\"\",\"\",IF(T54=\"p\",S54,S55))","v":"75-4-PCHP"},{"$f":"IF(T54=\"\",\"\",IF(T54=\"p\",R54,R55))","v":"TURION"},null,"3ème poule 22",{"$f":"'Résultats de poule'!F9","v":"TURION"},{"$f":"'Résultats de poule'!H9","v":"75-4-PCHP"},"P",{"$f":"IF(T54=\"\",\"\",IF(T54=\"v\",R54,R55))","v":"BRICOGNE"},{"$f":"IF(T54=\"\",\"\",IF(T54=\"v\",S54,S55))","v":"75-4-FENP"},"P"]
[null,null,null,null,null,null,null,null,null,null,null,null,null,null,null,null,"2ème poule 19",{"$f":"'Résultats de poule'!J3","v":"BRICOGNE"},{"$f":"'Résultats de poule'!L3","v":"75-4-FENP"},"V"]
[null,null,null,null,null,null,"V",{"$f":"IF(J53=\"\",\"\",IF(J53=\"v\",K53,K60))","v":"75-4-PCHP"},{"$f":"IF(J53=\"\",\"\",IF(J53=\"v\",L53,L60))","v":"TURION"},null,null,null,null,null,null,null,null,null,null,null,null,null,null,"1/4 finale 4",null,null,{"$f":"IF(Z53=\"\",\"\",IF(Z53=\"v\",X53,X60))","v":"RODIER"},{"$f":"IF(Z53=\"\",\"\",IF(Z53=\"v\",Y53,Y60))","v":"75-4-LMAP"},"V"]
[]
[null,null,null,null,null,null,null,null,null,null,null,null,null,null,null,null,"2ème poule 21",{"$f":"'Résultats de poule'!B8","v":"CHOTARD"},{"$f":"'Résultats de poule'!D8","v":"75-4-LMAP"},"V","1/8 de finale 8"]
[null,null,null,null,null,null,null,null,null,null,null,null,"V",{"$f":"IF(T58=\"\",\"\",IF(T58=\"p\",S58,S59))","v":0},{"$f":"IF(T58=\"\",\"\",IF(T58=\"p\",R58,R59))","v":0},null,"3ème poule 20",{"$f":"'Résultats de poule'!N4","v":0},{"$f":"'Résultats de poule'!P4","v":0},"P",{"$f":"IF(T58=\"\",\"\",IF(T58=\"v\",R58,R59))","v":"CHOTARD"},{"$f":"IF(T58=\"\",\"\",IF(T58=\"v\",S58,S59))","v":"75-4-LMAP"},"P"]
[null,"19ème",null,null,{"$f":"IF(G9=\"\",\"\",IF(G9=\"p\",H9,H24))","v":""},{"$f":"IF(G9=\"\",\"\",IF(G9=\"p\",I9,I24))","v":""},null,null,null,"P",{"$f":"IF(M59=\"\",\"\",IF(M59=\"v\",N59,N61))","v":0},{"$f":"IF(M59=\"\",\"\",IF(M59=\"v\",O59,O61))","v":0},null,null,null,null,null,null,null,null,null,null,null,{"$f":"IF(W59=\"\",\"\",IF(W59=\"v\",U59,U61))","v":"RODIER"},{"$f":"IF(W59=\"\",\"\",IF(W59=\"v\",V59,V61))","v":"75-4-LMAP"},"V",null,null,null,"Place de 3ème/4ème"]
[null,{"$f":"IF(D60=\"\",\"\",IF(D60=\"v\",E60,E62))","v":""},{"$f":"IF(D60=\"\",\"\",IF(D60=\"v\",F60,F62))","v":""},null,null,null,null,null,null,null,null,null,"P",{"$f":"IF(T61=\"\",\"\",IF(T61=\"p\",S61,S62))","v":0},{"$f":"IF(T61=\"\",\"\",IF(T61=\"p\",R61,R62))","v":0},null,"4ème poule 23",{"$f":"'Résultats de poule'!J10","v":0},{"$f":"'Résultats de poule'!L10","v":0},"P",{"$f":"IF(T61=\"\",\"\",IF(T61=\"v\",R61,R62))","v":"RODIER"},{"$f":"IF(T61=\"\",\"\",IF(T61=\"v\",S61,S62))","v":"75-4-LMAP"},"V",null,null,null,null,null,null,{"$f":"IF(AC10=\"\",\"\",IF(AC10=\"p\",AA10,AA24))","v":"PINCEMIN"},{"$f":"IF(AC10=\"\",\"\",IF(AC10=\"p\",AB10,AB24))","v":"75-4-FENP"},"V"]
[null,null,null,null,{"$f":"IF(G41=\"\",\"\",IF(G41=\"p\",H41,H56))","v":0},{"$f":"IF(G41=\"\",\"\",IF(G41=\"p\",I41,I56))","v":0},null,null,null,null,null,null,null,null,null,null,"1er poule 18",{"$f":"'Résultats de poule'!F2","v":"RODIER"},{"$f":"'Résultats de poule'!H2","v":"75-4-LMAP"},"V",null,null,null,null,null,null,null,null,null,null,null,null,{"$f":"IF(AF61=\"\",\"\",IF(AF61=\"v\",AD61,AD63))","v":"PINCEMIN"},{"$f":"IF(AF61=\"\",\"\",IF(AF61=\"v\",AE61,AE63))","v":"75-4-FENP"}]
[null,null,null,null,null,null,null,null,null,null,null,null,null,null,null,null,null,null,null,null,null,null,null,null,null,null,null,null,null,{"$f":"IF(AC42=\"\",\"\",IF(AC42=\"p\",AA42,AA56))","v":"GILLIS--JOLIVET"},{"$f":"IF(AC42=\"\",\"\",IF(AC42=\"p\",AB42,AB56))","v":"75-2-NDLP"},"P"]
[]
[null,null,null,null,null,null,null,null,null,null,null,null,null,{"$f":"IF(M5=\"\",\"\",IF(M5=\"p\",N5,N7))","v":0},{"$f":"IF(M5=\"\",\"\",IF(M5=\"p\",O5,O7))","v":0},null,null,{"$f":"IF(W5=\"\",\"\",IF(W5=\"p\",U5,U7))","v":"LE ROY"},{"$f":"IF(W5=\"\",\"\",IF(W5=\"p\",V5,V7))","v":"75-4-LMAP"},"P"]
[null,null,null,null,null,null,null,null,null,null,{"$f":"IF(M65=\"\",\"\",IF(M65=\"v\",N65,N66))","v":""},{"$f":"IF(M65=\"\",\"\",IF(M65=\"v\",O65,O66))","v":""},null,{"$f":"IF(M12=\"\",\"\",IF(M12=\"p\",N12,N14))","v":0},{"$f":"IF(M12=\"\",\"\",IF(M12=\"p\",O12,O14))","v":0},null,null,{"$f":"IF(W12=\"\",\"\",IF(W12=\"p\",U12,U14))","v":"LIN"},{"$f":"IF(W12=\"\",\"\",IF(W12=\"p\",V12,V14))","v":"75-2-SLHP"},"V",{"$f":"IF(T65=\"\",\"\",IF(T65=\"v\",R65,R66))","v":"LIN"},{"$f":"IF(T65=\"\",\"\",IF(T65=\"v\",S65,S66))","v":"75-2-SLHP"},"V"]
[null,null,null,null,null,null,null,{"$f":"IF(J66=\"\",\"\",IF(J66=\"v\",K66,K68))","v":""},{"$f":"IF(J66=\"\",\"\",IF(J66=\"v\",L66,L68))","v":""},null,null,null,null,null,null,null,null,null,null,null,null,null,null,{"$f":"IF(W66=\"\",\"\",IF(W66=\"v\",U66,U68))","v":"LIN"},{"$f":"IF(W66=\"\",\"\",IF(W66=\"v\",V66,V68))","v":"75-2-SLHP"},"V"]
[null,null,null,null,null,null,null,null,null,null,{"$f":"IF(M68=\"\",\"\",IF(M68=\"v\",N68,N69))","v":""},{"$f":"IF(M68=\"\",\"\",IF(M68=\"v\",O68,O69))","v":""},null,{"$f":"IF(M20=\"\",\"\",IF(M20=\"p\",N20,N22))","v":0},{"$f":"IF(M20=\"\",\"\",IF(M20=\"p\",O20,O22))","v":0},null,null,{"$f":"IF(W20=\"\",\"\",IF(W20=\"p\",U20,U22))","v":"REMONDELLI"},{"$f":"IF(W20=\"\",\"\",IF(W20=\"p\",V20,V22))","v":"75-2-SPFP"},"P",{"$f":"IF(T68=\"\",\"\",IF(T68=\"v\",R68,R69))","v":"BAUD"},{"$f":"IF(T68=\"\",\"\",IF(T68=\"v\",S68,S69))","v":"75-2-SUPA"},"P"]
[null,null,null,null,"25ème",null,null,null,null,null,null,null,null,{"$f":"IF(M27=\"\",\"\",IF(M27=\"p\",N27,N29))","v":0},{"$f":"IF(M27=\"\",\"\",IF(M27=\"p\",O27,O29))","v":0},null,null,{"$f":"IF(W27=\"\",\"\",IF(W27=\"p\",U27,U29))","v":"BAUD"},{"$f":"IF(W27=\"\",\"\",IF(W27=\"p\",V27,V29))","v":"75-2-SUPA"},"V",null,null,null,null,null,null,null,"9ème"]
[null,null,null,null,{"$f":"IF(G67=\"\",\"\",IF(G67=\"v\",H67,H73))","v":""},{"$f":"IF(G67=\"\",\"\",IF(G67=\"v\",I67,I73))","v":""},null,null,null,null,null,null,null,null,null,null,null,null,null,null,null,null,null,null,null,null,{"$f":"IF(Z67=\"\",\"\",IF(Z67=\"v\",X67,X73))","v":"LIN"},{"$f":"IF(Z67=\"\",\"\",IF(Z67=\"v\",Y67,Y73))","v":"75-2-SLHP"}]
[null,null,null,null,null,null,null,null,null,null,null,null,null,{"$f":"IF(M37=\"\",\"\",IF(M37=\"p\",N37,N39))","v":0},{"$f":"IF(M37=\"\",\"\",IF(M37=\"p\",O37,O39))","v":0},null,null,{"$f":"IF(W37=\"\",\"\",IF(W37=\"p\",U37,U39))","v":"CLEMOT"},{"$f":"IF(W37=\"\",\"\",IF(W37=\"p\",V37,V39))","v":"75-2-SLHP"},"V"]
[null,null,null,null,null,null,null,null,null,null,{"$f":"IF(M71=\"\",\"\",IF(M71=\"v\",N71,N72))","v":""},{"$f":"IF(M71=\"\",\"\",IF(M71=\"v\",O71,O72))","v":""},null,{"$f":"IF(M44=\"\",\"\",IF(M44=\"p\",N44,N46))","v":0},{"$f":"IF(M44=\"\",\"\",IF(M44=\"p\",O44,O46))","v":0},null,null,{"$f":"IF(W44=\"\",\"\",IF(W44=\"p\",U44,U46))","v":"GUILLEMETTE"},{"$f":"IF(W44=\"\",\"\",IF(W44=\"p\",V44,V46))","v":"75-4-PCHP"},"P",{"$f":"IF(T71=\"\",\"\",IF(T71=\"v\",R71,R72))","v":"CLEMOT"},{"$f":"IF(T71=\"\",\"\",IF(T71=\"v\",S71,S72))","v":"75-2-SLHP"},"V"]
[null,null,null,null,null,null,null,{"$f":"IF(J72=\"\",\"\",IF(J72=\"v\",K72,K74))","v":""},{"$f":"IF(J72=\"\",\"\",IF(J72=\"v\",L72,L74))","v":""},null,null,null,null,null,null,null,null,null,null,null,null,null,null,{"$f":"IF(W72=\"\",\"\",IF(W72=\"v\",U72,U74))","v":"CLEMOT"},{"$f":"IF(W72=\"\",\"\",IF(W72=\"v\",V72,V74))","v":"75-2-SLHP"},"P"]
[null,null,null,null,null,null,null,null,null,null,{"$f":"IF(M74=\"\",\"\",IF(M74=\"v\",N74,N75))","v":""},{"$f":"IF(M74=\"\",\"\",IF(M74=\"v\",O74,O75))","v":""},null,{"$f":"IF(M52=\"\",\"\",IF(M52=\"p\",N52,N54))","v":0},{"$f":"IF(M52=\"\",\"\",IF(M52=\"p\",O52,O54))","v":0},null,null,{"$f":"IF(W52=\"\",\"\",IF(W52=\"p\",U52,U54))","v":"BRICOGNE"},{"$f":"IF(W52=\"\",\"\",IF(W52=\"p\",V52,V54))","v":"75-4-FENP"},"P",{"$f":"IF(T74=\"\",\"\",IF(T74=\"v\",R74,R75))","v":"CHOTARD"},{"$f":"IF(T74=\"\",\"\",IF(T74=\"v\",S74,S75))","v":"75-4-LMAP"},"P"]
[null,null,null,null,null,null,null,null,null,null,null,null,null,{"$f":"IF(M59=\"\",\"\",IF(M59=\"p\",N59,N61))","v":0},{"$f":"IF(M59=\"\",\"\",IF(M59=\"p\",O59,O61))","v":0},null,null,{"$f":"IF(W59=\"\",\"\",IF(W59=\"p\",U59,U61))","v":"CHOTARD"},{"$f":"IF(W59=\"\",\"\",IF(W59=\"p\",V59,V61))","v":"75-4-LMAP"},"V",null,null,null,null,null,null,{"$f":"IF(Z6=\"\",\"\",IF(Z6=\"p\",X6,X13))","v":"DE PREVAL"},{"$f":"IF(Z6=\"\",\"\",IF(Z6=\"p\",Y6,Y13))","v":"75-4-LMAP"},"P"]
[null,null,null,null,null,null,null,null,null,null,null,null,null,null,null,null,null,null,null,null,null,null,null,null,null,null,null,null,null,{"$f":"IF(AC75=\"\",\"\",IF(AC75=\"v\",AA75,AA77))","v":"PLISSON"},{"$f":"IF(AC75=\"\",\"\",IF(AC75=\"v\",AB75,AB77))","v":"75-4-STAP"},"V"]
[null,null,null,null,null,null,null,null,null,null,null,null,null,{"$f":"IF(M65=\"\",\"\",IF(M65=\"p\",N65,N66))","v":""},{"$f":"IF(M65=\"\",\"\",IF(M65=\"p\",O65,O66))","v":""},null,null,{"$f":"IF(T65=\"\",\"\",IF(T65=\"p\",R65,R66))","v":"LE ROY"},{"$f":"IF(T65=\"\",\"\",IF(T65=\"p\",S65,S66))","v":"75-4-LMAP"},null,null,null,null,null,null,null,{"$f":"IF(Z21=\"\",\"\",IF(Z21=\"p\",X21,X28))","v":"PLISSON"},{"$f":"IF(Z21=\"\",\"\",IF(Z21=\"p\",Y21,Y28))","v":"75-4-STAP"},"V"]
[null,null,null,null,null,null,null,"29ème",null,null,{"$f":"IF(M77=\"\",\"\",IF(M77=\"v\",N77,N78))","v":""},{"$f":"IF(M77=\"\",\"\",IF(M77=\"v\",O77,O78))","v":""},null,{"$f":"IF(M68=\"\",\"\",IF(M68=\"p\",N68,N69))","v":""},{"$f":"IF(M68=\"\",\"\",IF(M68=\"p\",O68,O69))","v":""},null,null,{"$f":"IF(T68=\"\",\"\",IF(T68=\"p\",R68,R69))","v":"REMONDELLI"},{"$f":"IF(T68=\"\",\"\",IF(T68=\"p\",S68,S69))","v":"75-2-SPFP"},null,{"$f":"IF(T77=\"\",\"\",IF(T77=\"v\",R77,R78))","v":""},{"$f":"IF(T77=\"\",\"\",IF(T77=\"v\",S77,S78))","v":""},null,null,"13ème",null,null,null,null,null,null,null,null,"5ème"]
[null,null,null,null,null,null,null,{"$f":"IF(J78=\"\",\"\",IF(J78=\"v\",K78,K80))","v":""},{"$f":"IF(J78=\"\",\"\",IF(J78=\"v\",L78,L80))","v":""},null,null,null,null,null,null,null,null,null,null,null,null,null,null,{"$f":"IF(W78=\"\",\"\",IF(W78=\"v\",U78,U80))","v":""},{"$f":"IF(W78=\"\",\"\",IF(W78=\"v\",V78,V80))","v":""},null,null,null,null,null,null,null,{"$f":"IF(AF76=\"\",\"\",IF(AF76=\"v\",AD76,AD82))","v":"PLISSON"},{"$f":"IF(AF76=\"\",\"\",IF(AF76=\"v\",AE76,AE82))","v":"75-4-STAP"}]
[null,null,null,null,null,null,null,null,null,null,{"$f":"IF(M80=\"\",\"\",IF(M80=\"v\",N80,N81))","v":""},{"$f":"IF(M80=\"\",\"\",IF(M80=\"v\",O80,O81))","v":""},null,{"$f":"IF(M71=\"\",\"\",IF(M71=\"p\",N71,N72))","v":""},{"$f":"IF(M71=\"\",\"\",IF(M71=\"p\",O71,O72))","v":""},null,null,{"$f":"IF(T71=\"\",\"\",IF(T71=\"p\",R71,R72))","v":"GUILLEMETTE"},{"$f":"IF(T71=\"\",\"\",IF(T71=\"p\",S71,S72))","v":"75-4-PCHP"},null,{"$f":"IF(T80=\"\",\"\",IF(T80=\"v\",R80,R81))","v":""},{"$f":"IF(T80=\"\",\"\",IF(T80=\"v\",S80,S81))","v":""}]
[null,null,null,null,null,null,null,null,null,null,null,null,null,{"$f":"IF(M74=\"\",\"\",IF(M74=\"p\",N74,N75))","v":""},{"$f":"IF(M74=\"\",\"\",IF(M74=\"p\",O74,O75))","v":""},null,null,{"$f":"IF(T74=\"\",\"\",IF(T74=\"p\",R74,R75))","v":"BRICOGNE"},{"$f":"IF(T74=\"\",\"\",IF(T74=\"p\",S74,S75))","v":"75-4-FENP"},null,null,null,null,null,null,null,{"$f":"IF(Z38=\"\",\"\",IF(Z38=\"p\",X38,X45))","v":"PETROFF"},{"$f":"IF(Z38=\"\",\"\",IF(Z38=\"p\",Y38,Y45))","v":"75-4-BLOP"},"V"]
[null,null,null,null,null,null,null,null,null,null,"27ème",null,null,null,null,null,null,null,null,null,null,"11ème",null,null,null,null,null,null,null,{"$f":"IF(AC81=\"\",\"\",IF(AC81=\"v\",AA81,AA83))","v":"PETROFF"},{"$f":"IF(AC81=\"\",\"\",IF(AC81=\"v\",AB81,AB83))","v":"75-4-BLOP"},"P"]
[null,null,null,null,null,null,null,null,null,null,{"$f":"IF(M83=\"\",\"\",IF(M83=\"v\",N83,N84))","v":""},{"$f":"IF(M83=\"\",\"\",IF(M83=\"v\",O83,O84))","v":""},null,{"$f":"IF(J66=\"\",\"\",IF(J66=\"p\",K66,K68))","v":""},{"$f":"IF(J66=\"\",\"\",IF(J66=\"p\",L66,L68))","v":""},null,null,{"$f":"IF(W66=\"\",\"\",IF(W66=\"p\",U66,U68))","v":"BAUD"},{"$f":"IF(W66=\"\",\"\",IF(W66=\"p\",V66,V68))","v":"75-2-SUPA"},null,{"$f":"IF(T83=\"\",\"\",IF(T83=\"v\",R83,R84))","v":""},{"$f":"IF(T83=\"\",\"\",IF(T83=\"v\",S83,S84))","v":""},null,null,null,null,{"$f":"IF(Z53=\"\",\"\",IF(Z53=\"p\",X53,X60))","v":"MICOLLIER"},{"$f":"IF(Z53=\"\",\"\",IF(Z53=\"p\",Y53,Y60))","v":"75-4-BLOP"},"P"]
[null,null,null,null,null,null,null,null,null,null,null,null,null,{"$f":"IF(J72=\"\",\"\",IF(J72=\"p\",K72,K74))","v":""},{"$f":"IF(J72=\"\",\"\",IF(J72=\"p\",L72,L74))","v":""},null,null,{"$f":"IF(W72=\"\",\"\",IF(W72=\"p\",U72,U74))","v":"CHOTARD"},{"$f":"IF(W72=\"\",\"\",IF(W72=\"p\",V72,V74))","v":"75-4-LMAP"}]
[null,null,null,null,null,null,null,{"$f":"IF(J6=\"\",\"\",IF(J6=\"p\",K6,K13))","v":""},{"$f":"IF(J6=\"\",\"\",IF(J6=\"p\",L6,L13))","v":""},null,null,null,null,null,null,null,null,null,null,null,null,null,null,null,null,null,{"$f":"IF(AC75=\"\",\"\",IF(AC75=\"p\",AA75,AA77))","v":"DE PREVAL"},{"$f":"IF(AC75=\"\",\"\",IF(AC75=\"p\",AB75,AB77))","v":"75-4-LMAP"},"P",null,"7ème"]
[null,"21ème",null,null,{"$f":"IF(G85=\"\",\"\",IF(G85=\"v\",H85,H86))","v":""},{"$f":"IF(G85=\"\",\"\",IF(G85=\"v\",I85,I86))","v":""},null,{"$f":"IF(J21=\"\",\"\",IF(J21=\"p\",K21,K28))","v":""},{"$f":"IF(J21=\"\",\"\",IF(J21=\"p\",L21,L28))","v":""},null,"31ème",null,null,null,null,null,null,null,null,null,null,"15ème",null,null,null,null,null,null,null,{"$f":"IF(AC85=\"\",\"\",IF(AC85=\"v\",AA85,AA87))","v":"MICOLLIER"},{"$f":"IF(AC85=\"\",\"\",IF(AC85=\"v\",AB85,AB87))","v":"75-4-BLOP"}]
[null,{"$f":"IF(D86=\"\",\"\",IF(D86=\"v\",E86,E88))","v":""},{"$f":"IF(D86=\"\",\"\",IF(D86=\"v\",F86,F88))","v":""},null,null,null,null,null,null,null,{"$f":"IF(M87=\"\",\"\",IF(M87=\"v\",N87,N88))","v":""},{"$f":"IF(M87=\"\",\"\",IF(M87=\"v\",O87,O88))","v":""},null,{"$f":"IF(M77=\"\",\"\",IF(M77=\"p\",N77,N78))","v":""},{"$f":"IF(M77=\"\",\"\",IF(M77=\"p\",O77,O78))","v":""},null,null,{"$f":"IF(T77=\"\",\"\",IF(T77=\"p\",R77,R78))","v":""},{"$f":"IF(T77=\"\",\"\",IF(T77=\"p\",S77,S78))","v":""},null,{"$f":"IF(T87=\"\",\"\",IF(T87=\"v\",R87,R88))","v":""},{"$f":"IF(T87=\"\",\"\",IF(T87=\"v\",S87,S88))","v":""},null,null,null,null,{"$f":"IF(AC81=\"\",\"\",IF(AC81=\"p\",AA81,AA83))","v":"MICOLLIER"},{"$f":"IF(AC81=\"\",\"\",IF(AC81=\"p\",AB81,AB83))","v":"75-4-BLOP"},"V"]
[null,null,null,null,{"$f":"IF(G88=\"\",\"\",IF(G88=\"v\",H88,H89))","v":""},{"$f":"IF(G88=\"\",\"\",IF(G88=\"v\",I88,I89))","v":""},null,{"$f":"IF(J38=\"\",\"\",IF(J38=\"p\",K38,K45))","v":0},{"$f":"IF(J38=\"\",\"\",IF(J38=\"p\",L38,L45))","v":0},null,null,null,null,{"$f":"IF(M80=\"\",\"\",IF(M80=\"p\",N80,N81))","v":""},{"$f":"IF(M80=\"\",\"\",IF(M80=\"p\",O80,O81))","v":""},null,null,{"$f":"IF(T80=\"\",\"\",IF(T80=\"p\",R80,R81))","v":""},{"$f":"IF(T80=\"\",\"\",IF(T80=\"p\",S80,S81))","v":""}]
[null,null,null,null,null,null,null,{"$f":"IF(J53=\"\",\"\",IF(J53=\"p\",K53,K60))","v":0},{"$f":"IF(J53=\"\",\"\",IF(J53=\"p\",L53,L60))","v":0}]
[null,"23ème"]
[null,{"$f":"IF(D91=\"\",\"\",IF(D91=\"v\",E91,E92))","v":""},{"$f":"IF(D91=\"\",\"\",IF(D91=\"v\",F91,F92))","v":""},null,{"$f":"IF(G85=\"\",\"\",IF(G85=\"p\",H85,H86))","v":""},{"$f":"IF(G85=\"\",\"\",IF(G85=\"p\",I85,I86))","v":""}]
[null,null,null,null,{"$f":"IF(G88=\"\",\"\",IF(G88=\"p\",H88,H89))","v":""},{"$f":"IF(G88=\"\",\"\",IF(G88=\"p\",I88,I89))","v":""}]

{"sheet":"Classement","index":11,"n_rows":35,"n_cols":3,"rows_kept":35,"cut":false,"hidden":false,"merged":[[1,0,1,2],[0,0,0,2]]}
[{"$f":"IF(Engagés!A1=\"\",\"\",Engagés!A1)","v":"Qualifications championnat Comité de Paris "}]
[{"$f":"IF(Engagés!E3=\"\",\"\",Engagés!E3)","v":"MG Promo"}]
["CLASSEMENT","NOMS","Etablissement"]
["1er",{"$f":"Tableau!AG32","v":"LERICHE"},{"$f":"Tableau!AH32","v":"75-4-STAP"}]
["2ème",{"$f":"IF(Tableau!$AF$17=\"\",\"\",IF(Tableau!$AF$17=\"p\",Tableau!$AD$17,Tableau!$AD$49))","v":"RODIER"},{"$f":"IF(Tableau!$AF$17=\"\",\"\",IF(Tableau!$AF$17=\"p\",Tableau!$AE$17,Tableau!$AE$49))","v":"75-4-LMAP"}]
["3ème",{"$f":"Tableau!AG62","v":"PINCEMIN"},{"$f":"Tableau!AH62","v":"75-4-FENP"}]
["4ème",{"$f":"IF(Tableau!AF61=\"\",\"\",IF(Tableau!$AF$61=\"p\",Tableau!$AD$61,Tableau!$AD$63))","v":"GILLIS--JOLIVET"},{"$f":"IF(Tableau!AF61=\"\",\"\",IF(Tableau!$AF$61=\"p\",Tableau!$AE$61,Tableau!$AE$63))","v":"75-2-NDLP"}]
["5ème",{"$f":"Tableau!AG79","v":"PLISSON"},{"$f":"Tableau!AH79","v":"75-4-STAP"}]
["6ème",{"$f":"IF(Tableau!AF76=\"\",\"\",IF(Tableau!$AF$76=\"p\",Tableau!$AD$76,Tableau!$AD$82))","v":"PETROFF"},{"$f":"IF(Tableau!$AF$76=\"\",\"\",IF(Tableau!$AF$76=\"p\",Tableau!$AE$76,Tableau!$AE$82))","v":"75-4-BLOP"}]
["7ème",{"$f":"Tableau!AD86","v":"MICOLLIER"},{"$f":"Tableau!AE86","v":"75-4-BLOP"}]
["8ème",{"$f":"IF(Tableau!$AC$85=\"\",\"\",IF(Tableau!$AC$85=\"p\",Tableau!$AA$85,Tableau!$AA$87))","v":"DE PREVAL"},{"$f":"IF(Tableau!$AC$85=\"\",\"\",IF(Tableau!$AC$85=\"p\",Tableau!$AB$85,Tableau!$AB$87))","v":"75-4-LMAP"}]
["9ème",{"$f":"Tableau!AA70","v":"LIN"},{"$f":"Tableau!Y73","v":"75-2-SLHP"}]
["10ème",{"$f":"IF(Tableau!$Z$67=\"\",\"\",IF(Tableau!$Z$67=\"p\",Tableau!$X$67,Tableau!$X$73))","v":"CLEMOT"},{"$f":"IF(Tableau!$Z$67=\"\",\"\",IF(Tableau!$Z$67=\"p\",Tableau!$Y$67,Tableau!$Y$73))","v":"75-2-SLHP"}]
["11ème",{"$f":"Tableau!U83","v":""},{"$f":"Tableau!V83","v":""}]
["12ème",{"$f":"IF(Tableau!$T$83=\"\",\"\",IF(Tableau!$T$83=\"p\",Tableau!$R$83,Tableau!$R$84))","v":""},{"$f":"IF(Tableau!$T$83=\"\",\"\",IF(Tableau!$T$83=\"p\",Tableau!$S$83,Tableau!$S$84))","v":""}]
["13ème",{"$f":"Tableau!X79","v":""},{"$f":"Tableau!Y79","v":""}]
["14ème",{"$f":"IF(Tableau!$W$78=\"\",\"\",IF(Tableau!$W$78=\"p\",Tableau!$U$78,Tableau!$U$80))","v":""},{"$f":"IF(Tableau!$W$78=\"\",\"\",IF(Tableau!$W$78=\"p\",Tableau!$V$78,Tableau!$V$80))","v":""}]
["15ème",{"$f":"Tableau!U87","v":""},{"$f":"Tableau!V87","v":""}]
["16ème",{"$f":"IF(Tableau!$T$87=\"\",\"\",IF(Tableau!$T$87=\"p\",Tableau!$R$87,Tableau!$R$88))","v":""},{"$f":"IF(Tableau!$T$87=\"\",\"\",IF(Tableau!$T$87=\"p\",Tableau!$S$87,Tableau!$S$88))","v":""}]
["17ème",{"$f":"Tableau!C32","v":""},{"$f":"Tableau!B32","v":""}]
["18ème",{"$f":"IF(Tableau!$D$16=\"\",\"\",IF(Tableau!$D$16=\"p\",Tableau!$F$60,Tableau!$F$48))","v":""},{"$f":"IF(Tableau!$D$16=\"\",\"\",IF(Tableau!$D$16=\"p\",Tableau!$E$16,Tableau!$E$48))","v":""}]
["19ème",{"$f":"Tableau!C61","v":""},{"$f":"Tableau!B61","v":""}]
["20ème",{"$f":"IF(Tableau!D60=\"\",\"\",IF(Tableau!$D$60=\"p\",Tableau!$F$60,Tableau!$F$62))","v":""},{"$f":"IF(Tableau!D60=\"\",\"\",IF(Tableau!$D$60=\"p\",Tableau!$E$60,Tableau!$E$62))","v":""}]
["21ème",{"$f":"Tableau!C87","v":""},{"$f":"Tableau!B87","v":""}]
["22ème",{"$f":"IF(Tableau!$D$86=\"\",\"\",IF(Tableau!$D$86=\"p\",Tableau!$F$86,Tableau!$F$88))","v":""},{"$f":"IF(Tableau!$D$86=\"\",\"\",IF(Tableau!$D$86=\"p\",Tableau!$E$86,Tableau!$E$88))","v":""}]
["23ème",{"$f":"Tableau!C91","v":""},{"$f":"Tableau!B91","v":""}]
["24ème",{"$f":"IF(Tableau!$D$91=\"\",\"\",IF(Tableau!$D$91=\"p\",Tableau!$F$91,Tableau!$F$92))","v":""},{"$f":"IF(Tableau!$D$91=\"\",\"\",IF(Tableau!$D$91=\"p\",Tableau!$E$91,Tableau!$E$92))","v":""}]
["25ème",{"$f":"Tableau!F70","v":""},{"$f":"Tableau!E70","v":""}]
["26ème",{"$f":"IF(Tableau!$G$67=\"\",\"\",IF(Tableau!$G$67=\"p\",Tableau!$I$67,Tableau!$I$73))","v":""},{"$f":"IF(Tableau!$G$67=\"\",\"\",IF(Tableau!$G$67=\"p\",Tableau!$H$73,Tableau!$H$67))","v":""}]
["27ème",{"$f":"Tableau!L83","v":""},{"$f":"Tableau!K83","v":""}]
["28ème",{"$f":"IF(Tableau!$M$83=\"\",\"\",IF(Tableau!$M$83=\"p\",Tableau!$O$83,Tableau!$O$84))","v":""},{"$f":"IF(Tableau!$M$83=\"\",\"\",IF(Tableau!$M$83=\"p\",Tableau!$N$83,Tableau!$N$84))","v":""}]
["29ème",{"$f":"Tableau!I79","v":""},{"$f":"Tableau!H79","v":""}]
["30ème",{"$f":"IF(Tableau!$J$78=\"\",\"\",IF(Tableau!$J$78=\"p\",Tableau!$L$78,Tableau!$L$80))","v":""},{"$f":"IF(Tableau!$J$78=\"\",\"\",IF(Tableau!$J$78=\"p\",Tableau!$K$78,Tableau!$K$80))","v":""}]
["31ème",{"$f":"Tableau!L87","v":""},{"$f":"Tableau!K87","v":""}]
["32ème",{"$f":"IF(Tableau!$M$87=\"\",\"\",IF(Tableau!$M$87=\"p\",Tableau!$O$87,Tableau!$O$88))","v":""},{"$f":"IF(Tableau!$M$87=\"\",\"\",IF(Tableau!$M$87=\"p\",Tableau!$N$87,Tableau!$N$88))","v":""}]