{"text_format":"1","workbook":"xlsx","n_sheets":12,"sheets":["Engagés","Poule 9","Poule 10","Poule 11","Poule 12","Poule 13","Poule 14","Poule 15","Poule 16","Résultats de poule","Tableau","Classement"],"not_rendered":{"charts":0,"images":81,"macros":1,"external_links":0,"defined_names":1,"comments":0,"pivot_tables":0},"unopened":[],"bounds":{"document_bytes":16777216,"sheet_cells":100000,"rows_first":2000,"rows_last":500,"rows_between":2000,"halvings":0,"cell_chars":16384,"cell_head_chars":4096},"cells_cut":0,"cells_raw":0,"read":"whole","date_system":"1900"}

{"sheet":"Engagés","index":0,"n_rows":37,"n_cols":14,"rows_kept":37,"cut":false,"hidden":false,"merged":[[17,6,17,9],[17,10,17,13],[23,6,23,9],[23,10,23,13],[0,0,2,1],[0,2,1,2],[5,10,5,13],[5,6,5,9],[11,6,11,9],[11,10,11,13]]}
["Qualifications championnat Comité de Paris ",null,"TENNIS DE TABLE","DATE :","13 dec"]
[null,null,null,"LIEU :","Stanislas"]
[null,null,"TABLEAU B","CATEGORIE :","MG Promo"]
["Tête de série","ETABLISSEMENT","NOM","PRENOM","SIGLE"]
[]
[1,null,"MORO","COME","75-4-STAP",null,"Poule 9",null,null,null,"Poule 10"]
[2,null,"CHABREL","HUGO","75-4-STAP",null,1,{"$f":"VLOOKUP($G7,$A$1:$E$37,3,FALSE)","v":"MORO"},{"$f":"VLOOKUP($G7,$A$1:$E$37,4,FALSE)","v":"COME"},{"$f":"VLOOKUP($G7,$A$1:$E$37,5,FALSE)","v":"75-4-STAP"},2,{"$f":"VLOOKUP($K7,$A$1:$E$37,3,FALSE)","v":"CHABREL"},{"$f":"VLOOKUP($K7,$A$1:$E$37,4,FALSE)","v":"HUGO"},{"$f":"VLOOKUP($K7,$A$1:$E$37,5,FALSE)","v":"75-4-STAP"}]
[3,null,"MOLIN","BAPTISTE","75-4-LMAP",null,16,{"$f":"VLOOKUP($G8,$A$1:$E$37,3,FALSE)","v":"BRETTES"},{"$f":"VLOOKUP($G8,$A$1:$E$37,4,FALSE)","v":"FERDINAND"},{"$f":"VLOOKUP($G8,$A$1:$E$37,5,FALSE)","v":"75-2-SPFP"},15,{"$f":"VLOOKUP($K8,$A$1:$E$37,3,FALSE)","v":"BEAU"},{"$f":"VLOOKUP($K8,$A$1:$E$37,4,FALSE)","v":"GUILHEM"},{"$f":"VLOOKUP($K8,$A$1:$E$37,5,FALSE)","v":"75-4-SMPP"}]
[4,null,"ROCHET","JEREMY","75-4-BLOP",null,17,{"$f":"VLOOKUP($G9,$A$1:$E$37,3,FALSE)","v":"LE POITTEVIN "},{"$f":"VLOOKUP($G9,$A$1:$E$37,4,FALSE)","v":"VADIM"},{"$f":"VLOOKUP($G9,$A$1:$E$37,5,FALSE)","v":"75-4-FENP"},18,{"$f":"VLOOKUP($K9,$A$1:$E$37,3,FALSE)","v":"MAZO KOENIG"},{"$f":"VLOOKUP($K9,$A$1:$E$37,4,FALSE)","v":"LEOPOLD"},{"$f":"VLOOKUP($K9,$A$1:$E$37,5,FALSE)","v":"75-4-PCHP"}]
[5,null,"FRANC","GASPARD","75-4-LMAP",null,32,{"$f":"VLOOKUP($G10,$A$1:$E$37,3,FALSE)","v":0},{"$f":"VLOOKUP($G10,$A$1:$E$37,4,FALSE)","v":0},{"$f":"VLOOKUP($G10,$A$1:$E$37,5,FALSE)","v":0},31,{"$f":"VLOOKUP($K10,$A$1:$E$37,3,FALSE)","v":0},{"$f":"VLOOKUP($K10,$A$1:$E$37,4,FALSE)","v":0},{"$f":"VLOOKUP($K10,$A$1:$E$37,5,FALSE)","v":0}]
{"$rows_left_out":28}
{"sheet":"Poule 9","index":1,"n_rows":24,"n_cols":7,"rows_kept":24,"cut":false,"hidden":false,"merged":[[0,0,0,2],[0,3,0,4],[22,0,22,1],[20,2,20,3],[23,4,23,5],[22,4,22,5],[13,0,13,6],[14,3,14,4],[23,2,23,3],[21,0,21,1],[23,0,23,1],[21,2,21,3],[19,4,19,5],[20,4,20,5],[7,0,7,6],[8,3,8,4],[8,0,8,2],[9,0,9,2],[10,0,10,2],[1,0,1,2],[1,3,1,6],[22,2,22,3],[20,0,20,1],[18,4,18,6],[11,0,11,2],[12,0,12,2],[14,0,14,2],[17,0,17,2],[18,0,18,3],[21,4,21,5],[19,0,19,1],[15,0,15,2],[16,0,16,2],[19,2,19,3]]}
[{"$f":"Engagés!C1","v":"TENNIS DE TABLE"},null,null,{"$f":"Engagés!C3","v":"TABLEAU B"}]
[{"$f":"Engagés!G6","v":"Poule 9"}]
[null,"NOM","Prénom","Sigle","Vict","Def","Classement"]
[1,{"$f":"VLOOKUP($A4,Engagés!$A$1:$E$379,3,FALSE)","v":"MORO"},{"$f":"VLOOKUP($A4,Engagés!$A$1:$E$379,4,FALSE)","v":"COME"},{"$f":"VLOOKUP($A4,Engagés!$A$1:$E$379,5,FALSE)","v":"75-4-STAP"},null,null,"1er"]
[16,{"$f":"VLOOKUP($A5,Engagés!$A$1:$E$379,3,FALSE)","v":"BRETTES"},{"$f":"VLOOKUP($A5,Engagés!$A$1:$E$379,4,FALSE)","v":"FERDINAND"},{"$f":"VLOOKUP($A5,Engagés!$A$1:$E$379,5,FALSE)","v":"75-2-SPFP"},null,null,"3ème"]
[17,{"$f":"VLOOKUP($A6,Engagés!$A$1:$E$379,3,FALSE)","v":"LE POITTEVIN "},{"$f":"VLOOKUP($A6,Engagés!$A$1:$E$379,4,FALSE)","v":"VADIM"},{"$f":"VLOOKUP($A6,Engagés!$A$1:$E$379,5,FALSE)","v":"75-4-FENP"},null,null,"2ème"]
[32,{"$f":"VLOOKUP($A7,Engagés!$A$1:$E$379,3,FALSE)","v":0},{"$f":"VLOOKUP($A7,Engagés!$A$1:$E$379,4,FALSE)","v":0},{"$f":"VLOOKUP($A7,Engagés!$A$1:$E$379,5,FALSE)","v":0},null,null,"4ème"]
["Si poule de 4 joueurs alors…"]
["Déroulement",null,null,"Joueurs A contre Joueur B",null,"Vainqueur","Score"]
["Match 1",null,null,{"$f":"B4","v":"MORO"},{"$f":"B7","v":0}]
{"$rows_left_out":15}
{"sheet":"Poule 10","index":2,"n_rows":24,"n_cols":7,"rows_kept":24,"cut":false,"hidden":false,"merged":[[0,3,0,4],[15,0,15,2],[16,0,16,2],[1,0,1,2],[1,3,1,6],[7,0,7,6],[8,0,8,2],[8,3,8,4],[9,0,9,2],[10,0,10,2],[11,0,11,2],[12,0,12,2],[13,0,13,6],[14,0,14,2],[14,3,14,4],[0,0,0,2],[17,0,17,2],[18,0,18,3],[18,4,18,6],[20,0,20,1],[20,2,20,3],[20,4,20,5],[19,0,19,1],[19,2,19,3],[19,4,19,5],[23,0,23,1],[23,2,23,3],[23,4,23,5],[21,0,21,1],[21,2,21,3],[21,4,21,5],[22,0,22,1],[22,2,22,3],[22,4,22,5]]}
[{"$f":"Engagés!C1","v":"TENNIS DE TABLE"},null,null,{"$f":"Engagés!C3","v":"TABLEAU B"}]
[{"$f":"Engagés!K6","v":"Poule 10"}]
[null,"NOM","Prénom","Sigle","Vict","Def","Classement"]
[2,{"$f":"VLOOKUP($A4,Engagés!$A$1:$E$379,3,FALSE)","v":"CHABREL"},{"$f":"VLOOKUP($A4,Engagés!$A$1:$E$379,4,FALSE)","v":"HUGO"},{"$f":"VLOOKUP($A4,Engagés!$A$1:$E$379,5,FALSE)","v":"75-4-STAP"},null,null,"1er"]
[15,{"$f":"VLOOKUP($A5,Engagés!$A$1:$E$379,3,FALSE)","v":"BEAU"},{"$f":"VLOOKUP($A5,Engagés!$A$1:$E$379,4,FALSE)","v":"GUILHEM"},{"$f":"VLOOKUP($A5,Engagés!$A$1:$E$379,5,FALSE)","v":"75-4-SMPP"},null,null,"3ème"]
[18,{"$f":"VLOOKUP($A6,Engagés!$A$1:$E$379,3,FALSE)","v":"MAZO KOENIG"},{"$f":"VLOOKUP($A6,Engagés!$A$1:$E$379,4,FALSE)","v":"LEOPOLD"},{"$f":"VLOOKUP($A6,Engagés!$A$1:$E$379,5,FALSE)","v":"75-4-PCHP"},null,null,"2ème"]
[31,{"$f":"VLOOKUP($A7,Engagés!$A$1:$E$379,3,FALSE)","v":0},{"$f":"VLOOKUP($A7,Engagés!$A$1:$E$379,4,FALSE)","v":0},{"$f":"VLOOKUP($A7,Engagés!$A$1:$E$379,5,FALSE)","v":0},null,null,"4ème"]
["Si poule de 4 joueurs alors…"]
["Déroulement",null,null,"Joueurs A contre Joueur B",null,"Vainqueur","Score"]
["Match 1",null,null,{"$f":"B4","v":"CHABREL"},{"$f":"B7","v":0}]
{"$rows_left_out":15}
{"sheet":"Poule 11","index":3,"n_rows":24,"n_cols":7,"rows_kept":24,"cut":false,"hidden":false,"merged":[[0,3,0,4],[15,0,15,2],[16,0,16,2],[1,0,1,2],[1,3,1,6],[7,0,7,6],[8,0,8,2],[8,3,8,4],[9,0,9,2],[10,0,10,2],[11,0,11,2],[12,0,12,2],[13,0,13,6],[14,0,14,2],[14,3,14,4],[0,0,0,2],[17,0,17,2],[18,0,18,3],[18,4,18,6],[20,0,20,1],[20,2,20,3],[20,4,20,5],[19,0,19,1],[19,2,19,3],[19,4,19,5],[23,0,23,1],[23,2,23,3],[23,4,23,5],[21,0,21,1],[21,2,21,3],[21,4,21,5],[22,0,22,1],[22,2,22,3],[22,4,22,5]]}
[{"$f":"Engagés!C1","v":"TENNIS DE TABLE"},null,null,{"$f":"Engagés!C3","v":"TABLEAU B"}]
[{"$f":"Engagés!G12","v":"Poule 11"}]
[null,"NOM","Prénom","Sigle","Vict","Def","Classement"]
[3,{"$f":"VLOOKUP($A4,Engagés!$A$1:$E$379,3,FALSE)","v":"MOLIN"},{"$f":"VLOOKUP($A4,Engagés!$A$1:$E$379,4,FALSE)","v":"BAPTISTE"},{"$f":"VLOOKUP($A4,Engagés!$A$1:$E$379,5,FALSE)","v":"75-4-LMAP"},null,null,"1er"]
[14,{"$f":"VLOOKUP($A5,Engagés!$A$1:$E$379,3,FALSE)","v":"MONS--TOIRON"},{"$f":"VLOOKUP($A5,Engagés!$A$1:$E$379,4,FALSE)","v":"HUGO"},{"$f":"VLOOKUP($A5,Engagés!$A$1:$E$379,5,FALSE)","v":"75-4-BLOP"},null,null,"3ème"]
[19,{"$f":"VLOOKUP($A6,Engagés!$A$1:$E$379,3,FALSE)","v":"FISHER"},{"$f":"VLOOKUP($A6,Engagés!$A$1:$E$379,4,FALSE)","v":"WELLINGTON"},{"$f":"VLOOKUP($A6,Engagés!$A$1:$E$379,5,FALSE)","v":"75-2-SLHP"},null,null,"2ème"]
[30,{"$f":"VLOOKUP($A7,Engagés!$A$1:$E$379,3,FALSE)","v":0},{"$f":"VLOOKUP($A7,Engagés!$A$1:$E$379,4,FALSE)","v":0},{"$f":"VLOOKUP($A7,Engagés!$A$1:$E$379,5,FALSE)","v":0},null,null,"4ème"]
["Si poule de 4 joueurs alors…"]
["Déroulement",null,null,"Joueurs A contre Joueur B",null,"Vainqueur","Score"]
["Match 1",null,null,{"$f":"B4","v":"MOLIN"},{"$f":"B7","v":0}]
{"$rows_left_out":15}
{"sheet":"Poule 12","index":4,"n_rows":24,"n_cols":7,"rows_kept":24,"cut":false,"hidden":false,"merged":[[0,3,0,4],[15,0,15,2],[16,0,16,2],[1,0,1,2],[1,3,1,6],[7,0,7,6],[8,0,8,2],[8,3,8,4],[9,0,9,2],[10,0,10,2],[11,0,11,2],[12,0,12,2],[13,0,13,6],[14,0,14,2],[14,3,14,4],[0,0,0,2],[17,0,17,2],[18,0,18,3],[18,4,18,6],[20,0,20,1],[20,2,20,3],[20,4,20,5],[19,0,19,1],[19,2,19,3],[19,4,19,5],[23,0,23,1],[23,2,23,3],[23,4,23,5],[21,0,21,1],[21,2,21,3],[21,4,21,5],[22,0,22,1],[22,2,22,3],[22,4,22,5]]}
[{"$f":"Engagés!C1","v":"TENNIS DE TABLE"},null,null,{"$f":"Engagés!C3","v":"TABLEAU B"}]
[{"$f":"Engagés!K12","v":"Poule 12"}]
[null,"NOM","Prénom","Sigle","Vict","Def","Classement"]
[4,{"$f":"VLOOKUP($A4,Engagés!$A$1:$E$379,3,FALSE)","v":"ROCHET"},{"$f":"VLOOKUP($A4,Engagés!$A$1:$E$379,4,FALSE)","v":"JEREMY"},{"$f":"VLOOKUP($A4,Engagés!$A$1:$E$379,5,FALSE)","v":"75-4-BLOP"},null,null,"1er"]
[13,{"$f":"VLOOKUP($A5,Engagés!$A$1:$E$379,3,FALSE)","v":"PELAUD"},{"$f":"VLOOKUP($A5,Engagés!$A$1:$E$379,4,FALSE)","v":"PIERRE"},{"$f":"VLOOKUP($A5,Engagés!$A$1:$E$379,5,FALSE)","v":"75-4-PCHP"},null,null,"2ème"]
[20,{"$f":"VLOOKUP($A6,Engagés!$A$1:$E$379,3,FALSE)","v":"ZHANG"},{"$f":"VLOOKUP($A6,Engagés!$A$1:$E$379,4,FALSE)","v":"TONY"},{"$f":"VLOOKUP($A6,Engagés!$A$1:$E$379,5,FALSE)","v":"75-2-SPFP"},null,null,"3ème"]
[29,{"$f":"VLOOKUP($A7,Engagés!$A$1:$E$379,3,FALSE)","v":0},{"$f":"VLOOKUP($A7,Engagés!$A$1:$E$379,4,FALSE)","v":0},{"$f":"VLOOKUP($A7,Engagés!$A$1:$E$379,5,FALSE)","v":0},null,null,"4ème"]
["Si poule de 4 joueurs alors…"]
["Déroulement",null,null,"Joueurs A contre Joueur B",null,"Vainqueur","Score"]
["Match 1",null,null,{"$f":"B4","v":"ROCHET"},{"$f":"B7","v":0},0]
{"$rows_left_out":15}
{"sheet":"Poule 13","index":5,"n_rows":24,"n_cols":7,"rows_kept":24,"cut":false,"hidden":false,"merged":[[12,0,12,2],[13,0,13,6],[0,0,0,2],[0,3,0,4],[10,0,10,2],[11,0,11,2],[1,0,1,2],[1,3,1,6],[7,0,7,6],[8,0,8,2],[8,3,8,4],[9,0,9,2],[20,0,20,1],[20,2,20,3],[20,4,20,5],[14,0,14,2],[14,3,14,4],[15,0,15,2],[18,4,18,6],[19,0,19,1],[19,2,19,3],[19,4,19,5],[16,0,16,2],[17,0,17,2],[18,0,18,3],[23,0,23,1],[23,2,23,3],[23,4,23,5],[21,0,21,1],[21,2,21,3],[21,4,21,5],[22,0,22,1],[22,2,22,3],[22,4,22,5]]}
[{"$f":"Engagés!C1","v":"TENNIS DE TABLE"},null,null,{"$f":"Engagés!C3","v":"TABLEAU B"}]
[{"$f":"Engagés!G18","v":"Poule 13"}]
[null,"NOM","Prénom","Sigle","Vict","Def","Classement"]
[5,{"$f":"VLOOKUP($A4,Engagés!$A$1:$E$379,3,FALSE)","v":"FRANC"},{"$f":"VLOOKUP($A4,Engagés!$A$1:$E$379,4,FALSE)","v":"GASPARD"},{"$f":"VLOOKUP($A4,Engagés!$A$1:$E$379,5,FALSE)","v":"75-4-LMAP"},null,null,"1er"]
[12,{"$f":"VLOOKUP($A5,Engagés!$A$1:$E$379,3,FALSE)","v":"VUILLET"},{"$f":"VLOOKUP($A5,Engagés!$A$1:$E$379,4,FALSE)","v":"OSCAR"},{"$f":"VLOOKUP($A5,Engagés!$A$1:$E$379,5,FALSE)","v":"75-2-SUPA"},null,null,"2ème"]
[21,{"$f":"VLOOKUP($A6,Engagés!$A$1:$E$379,3,FALSE)","v":"HISPA"},{"$f":"VLOOKUP($A6,Engagés!$A$1:$E$379,4,FALSE)","v":"RUBEN"},{"$f":"VLOOKUP($A6,Engagés!$A$1:$E$379,5,FALSE)","v":"75-4-FENP"},null,null,"3ème"]
[28,{"$f":"VLOOKUP($A7,Engagés!$A$1:$E$379,3,FALSE)","v":0},{"$f":"VLOOKUP($A7,Engagés!$A$1:$E$379,4,FALSE)","v":0},{"$f":"VLOOKUP($A7,Engagés!$A$1:$E$379,5,FALSE)","v":0},null,null,"4ème"]
["Si poule de 4 joueurs alors…"]
["Déroulement",null,null,"Joueurs A contre Joueur B",null,"Vainqueur","Score"]
["Match 1",null,null,{"$f":"B4","v":"FRANC"},{"$f":"B7","v":0},0]
{"$rows_left_out":15}
{"sheet":"Poule 14","index":6,"n_rows":24,"n_cols":7,"rows_kept":24,"cut":false,"hidden":false,"merged":[[12,0,12,2],[13,0,13,6],[0,0,0,2],[0,3,0,4],[10,0,10,2],[11,0,11,2],[1,0,1,2],[1,3,1,6],[7,0,7,6],[8,0,8,2],[8,3,8,4],[9,0,9,2],[20,0,20,1],[20,2,20,3],[20,4,20,5],[14,0,14,2],[14,3,14,4],[15,0,15,2],[18,4,18,6],[19,0,19,1],[19,2,19,3],[19,4,19,5],[16,0,16,2],[17,0,17,2],[18,0,18,3],[23,0,23,1],[23,2,23,3],[23,4,23,5],[21,0,21,1],[21,2,21,3],[21,4,21,5],[22,0,22,1],[22,2,22,3],[22,4,22,5]]}
[{"$f":"Engagés!C1","v":"TENNIS DE TABLE"},null,null,{"$f":"Engagés!C3","v":"TABLEAU B"}]
[{"$f":"Engagés!K18","v":"Poule 14"}]
[null,"NOM","Prénom","Sigle","Vict","Def","Classement"]
[6,{"$f":"VLOOKUP($A4,Engagés!$A$1:$E$379,3,FALSE)","v":"RABAUT"},{"$f":"VLOOKUP($A4,Engagés!$A$1:$E$379,4,FALSE)","v":"MAXENCE"},{"$f":"VLOOKUP($A4,Engagés!$A$1:$E$379,5,FALSE)","v":"75-4-PCHP"},null,null,"1er"]
[11,{"$f":"VLOOKUP($A5,Engagés!$A$1:$E$379,3,FALSE)","v":0},{"$f":"VLOOKUP($A5,Engagés!$A$1:$E$379,4,FALSE)","v":0},{"$f":"VLOOKUP($A5,Engagés!$A$1:$E$379,5,FALSE)","v":0},null,null,"3ème"]
[22,{"$f":"VLOOKUP($A6,Engagés!$A$1:$E$379,3,FALSE)","v":"GODOUET"},{"$f":"VLOOKUP($A6,Engagés!$A$1:$E$379,4,FALSE)","v":"MAXIME"},{"$f":"VLOOKUP($A6,Engagés!$A$1:$E$379,5,FALSE)","v":"75-4-LMAP"},null,null,"2ème"]
[27,{"$f":"VLOOKUP($A7,Engagés!$A$1:$E$379,3,FALSE)","v":0},{"$f":"VLOOKUP($A7,Engagés!$A$1:$E$379,4,FALSE)","v":0},{"$f":"VLOOKUP($A7,Engagés!$A$1:$E$379,5,FALSE)","v":0},null,null,"4ème"]
["Si poule de 4 joueurs alors…"]
["Déroulement",null,null,"Joueurs A contre Joueur B",null,"Vainqueur","Score"]
["Match 1",null,null,{"$f":"B4","v":"RABAUT"},{"$f":"B7","v":0},0]
{"$rows_left_out":15}
{"sheet":"Poule 15","index":7,"n_rows":24,"n_cols":7,"rows_kept":24,"cut":false,"hidden":false,"merged":[[12,0,12,2],[13,0,13,6],[0,0,0,2],[0,3,0,4],[10,0,10,2],[11,0,11,2],[1,0,1,2],[1,3,1,6],[7,0,7,6],[8,0,8,2],[8,3,8,4],[9,0,9,2],[20,0,20,1],[20,2,20,3],[20,4,20,5],[14,0,14,2],[14,3,14,4],[15,0,15,2],[18,4,18,6],[19,0,19,1],[19,2,19,3],[19,4,19,5],[16,0,16,2],[17,0,17,2],[18,0,18,3],[23,0,23,1],[23,2,23,3],[23,4,23,5],[21,0,21,1],[21,2,21,3],[21,4,21,5],[22,0,22,1],[22,2,22,3],[22,4,22,5]]}
[{"$f":"Engagés!C1","v":"TENNIS DE TABLE"},null,null,{"$f":"Engagés!C3","v":"TABLEAU B"}]
[{"$f":"Engagés!G24","v":"Poule 15"}]
[null,"NOM","Prénom","Sigle","Vict","Def","Classement"]
[7,{"$f":"VLOOKUP($A4,Engagés!$A$1:$E$379,3,FALSE)","v":"CHOMIENNE"},{"$f":"VLOOKUP($A4,Engagés!$A$1:$E$379,4,FALSE)","v":"ELOI"},{"$f":"VLOOKUP($A4,Engagés!$A$1:$E$379,5,FALSE)","v":"75-4-STAP"},null,null,"1er"]
[10,{"$f":"VLOOKUP($A5,Engagés!$A$1:$E$379,3,FALSE)","v":"ERDEM"},{"$f":"VLOOKUP($A5,Engagés!$A$1:$E$379,4,FALSE)","v":"EDIS"},{"$f":"VLOOKUP($A5,Engagés!$A$1:$E$379,5,FALSE)","v":"75-2-SLHP"},null,null,"3ème"]
[23,{"$f":"VLOOKUP($A6,Engagés!$A$1:$E$379,3,FALSE)","v":"ZARAYA"},{"$f":"VLOOKUP($A6,Engagés!$A$1:$E$379,4,FALSE)","v":"SIMON"},{"$f":"VLOOKUP($A6,Engagés!$A$1:$E$379,5,FALSE)","v":"75-4-LMAP"},null,null,"2ème"]
[26,{"$f":"VLOOKUP($A7,Engagés!$A$1:$E$379,3,FALSE)","v":0},{"$f":"VLOOKUP($A7,Engagés!$A$1:$E$379,4,FALSE)","v":0},{"$f":"VLOOKUP($A7,Engagés!$A$1:$E$379,5,FALSE)","v":0},null,null,"4ème"]
["Si poule de 4 joueurs alors…"]
["Déroulement",null,null,"Joueurs A contre Joueur B",null,"Vainqueur","Score"]
["Match 1",null,null,{"$f":"B4","v":"CHOMIENNE"},{"$f":"B7","v":0},0]
{"$rows_left_out":15}
{"sheet":"Poule 16","index":8,"n_rows":24,"n_cols":7,"rows_kept":24,"cut":false,"hidden":false,"merged":[[12,0,12,2],[13,0,13,6],[0,0,0,2],[0,3,0,4],[10,0,10,2],[11,0,11,2],[1,0,1,2],[1,3,1,6],[7,0,7,6],[8,0,8,2],[8,3,8,4],[9,0,9,2],[20,0,20,1],[20,2,20,3],[20,4,20,5],[14,0,14,2],[14,3,14,4],[15,0,15,2],[18,4,18,6],[19,0,19,1],[19,2,19,3],[19,4,19,5],[16,0,16,2],[17,0,17,2],[18,0,18,3],[23,0,23,1],[23,2,23,3],[23,4,23,5],[21,0,21,1],[21,2,21,3],[21,4,21,5],[22,0,22,1],[22,2,22,3],[22,4,22,5]]}
[{"$f":"Engagés!C1","v":"TENNIS DE TABLE"},null,null,{"$f":"Engagés!C3","v":"TABLEAU B"}]
[{"$f":"Engagés!K24","v":"Poule 16"}]
[null,"NOM","Prénom","Sigle","Vict","Def","Classement"]
[8,{"$f":"VLOOKUP($A4,Engagés!$A$1:$E$379,3,FALSE)","v":"ELKOUBY"},{"$f":"VLOOKUP($A4,Engagés!$A$1:$E$379,4,FALSE)","v":"DAN"},{"$f":"VLOOKUP($A4,Engagés!$A$1:$E$379,5,FALSE)","v":"75-4-SMPP"},null,null,"2ème"]
[9,{"$f":"VLOOKUP($A5,Engagés!$A$1:$E$379,3,FALSE)","v":"MARCOTTE DE QUIVIERES"},{"$f":"VLOOKUP($A5,Engagés!$A$1:$E$379,4,FALSE)","v":"VICTOR"},{"$f":"VLOOKUP($A5,Engagés!$A$1:$E$379,5,FALSE)","v":"75-4-LMAP"},null,null,"1er"]
[24,{"$f":"VLOOKUP($A6,Engagés!$A$1:$E$379,3,FALSE)","v":"OZANNE"},{"$f":"VLOOKUP($A6,Engagés!$A$1:$E$379,4,FALSE)","v":"ROBIN"},{"$f":"VLOOKUP($A6,Engagés!$A$1:$E$379,5,FALSE)","v":"75-2-NDLP"},null,null,"3ème"]
[25,{"$f":"VLOOKUP($A7,Engagés!$A$1:$E$379,3,FALSE)","v":0},{"$f":"VLOOKUP($A7,Engagés!$A$1:$E$379,4,FALSE)","v":0},{"$f":"VLOOKUP($A7,Engagés!$A$1:$E$379,5,FALSE)","v":0},null,null,"4ème"]
["Si poule de 4 joueurs alors…"]
["Déroulement",null,null,"Joueurs A contre Joueur B",null,"Vainqueur","Score"]
["Match 1",null,null,{"$f":"B4","v":"ELKOUBY"},{"$f":"B7","v":0},0]
{"$rows_left_out":15}
{"sheet":"Résultats de poule","index":9,"n_rows":10,"n_cols":16,"rows_kept":10,"cut":false,"hidden":false,"merged":[[0,0,0,3],[0,4,0,7],[0,8,0,11],[0,12,0,15],[5,0,5,3],[5,4,5,7],[5,8,5,11],[5,12,5,15]]}
[{"$f":"Engagés!G6","v":"Poule 9"},null,null,null,{"$f":"Engagés!K6","v":"Poule 10"},null,null,null,{"$f":"Engagés!G12","v":"Poule 11"},null,null,null,{"$f":"Engagés!K12","v":"Poule 12"}]
["1er",{"$f":"'Poule 9'!$C21","v":"MORO"},{"$f":"'Poule 9'!$E21","v":"COME"},{"$f":"'Poule 9'!$G21","v":"75-4-STAP"},"1er",{"$f":"'Poule 10'!$C21","v":"CHABREL"},{"$f":"'Poule 10'!$E21","v":"HUGO"},{"$f":"'Poule 10'!$G21","v":"75-4-STAP"},"1er",{"$f":"'Poule 11'!$C21","v":"MOLIN"},{"$f":"'Poule 11'!$E21","v":"BAPTISTE"},{"$f":"'Poule 11'!$G21","v":"75-4-LMAP"},"1er",{"$f":"'Poule 12'!$C21","v":"ROCHET"},{"$f":"'Poule 12'!$E21","v":"JEREMY"},{"$f":"'Poule 12'!$G21","v":"75-4-BLOP"}]
["2ème",{"$f":"'Poule 9'!$C22","v":"LE POITTEVIN "},{"$f":"'Poule 9'!$E22","v":"VADIM"},{"$f":"'Poule 9'!$G22","v":"75-4-FENP"},"2ème",{"$f":"'Poule 10'!$C22","v":"MAZO KOENIG"},{"$f":"'Poule 10'!$E22","v":"LEOPOLD"},{"$f":"'Poule 10'!$G22","v":"75-4-PCHP"},"2ème",{"$f":"'Poule 11'!$C22","v":"FISHER"},{"$f":"'Poule 11'!$E22","v":"WELLINGTON"},{"$f":"'Poule 11'!$G22","v":"75-2-SLHP"},"2ème",{"$f":"'Poule 12'!$C22","v":"PELAUD"},{"$f":"'Poule 12'!$E22","v":"PIERRE"},{"$f":"'Poule 12'!$G22","v":"75-4-PCHP"}]
["3ème",{"$f":"'Poule 9'!$C23","v":"BRETTES"},{"$f":"'Poule 9'!$E23","v":"FERDINAND"},{"$f":"'Poule 9'!$G23","v":"75-2-SPFP"},"3ème",{"$f":"'Poule 10'!$C23","v":"BEAU"},{"$f":"'Poule 10'!$E23","v":"GUILHEM"},{"$f":"'Poule 10'!$G23","v":"75-4-SMPP"},"3ème",{"$f":"'Poule 11'!$C23","v":"MONS--TOIRON"},{"$f":"'Poule 11'!$E23","v":"HUGO"},{"$f":"'Poule 11'!$G23","v":"75-4-BLOP"},"3ème",{"$f":"'Poule 12'!$C23","v":"ZHANG"},{"$f":"'Poule 12'!$E23","v":"TONY"},{"$f":"'Poule 12'!$G23","v":"75-2-SPFP"}]
["4ème",{"$f":"'Poule 9'!$C24","v":0},{"$f":"'Poule 9'!$E24","v":0},{"$f":"'Poule 9'!$G24","v":0},"4ème",{"$f":"'Poule 10'!$C24","v":0},{"$f":"'Poule 10'!$E24","v":0},{"$f":"'Poule 10'!$G24","v":0},"4ème",{"$f":"'Poule 11'!$C24","v":0},{"$f":"'Poule 11'!$E24","v":0},{"$f":"'Poule 11'!$G24","v":0},"4ème",{"$f":"'Poule 12'!$C24","v":0},{"$f":"'Poule 12'!$E24","v":0},{"$f":"'Poule 12'!$G24","v":0}]
[{"$f":"Engagés!G18","v":"Poule 13"},null,null,null,{"$f":"Engagés!K18","v":"Poule 14"},null,null,null,{"$f":"Engagés!G24","v":"Poule 15"},null,null,null,{"$f":"Engagés!K24","v":"Poule 16"}]
["1er",{"$f":"'Poule 13'!$C21","v":"FRANC"},{"$f":"'Poule 13'!$E21","v":"GASPARD"},{"$f":"'Poule 13'!$G21","v":"75-4-LMAP"},"1er",{"$f":"'Poule 14'!$C21","v":"RABAUT"},{"$f":"'Poule 14'!$E21","v":"MAXENCE"},{"$f":"'Poule 14'!$G21","v":"75-4-PCHP"},"1er",{"$f":"'Poule 15'!$C21","v":"CHOMIENNE"},{"$f":"'Poule 15'!$E21","v":"ELOI"},{"$f":"'Poule 15'!$G21","v":"75-4-STAP"},"1er",{"$f":"'Poule 16'!$C21","v":"MARCOTTE DE QUIVIERES"},{"$f":"'Poule 16'!$E21","v":"VICTOR"},{"$f":"'Poule 16'!$G21","v":"75-4-LMAP"}]
["2ème",{"$f":"'Poule 13'!$C22","v":"VUILLET"},{"$f":"'Poule 13'!$E22","v":"OSCAR"},{"$f":"'Poule 13'!$G22","v":"75-2-SUPA"},"2ème",{"$f":"'Poule 14'!$C22","v":"GODOUET"},{"$f":"'Poule 14'!$E22","v":"MAXIME"},{"$f":"'Poule 14'!$G22","v":"75-4-LMAP"},"2ème",{"$f":"'Poule 15'!$C22","v":"ZARAYA"},{"$f":"'Poule 15'!$E22","v":"SIMON"},{"$f":"'Poule 15'!$G22","v":"75-4-LMAP"},"2ème",{"$f":"'Poule 16'!$C22","v":"ELKOUBY"},{"$f":"'Poule 16'!$E22","v":"DAN"},{"$f":"'Poule 16'!$G22","v":"75-4-SMPP"}]
["3ème",{"$f":"'Poule 13'!$C23","v":"HISPA"},{"$f":"'Poule 13'!$E23","v":"RUBEN"},{"$f":"'Poule 13'!$G23","v":"75-4-FENP"},"3ème",{"$f":"'Poule 14'!$C23","v":0},{"$f":"'Poule 14'!$E23","v":0},{"$f":"'Poule 14'!$G23","v":0},"3ème",{"$f":"'Poule 15'!$C23","v":"ERDEM"},{"$f":"'Poule 15'!$E23","v":"EDIS"},{"$f":"'Poule 15'!$G23","v":"75-2-SLHP"},"3ème",{"$f":"'Poule 16'!$C23","v":"OZANNE"},{"$f":"'Poule 16'!$E23","v":"ROBIN"},{"$f":"'Poule 16'!$G23","v":"75-2-NDLP"}]
["4ème",{"$f":"'Poule 13'!$C24","v":0},{"$f":"'Poule 13'!$E24","v":0},{"$f":"'Poule 13'!$G24","v":0},"4ème",{"$f":"'Poule 14'!$C24","v":0},{"$f":"'Poule 14'!$E24","v":0},{"$f":"'Poule 14'!$G24","v":0},"4ème",{"$f":"'Poule 15'!$C24","v":0},{"$f":"'Poule 15'!$E24","v":0},{"$f":"'Poule 15'!$G24","v":0},"4ème",{"$f":"'Poule 16'!$C24","v":0},{"$f":"'Poule 16'!$E24","v":0},{"$f":"'Poule 16'!$G24","v":0}]
{"$rows_left_out":1}
{"sheet":"Tableau","index":10,"n_rows":92,"n_cols":34,"rows_kept":92,"cut":false,"hidden":false,"merged":[[8,10,8,11],[50,20,50,21],[16,10,16,11],[23,10,23,11],[33,10,33,11],[40,10,40,11],[48,10,48,11],[10,20,10,21],[30,32,30,33],[0,16,0,19],[15,29,15,30],[0,0,0,14],[31,29,31,30],[10,1,10,2],[1,4,1,5],[0,20,0,33],[16,26,16,27],[23,23,23,24],[3,20,3,21],[18,20,18,21],[29,4,29,5],[25,20,25,21],[1,10,1,11],[9,23,9,24],[55,10,55,11],[33,4,33,5],[42,1,42,2],[59,29,59,30],[55,23,55,24],[47,29,47,30],[35,20,35,21],[42,20,42,21],[41,23,41,24],[48,26,48,27],[57,20,57,21]]}
["REPECHAGES ET MATCHS DE CLASSEMENT",null,null,null,null,null,null,null,null,null,null,null,null,null,null,null,"1er tour de tableau",null,null,null,"TABLEAU PRINCIPAL"]
[]
[]
[null,null,null,null,null,null,null,null,null,null,null,null,null,null,null,null,"1er poule 9",{"$f":"'Résultats de poule'!B2","v":"MORO"},{"$f":"'Résultats de poule'!D2","v":"75-4-STAP"},"V","1/8 de finale 1"]
[null,null,null,null,null,null,null,null,null,null,null,null,"P",{"$f":"IF(T4=\"\",\"\",IF(T4=\"p\",S4,S5))","v":0},{"$f":"IF(T4=\"\",\"\",IF(T4=\"p\",R4,R5))","v":0},null,"4ème poule 16",{"$f":"'Résultats de poule'!N10","v":0},{"$f":"'Résultats de poule'!P10","v":0},"P",{"$f":"IF(T4=\"\",\"\",IF(T4=\"v\",R4,R5))","v":"MORO"},{"$f":"IF(T4=\"\",\"\",IF(T4=\"v\",S4,S5))","v":"75-4-STAP"},"V"]
[null,null,null,null,null,null,null,null,null,null,{"$f":"IF(M5=\"\",\"\",IF(M5=\"v\",N5,N7))","v":"75-4-LMAP"},{"$f":"IF(M5=\"\",\"\",IF(M5=\"v\",O5,O7))","v":"GODOUET"},null,null,null,null,null,null,null,null,null,null,null,{"$f":"IF(W5=\"\",\"\",IF(W5=\"v\",U5,U7))","v":"MORO"},{"$f":"IF(W5=\"\",\"\",IF(W5=\"v\",V5,V7))","v":"75-4-STAP"},"V"]
[null,null,null,null,null,null,null,null,null,null,null,null,"V",{"$f":"IF(T7=\"\",\"\",IF(T7=\"p\",S7,S8))","v":"75-4-LMAP"},{"$f":"IF(T7=\"\",\"\",IF(T7=\"p\",R7,R8))","v":"GODOUET"},null,"3ème poule 11",{"$f":"'Résultats de poule'!J4","v":"MONS--TOIRON"},{"$f":"'Résultats de poule'!L4","v":"75-4-BLOP"},"V",{"$f":"IF(T7=\"\",\"\",IF(T7=\"v\",R7,R8))","v":"MONS--TOIRON"},{"$f":"IF(T7=\"\",\"\",IF(T7=\"v\",S7,S8))","v":"75-4-BLOP"},"P"]
[null,null,null,null,null,null,null,null,null,null,null,null,null,null,null,null,"2ème poule 14",{"$f":"'Résultats de poule'!F8","v":"GODOUET"},{"$f":"'Résultats de poule'!H8","v":"75-4-LMAP"},"P"]
[null,null,null,null,null,null,null,{"$f":"IF(J6=\"\",\"\",IF(J6=\"v\",K6,K13))","v":""},{"$f":"IF(J6=\"\",\"\",IF(J6=\"v\",L6,L13))","v":""}]
[null,null,null,null,null,null,null,null,null,null,null,null,null,null,null,null,null,null,null,null,null,null,null,"1/4 finale 1",null,null,{"$f":"IF(Z6=\"\",\"\",IF(Z6=\"v\",X6,X13))","v":"MORO"},{"$f":"IF(Z6=\"\",\"\",IF(Z6=\"v\",Y6,Y13))","v":"75-4-STAP"},"P"]
{"$rows_left_out":83}
{"sheet":"Classement","index":11,"n_rows":35,"n_cols":3,"rows_kept":35,"cut":false,"hidden":false,"merged":[[1,0,1,2],[0,0,0,2]]}
[{"$f":"IF(Engagés!A1=\"\",\"\",Engagés!A1)","v":"Qualifications championnat Comité de Paris "}]
[{"$f":"IF(Engagés!E3=\"\",\"\",Engagés!E3)","v":"MG Promo"}]
["CLASSEMENT","NOMS","Etablissement"]
["1er",{"$f":"Tableau!AG32","v":"CHABREL"},{"$f":"Tableau!AH32","v":"75-4-STAP"}]
["2ème",{"$f":"IF(Tableau!$AF$17=\"\",\"\",IF(Tableau!$AF$17=\"p\",Tableau!$AD$17,Tableau!$AD$49))","v":"ROCHET"},{"$f":"IF(Tableau!$AF$17=\"\",\"\",IF(Tableau!$AF$17=\"p\",Tableau!$AE$17,Tableau!$AE$49))","v":"75-4-BLOP"}]
["3ème",{"$f":"Tableau!AG62","v":"MORO"},{"$f":"Tableau!AH62","v":"75-4-STAP"}]
["4ème",{"$f":"IF(Tableau!AF61=\"\",\"\",IF(Tableau!$AF$61=\"p\",Tableau!$AD$61,Tableau!$AD$63))","v":"FRANC"},{"$f":"IF(Tableau!AF61=\"\",\"\",IF(Tableau!$AF$61=\"p\",Tableau!$AE$61,Tableau!$AE$63))","v":"75-4-LMAP"}]
["5ème",{"$f":"Tableau!AG79","v":"CHOMIENNE"},{"$f":"Tableau!AH79","v":"75-4-STAP"}]
["6ème",{"$f":"IF(Tableau!AF76=\"\",\"\",IF(Tableau!$AF$76=\"p\",Tableau!$AD$76,Tableau!$AD$82))","v":"MOLIN"},{"$f":"IF(Tableau!$AF$76=\"\",\"\",IF(Tableau!$AF$76=\"p\",Tableau!$AE$76,Tableau!$AE$82))","v":"75-4-LMAP"}]
["7ème",{"$f":"Tableau!AD86","v":"RABAUT"},{"$f":"Tableau!AE86","v":"75-4-PCHP"}]
{"$rows_left_out":25}