{"text_format":"1","workbook":"xlsx","n_sheets":12,"sheets":["Engagés","Poule 9","Poule 10","Poule 11","Poule 12","Poule 13","Poule 14","Poule 15","Poule 16","Résultats de poule","Tableau","Classement"],"not_rendered":{"charts":0,"images":81,"macros":1,"external_links":0,"defined_names":1,"comments":0,"pivot_tables":0},"unopened":[],"bounds":{"document_bytes":16777216,"sheet_cells":100000,"rows_first":2000,"rows_last":500,"rows_between":2000,"halvings":0,"cell_chars":16384,"cell_head_chars":4096},"cells_cut":0,"cells_raw":0,"read":"whole","date_system":"1900"}

{"sheet":"Engagés","index":0,"n_rows":37,"n_cols":14,"rows_kept":37,"cut":false,"hidden":false,"merged":[[17,6,17,9],[17,10,17,13],[23,6,23,9],[23,10,23,13],[0,0,2,1],[0,2,1,2],[5,10,5,13],[5,6,5,9],[11,6,11,9],[11,10,11,13]]}
["Qualifications championnat Comité de Paris ",null,"TENNIS DE TABLE","DATE :","13 dec"]
[null,null,null,"LIEU :","Stanislas"]
[null,null,"TABLEAU B","CATEGORIE :","MG Promo"]
["Tête de série","ETABLISSEMENT","NOM","PRENOM","SIGLE"]
[]
[1,null,"MORO","COME","75-4-STAP",null,"Poule 9",null,null,null,"Poule 10"]
[2,null,"CHABREL","HUGO","75-4-STAP",null,1,{"$f":"VLOOKUP($G7,$A$1:$E$37,3,FALSE)","v":"MORO"},{"$f":"VLOOKUP($G7,$A$1:$E$37,4,FALSE)","v":"COME"},{"$f":"VLOOKUP($G7,$A$1:$E$37,5,FALSE)","v":"75-4-STAP"},2,{"$f":"VLOOKUP($K7,$A$1:$E$37,3,FALSE)","v":"CHABREL"},{"$f":"VLOOKUP($K7,$A$1:$E$37,4,FALSE)","v":"HUGO"},{"$f":"VLOOKUP($K7,$A$1:$E$37,5,FALSE)","v":"75-4-STAP"}]
[3,null,"MOLIN","BAPTISTE","75-4-LMAP",null,16,{"$f":"VLOOKUP($G8,$A$1:$E$37,3,FALSE)","v":"BRETTES"},{"$f":"VLOOKUP($G8,$A$1:$E$37,4,FALSE)","v":"FERDINAND"},{"$f":"VLOOKUP($G8,$A$1:$E$37,5,FALSE)","v":"75-2-SPFP"},15,{"$f":"VLOOKUP($K8,$A$1:$E$37,3,FALSE)","v":"BEAU"},{"$f":"VLOOKUP($K8,$A$1:$E$37,4,FALSE)","v":"GUILHEM"},{"$f":"VLOOKUP($K8,$A$1:$E$37,5,FALSE)","v":"75-4-SMPP"}]
[4,null,"ROCHET","JEREMY","75-4-BLOP",null,17,{"$f":"VLOOKUP($G9,$A$1:$E$37,3,FALSE)","v":"LE POITTEVIN "},{"$f":"VLOOKUP($G9,$A$1:$E$37,4,FALSE)","v":"VADIM"},{"$f":"VLOOKUP($G9,$A$1:$E$37,5,FALSE)","v":"75-4-FENP"},18,{"$f":"VLOOKUP($K9,$A$1:$E$37,3,FALSE)","v":"MAZO KOENIG"},{"$f":"VLOOKUP($K9,$A$1:$E$37,4,FALSE)","v":"LEOPOLD"},{"$f":"VLOOKUP($K9,$A$1:$E$37,5,FALSE)","v":"75-4-PCHP"}]
[5,null,"FRANC","GASPARD","75-4-LMAP",null,32,{"$f":"VLOOKUP($G10,$A$1:$E$37,3,FALSE)","v":0},{"$f":"VLOOKUP($G10,$A$1:$E$37,4,FALSE)","v":0},{"$f":"VLOOKUP($G10,$A$1:$E$37,5,FALSE)","v":0},31,{"$f":"VLOOKUP($K10,$A$1:$E$37,3,FALSE)","v":0},{"$f":"VLOOKUP($K10,$A$1:$E$37,4,FALSE)","v":0},{"$f":"VLOOKUP($K10,$A$1:$E$37,5,FALSE)","v":0}]
[6,null,"RABAUT","MAXENCE","75-4-PCHP"]
[7,null,"CHOMIENNE","ELOI","75-4-STAP",null,"Poule 11",null,null,null,"Poule 12"]
[8,null,"ELKOUBY","DAN","75-4-SMPP",null,3,{"$f":"VLOOKUP($G13,$A$1:$E$37,3,FALSE)","v":"MOLIN"},{"$f":"VLOOKUP($G13,$A$1:$E$37,4,FALSE)","v":"BAPTISTE"},{"$f":"VLOOKUP($G13,$A$1:$E$37,5,FALSE)","v":"75-4-LMAP"},4,{"$f":"VLOOKUP($K13,$A$1:$E$37,3,FALSE)","v":"ROCHET"},{"$f":"VLOOKUP($K13,$A$1:$E$37,4,FALSE)","v":"JEREMY"},{"$f":"VLOOKUP($K13,$A$1:$E$37,5,FALSE)","v":"75-4-BLOP"}]
[9,null,"MARCOTTE DE QUIVIERES","VICTOR","75-4-LMAP",null,14,{"$f":"VLOOKUP($G14,$A$1:$E$37,3,FALSE)","v":"MONS--TOIRON"},{"$f":"VLOOKUP($G14,$A$1:$E$37,4,FALSE)","v":"HUGO"},{"$f":"VLOOKUP($G14,$A$1:$E$37,5,FALSE)","v":"75-4-BLOP"},13,{"$f":"VLOOKUP($K14,$A$1:$E$37,3,FALSE)","v":"PELAUD"},{"$f":"VLOOKUP($K14,$A$1:$E$37,4,FALSE)","v":"PIERRE"},{"$f":"VLOOKUP($K14,$A$1:$E$37,5,FALSE)","v":"75-4-PCHP"}]
[10,null,"ERDEM","EDIS","75-2-SLHP",null,19,{"$f":"VLOOKUP($G15,$A$1:$E$37,3,FALSE)","v":"FISHER"},{"$f":"VLOOKUP($G15,$A$1:$E$37,4,FALSE)","v":"WELLINGTON"},{"$f":"VLOOKUP($G15,$A$1:$E$37,5,FALSE)","v":"75-2-SLHP"},20,{"$f":"VLOOKUP($K15,$A$1:$E$37,3,FALSE)","v":"ZHANG"},{"$f":"VLOOKUP($K15,$A$1:$E$37,4,FALSE)","v":"TONY"},{"$f":"VLOOKUP($K15,$A$1:$E$37,5,FALSE)","v":"75-2-SPFP"}]
[11,null,null,null,null,null,30,{"$f":"VLOOKUP($G16,$A$1:$E$37,3,FALSE)","v":0},{"$f":"VLOOKUP($G16,$A$1:$E$37,4,FALSE)","v":0},{"$f":"VLOOKUP($G16,$A$1:$E$37,5,FALSE)","v":0},29,{"$f":"VLOOKUP($K16,$A$1:$E$37,3,FALSE)","v":0},{"$f":"VLOOKUP($K16,$A$1:$E$37,4,FALSE)","v":0},{"$f":"VLOOKUP($K16,$A$1:$E$37,5,FALSE)","v":0}]
[12,null,"VUILLET","OSCAR","75-2-SUPA"]
[13,null,"PELAUD","PIERRE","75-4-PCHP",null,"Poule 13",null,null,null,"Poule 14"]
[14,null,"MONS--TOIRON","HUGO","75-4-BLOP",null,5,{"$f":"VLOOKUP($G19,$A$1:$E$37,3,FALSE)","v":"FRANC"},{"$f":"VLOOKUP($G19,$A$1:$E$37,4,FALSE)","v":"GASPARD"},{"$f":"VLOOKUP($G19,$A$1:$E$37,5,FALSE)","v":"75-4-LMAP"},6,{"$f":"VLOOKUP($K19,$A$1:$E$37,3,FALSE)","v":"RABAUT"},{"$f":"VLOOKUP($K19,$A$1:$E$37,4,FALSE)","v":"MAXENCE"},{"$f":"VLOOKUP($K19,$A$1:$E$37,5,FALSE)","v":"75-4-PCHP"}]
[15,null,"BEAU","GUILHEM","75-4-SMPP",null,12,{"$f":"VLOOKUP($G20,$A$1:$E$37,3,FALSE)","v":"VUILLET"},{"$f":"VLOOKUP($G20,$A$1:$E$37,4,FALSE)","v":"OSCAR"},{"$f":"VLOOKUP($G20,$A$1:$E$37,5,FALSE)","v":"75-2-SUPA"},11,{"$f":"VLOOKUP($K20,$A$1:$E$37,3,FALSE)","v":0},{"$f":"VLOOKUP($K20,$A$1:$E$37,4,FALSE)","v":0},{"$f":"VLOOKUP($K20,$A$1:$E$37,5,FALSE)","v":0}]
[16,null,"BRETTES","FERDINAND","75-2-SPFP",null,21,{"$f":"VLOOKUP($G21,$A$1:$E$37,3,FALSE)","v":"HISPA"},{"$f":"VLOOKUP($G21,$A$1:$E$37,4,FALSE)","v":"RUBEN"},{"$f":"VLOOKUP($G21,$A$1:$E$37,5,FALSE)","v":"75-4-FENP"},22,{"$f":"VLOOKUP($K21,$A$1:$E$37,3,FALSE)","v":"GODOUET"},{"$f":"VLOOKUP($K21,$A$1:$E$37,4,FALSE)","v":"MAXIME"},{"$f":"VLOOKUP($K21,$A$1:$E$37,5,FALSE)","v":"75-4-LMAP"}]
[17,null,"LE POITTEVIN ","VADIM","75-4-FENP",null,28,{"$f":"VLOOKUP($G22,$A$1:$E$37,3,FALSE)","v":0},{"$f":"VLOOKUP($G22,$A$1:$E$37,4,FALSE)","v":0},{"$f":"VLOOKUP($G22,$A$1:$E$37,5,FALSE)","v":0},27,{"$f":"VLOOKUP($K22,$A$1:$E$37,3,FALSE)","v":0},{"$f":"VLOOKUP($K22,$A$1:$E$37,4,FALSE)","v":0},{"$f":"VLOOKUP($K22,$A$1:$E$37,5,FALSE)","v":0}]
[18,null,"MAZO KOENIG","LEOPOLD","75-4-PCHP"]
[19,null,"FISHER","WELLINGTON","75-2-SLHP",null,"Poule 15",null,null,null,"Poule 16"]
[20,null,"ZHANG","TONY","75-2-SPFP",null,7,{"$f":"VLOOKUP($G25,$A$1:$E$37,3,FALSE)","v":"CHOMIENNE"},{"$f":"VLOOKUP($G25,$A$1:$E$37,4,FALSE)","v":"ELOI"},{"$f":"VLOOKUP($G25,$A$1:$E$37,5,FALSE)","v":"75-4-STAP"},8,{"$f":"VLOOKUP($K25,$A$1:$E$37,3,FALSE)","v":"ELKOUBY"},{"$f":"VLOOKUP($K25,$A$1:$E$37,4,FALSE)","v":"DAN"},{"$f":"VLOOKUP($K25,$A$1:$E$37,5,FALSE)","v":"75-4-SMPP"}]
[21,null,"HISPA","RUBEN","75-4-FENP",null,10,{"$f":"VLOOKUP($G26,$A$1:$E$37,3,FALSE)","v":"ERDEM"},{"$f":"VLOOKUP($G26,$A$1:$E$37,4,FALSE)","v":"EDIS"},{"$f":"VLOOKUP($G26,$A$1:$E$37,5,FALSE)","v":"75-2-SLHP"},9,{"$f":"VLOOKUP($K26,$A$1:$E$37,3,FALSE)","v":"MARCOTTE DE QUIVIERES"},{"$f":"VLOOKUP($K26,$A$1:$E$37,4,FALSE)","v":"VICTOR"},{"$f":"VLOOKUP($K26,$A$1:$E$37,5,FALSE)","v":"75-4-LMAP"}]
[22,null,"GODOUET","MAXIME","75-4-LMAP",null,23,{"$f":"VLOOKUP($G27,$A$1:$E$37,3,FALSE)","v":"ZARAYA"},{"$f":"VLOOKUP($G27,$A$1:$E$37,4,FALSE)","v":"SIMON"},{"$f":"VLOOKUP($G27,$A$1:$E$37,5,FALSE)","v":"75-4-LMAP"},24,{"$f":"VLOOKUP($K27,$A$1:$E$37,3,FALSE)","v":"OZANNE"},{"$f":"VLOOKUP($K27,$A$1:$E$37,4,FALSE)","v":"ROBIN"},{"$f":"VLOOKUP($K27,$A$1:$E$37,5,FALSE)","v":"75-2-NDLP"}]
[23,null,"ZARAYA","SIMON","75-4-LMAP",null,26,{"$f":"VLOOKUP($G28,$A$1:$E$37,3,FALSE)","v":0},{"$f":"VLOOKUP($G28,$A$1:$E$37,4,FALSE)","v":0},{"$f":"VLOOKUP($G28,$A$1:$E$37,5,FALSE)","v":0},25,{"$f":"VLOOKUP($K28,$A$1:$E$37,3,FALSE)","v":0},{"$f":"VLOOKUP($K28,$A$1:$E$37,4,FALSE)","v":0},{"$f":"VLOOKUP($K28,$A$1:$E$37,5,FALSE)","v":0}]
[24,null,"OZANNE","ROBIN","75-2-NDLP"]
[25]
[26]
[27]
[28]
[29]
[30]
[31]
[32]

{"sheet":"Poule 9","index":1,"n_rows":24,"n_cols":7,"rows_kept":24,"cut":false,"hidden":false,"merged":[[0,0,0,2],[0,3,0,4],[22,0,22,1],[20,2,20,3],[23,4,23,5],[22,4,22,5],[13,0,13,6],[14,3,14,4],[23,2,23,3],[21,0,21,1],[23,0,23,1],[21,2,21,3],[19,4,19,5],[20,4,20,5],[7,0,7,6],[8,3,8,4],[8,0,8,2],[9,0,9,2],[10,0,10,2],[1,0,1,2],[1,3,1,6],[22,2,22,3],[20,0,20,1],[18,4,18,6],[11,0,11,2],[12,0,12,2],[14,0,14,2],[17,0,17,2],[18,0,18,3],[21,4,21,5],[19,0,19,1],[15,0,15,2],[16,0,16,2],[19,2,19,3]]}
[{"$f":"Engagés!C1","v":"TENNIS DE TABLE"},null,null,{"$f":"Engagés!C3","v":"TABLEAU B"}]
[{"$f":"Engagés!G6","v":"Poule 9"}]
[null,"NOM","Prénom","Sigle","Vict","Def","Classement"]
[1,{"$f":"VLOOKUP($A4,Engagés!$A$1:$E$379,3,FALSE)","v":"MORO"},{"$f":"VLOOKUP($A4,Engagés!$A$1:$E$379,4,FALSE)","v":"COME"},{"$f":"VLOOKUP($A4,Engagés!$A$1:$E$379,5,FALSE)","v":"75-4-STAP"},null,null,"1er"]
[16,{"$f":"VLOOKUP($A5,Engagés!$A$1:$E$379,3,FALSE)","v":"BRETTES"},{"$f":"VLOOKUP($A5,Engagés!$A$1:$E$379,4,FALSE)","v":"FERDINAND"},{"$f":"VLOOKUP($A5,Engagés!$A$1:$E$379,5,FALSE)","v":"75-2-SPFP"},null,null,"3ème"]
[17,{"$f":"VLOOKUP($A6,Engagés!$A$1:$E$379,3,FALSE)","v":"LE POITTEVIN "},{"$f":"VLOOKUP($A6,Engagés!$A$1:$E$379,4,FALSE)","v":"VADIM"},{"$f":"VLOOKUP($A6,Engagés!$A$1:$E$379,5,FALSE)","v":"75-4-FENP"},null,null,"2ème"]
[32,{"$f":"VLOOKUP($A7,Engagés!$A$1:$E$379,3,FALSE)","v":0},{"$f":"VLOOKUP($A7,Engagés!$A$1:$E$379,4,FALSE)","v":0},{"$f":"VLOOKUP($A7,Engagés!$A$1:$E$379,5,FALSE)","v":0},null,null,"4ème"]
["Si poule de 4 joueurs alors…"]
["Déroulement",null,null,"Joueurs A contre Joueur B",null,"Vainqueur","Score"]
["Match 1",null,null,{"$f":"B4","v":"MORO"},{"$f":"B7","v":0}]
["Match 2",null,null,{"$f":"B5","v":"BRETTES"},{"$f":"B6","v":"LE POITTEVIN "}]
["Finale vainqueur Match 1 contre vainqueur Match 2",null,null,{"$f":"IF(F10=\"\",\"\",F10)","v":""},{"$f":"IF(F11=\"\",\"\",F11)","v":""}]
["Petite finale entre les deux perdants des matchs 1 et 2",null,null,{"$f":"IF(D12=\"\",\"\",IF(D12=D10,E10,D10))","v":""},{"$f":"IF(E12=\"\",\"\",IF(E12=D11,E11,D11))","v":""}]
["Si poule de 3 joueurs alors…"]
["Déroulement",null,null,"Joueurs A contre Joueur B",null,"Vainqueur","Score"]
["Match 1",null,null,{"$f":"B4","v":"MORO"},{"$f":"B6","v":"LE POITTEVIN "},0]
["Match 2",null,null,{"$f":"B5","v":"BRETTES"},{"$f":"B6","v":"LE POITTEVIN "},0]
["Match 3",null,null,{"$f":"B4","v":"MORO"},{"$f":"B5","v":"BRETTES"},0]
["CLASSEMENT",null,null,null,{"$f":"A2","v":"Poule 9"}]
[null,null,"NOM",null,"PRENOM",null,"SIGLE"]
["1er",null,{"$f":"IF($G$4=\"1er\", $B$4,IF($G$5=\"1er\",$B$5,IF($G$6=\"1er\",$B$6,IF($G$7=\"1er\",$B$7,\"\"))))","v":"MORO"},null,{"$f":"IF($G$4=\"1er\", $C$4,IF($G$5=\"1er\",$C$5,IF($G$6=\"1er\",$C$6,IF($G$7=\"1er\",$C$7,\"\"))))","v":"COME"},null,{"$f":"IF($G$4=\"1er\", $D$4,IF($G$5=\"1er\",$D$5,IF($G$6=\"1er\",$D$6,IF($G$7=\"1er\",$D$7,\"\"))))","v":"75-4-STAP"}]
["2ème",null,{"$f":"IF($G$4=\"2ème\", $B$4,IF($G$5=\"2ème\",$B$5,IF($G$6=\"2ème\",$B$6,IF($G$7=\"2ème\",$B$7,\"\"))))","v":"LE POITTEVIN "},null,{"$f":"IF($G$4=\"2ème\", $C$4,IF($G$5=\"2ème\",$C$5,IF($G$6=\"2ème\",$C$6,IF($G$7=\"2ème\",$C$7,\"\"))))","v":"VADIM"},null,{"$f":"IF($G$4=\"2ème\", $D$4,IF($G$5=\"2ème\",$D$5,IF($G$6=\"2ème\",$D$6,IF($G$7=\"2ème\",$D$7,\"\"))))","v":"75-4-FENP"}]
["3ème",null,{"$f":"IF($G$4=\"3ème\", $B$4,IF($G$5=\"3ème\",$B$5,IF($G$6=\"3ème\",$B$6,IF($G$7=\"3ème\",$B$7,\"\"))))","v":"BRETTES"},null,{"$f":"IF($G$4=\"3ème\", $C$4,IF($G$5=\"3ème\",$C$5,IF($G$6=\"3ème\",$C$6,IF($G$7=\"3ème\",$C$7,\"\"))))","v":"FERDINAND"},null,{"$f":"IF($G$4=\"3ème\", $D$4,IF($G$5=\"3ème\",$D$5,IF($G$6=\"3ème\",$D$6,IF($G$7=\"3ème\",$D$7,\"\"))))","v":"75-2-SPFP"}]
["4ème",null,{"$f":"IF($G$4=\"4ème\", $B$4,IF($G$5=\"4ème\",$B$5,IF($G$6=\"4ème\",$B$6,IF($G$7=\"4ème\",$B$7,\"\"))))","v":0},null,{"$f":"IF($G$4=\"4ème\", $C$4,IF($G$5=\"4ème\",$C$5,IF($G$6=\"4ème\",$C$6,IF($G$7=\"4ème\",$C$7,\"\"))))","v":0},null,{"$f":"IF($G$4=\"4ème\", $D$4,IF($G$5=\"4ème\",$D$5,IF($G$6=\"4ème\",$D$6,IF($G$7=\"4ème\",$D$7,\"\"))))","v":0}]

{"sheet":"Poule 10","index":2,"n_rows":24,"n_cols":7,"rows_kept":24,"cut":false,"hidden":false,"merged":[[0,3,0,4],[15,0,15,2],[16,0,16,2],[1,0,1,2],[1,3,1,6],[7,0,7,6],[8,0,8,2],[8,3,8,4],[9,0,9,2],[10,0,10,2],[11,0,11,2],[12,0,12,2],[13,0,13,6],[14,0,14,2],[14,3,14,4],[0,0,0,2],[17,0,17,2],[18,0,18,3],[18,4,18,6],[20,0,20,1],[20,2,20,3],[20,4,20,5],[19,0,19,1],[19,2,19,3],[19,4,19,5],[23,0,23,1],[23,2,23,3],[23,4,23,5],[21,0,21,1],[21,2,21,3],[21,4,21,5],[22,0,22,1],[22,2,22,3],[22,4,22,5]]}
[{"$f":"Engagés!C1","v":"TENNIS DE TABLE"},null,null,{"$f":"Engagés!C3","v":"TABLEAU B"}]
[{"$f":"Engagés!K6","v":"Poule 10"}]
[null,"NOM","Prénom","Sigle","Vict","Def","Classement"]
[2,{"$f":"VLOOKUP($A4,Engagés!$A$1:$E$379,3,FALSE)","v":"CHABREL"},{"$f":"VLOOKUP($A4,Engagés!$A$1:$E$379,4,FALSE)","v":"HUGO"},{"$f":"VLOOKUP($A4,Engagés!$A$1:$E$379,5,FALSE)","v":"75-4-STAP"},null,null,"1er"]
[15,{"$f":"VLOOKUP($A5,Engagés!$A$1:$E$379,3,FALSE)","v":"BEAU"},{"$f":"VLOOKUP($A5,Engagés!$A$1:$E$379,4,FALSE)","v":"GUILHEM"},{"$f":"VLOOKUP($A5,Engagés!$A$1:$E$379,5,FALSE)","v":"75-4-SMPP"},null,null,"3ème"]
[18,{"$f":"VLOOKUP($A6,Engagés!$A$1:$E$379,3,FALSE)","v":"MAZO KOENIG"},{"$f":"VLOOKUP($A6,Engagés!$A$1:$E$379,4,FALSE)","v":"LEOPOLD"},{"$f":"VLOOKUP($A6,Engagés!$A$1:$E$379,5,FALSE)","v":"75-4-PCHP"},null,null,"2ème"]
[31,{"$f":"VLOOKUP($A7,Engagés!$A$1:$E$379,3,FALSE)","v":0},{"$f":"VLOOKUP($A7,Engagés!$A$1:$E$379,4,FALSE)","v":0},{"$f":"VLOOKUP($A7,Engagés!$A$1:$E$379,5,FALSE)","v":0},null,null,"4ème"]
["Si poule de 4 joueurs alors…"]
["Déroulement",null,null,"Joueurs A contre Joueur B",null,"Vainqueur","Score"]
["Match 1",null,null,{"$f":"B4","v":"CHABREL"},{"$f":"B7","v":0}]
["Match 2",null,null,{"$f":"B5","v":"BEAU"},{"$f":"B6","v":"MAZO KOENIG"}]
["Finale vainqueur Match 1 contre vainqueur Match 2",null,null,{"$f":"IF(F10=\"\",\"\",F10)","v":""},{"$f":"IF(F11=\"\",\"\",F11)","v":""}]
["Petite finale entre les deux perdants des matchs 1 et 2",null,null,{"$f":"IF(D12=\"\",\"\",IF(D12=D10,E10,D10))","v":""},{"$f":"IF(E12=\"\",\"\",IF(E12=D11,E11,D11))","v":""}]
["Si poule de 3 joueurs alors…"]
["Déroulement",null,null,"Joueurs A contre Joueur B",null,"Vainqueur","Score"]
["Match 1",null,null,{"$f":"B4","v":"CHABREL"},{"$f":"B6","v":"MAZO KOENIG"},0]
["Match 2",null,null,{"$f":"B5","v":"BEAU"},{"$f":"B6","v":"MAZO KOENIG"},0]
["Match 3",null,null,{"$f":"B4","v":"CHABREL"},{"$f":"B5","v":"BEAU"},0]
["CLASSEMENT",null,null,null,{"$f":"A2","v":"Poule 10"}]
[null,null,"NOM",null,"PRENOM",null,"SIGLE"]
["1er",null,{"$f":"IF($G$4=\"1er\", $B$4,IF($G$5=\"1er\",$B$5,IF($G$6=\"1er\",$B$6,IF($G$7=\"1er\",$B$7,\"\"))))","v":"CHABREL"},null,{"$f":"IF($G$4=\"1er\", $C$4,IF($G$5=\"1er\",$C$5,IF($G$6=\"1er\",$C$6,IF($G$7=\"1er\",$C$7,\"\"))))","v":"HUGO"},null,{"$f":"IF($G$4=\"1er\", $D$4,IF($G$5=\"1er\",$D$5,IF($G$6=\"1er\",$D$6,IF($G$7=\"1er\",$D$7,\"\"))))","v":"75-4-STAP"}]
["2ème",null,{"$f":"IF($G$4=\"2ème\", $B$4,IF($G$5=\"2ème\",$B$5,IF($G$6=\"2ème\",$B$6,IF($G$7=\"2ème\",$B$7,\"\"))))","v":"MAZO KOENIG"},null,{"$f":"IF($G$4=\"2ème\", $C$4,IF($G$5=\"2ème\",$C$5,IF($G$6=\"2ème\",$C$6,IF($G$7=\"2ème\",$C$7,\"\"))))","v":"LEOPOLD"},null,{"$f":"IF($G$4=\"2ème\", $D$4,IF($G$5=\"2ème\",$D$5,IF($G$6=\"2ème\",$D$6,IF($G$7=\"2ème\",$D$7,\"\"))))","v":"75-4-PCHP"}]
["3ème",null,{"$f":"IF($G$4=\"3ème\", $B$4,IF($G$5=\"3ème\",$B$5,IF($G$6=\"3ème\",$B$6,IF($G$7=\"3ème\",$B$7,\"\"))))","v":"BEAU"},null,{"$f":"IF($G$4=\"3ème\", $C$4,IF($G$5=\"3ème\",$C$5,IF($G$6=\"3ème\",$C$6,IF($G$7=\"3ème\",$C$7,\"\"))))","v":"GUILHEM"},null,{"$f":"IF($G$4=\"3ème\", $D$4,IF($G$5=\"3ème\",$D$5,IF($G$6=\"3ème\",$D$6,IF($G$7=\"3ème\",$D$7,\"\"))))","v":"75-4-SMPP"}]
["4ème",null,{"$f":"IF($G$4=\"4ème\", $B$4,IF($G$5=\"4ème\",$B$5,IF($G$6=\"4ème\",$B$6,IF($G$7=\"4ème\",$B$7,\"\"))))","v":0},null,{"$f":"IF($G$4=\"4ème\", $C$4,IF($G$5=\"4ème\",$C$5,IF($G$6=\"4ème\",$C$6,IF($G$7=\"4ème\",$C$7,\"\"))))","v":0},null,{"$f":"IF($G$4=\"4ème\", $D$4,IF($G$5=\"4ème\",$D$5,IF($G$6=\"4ème\",$D$6,IF($G$7=\"4ème\",$D$7,\"\"))))","v":0}]

{"sheet":"Poule 11","index":3,"n_rows":24,"n_cols":7,"rows_kept":24,"cut":false,"hidden":false,"merged":[[0,3,0,4],[15,0,15,2],[16,0,16,2],[1,0,1,2],[1,3,1,6],[7,0,7,6],[8,0,8,2],[8,3,8,4],[9,0,9,2],[10,0,10,2],[11,0,11,2],[12,0,12,2],[13,0,13,6],[14,0,14,2],[14,3,14,4],[0,0,0,2],[17,0,17,2],[18,0,18,3],[18,4,18,6],[20,0,20,1],[20,2,20,3],[20,4,20,5],[19,0,19,1],[19,2,19,3],[19,4,19,5],[23,0,23,1],[23,2,23,3],[23,4,23,5],[21,0,21,1],[21,2,21,3],[21,4,21,5],[22,0,22,1],[22,2,22,3],[22,4,22,5]]}
[{"$f":"Engagés!C1","v":"TENNIS DE TABLE"},null,null,{"$f":"Engagés!C3","v":"TABLEAU B"}]
[{"$f":"Engagés!G12","v":"Poule 11"}]
[null,"NOM","Prénom","Sigle","Vict","Def","Classement"]
[3,{"$f":"VLOOKUP($A4,Engagés!$A$1:$E$379,3,FALSE)","v":"MOLIN"},{"$f":"VLOOKUP($A4,Engagés!$A$1:$E$379,4,FALSE)","v":"BAPTISTE"},{"$f":"VLOOKUP($A4,Engagés!$A$1:$E$379,5,FALSE)","v":"75-4-LMAP"},null,null,"1er"]
[14,{"$f":"VLOOKUP($A5,Engagés!$A$1:$E$379,3,FALSE)","v":"MONS--TOIRON"},{"$f":"VLOOKUP($A5,Engagés!$A$1:$E$379,4,FALSE)","v":"HUGO"},{"$f":"VLOOKUP($A5,Engagés!$A$1:$E$379,5,FALSE)","v":"75-4-BLOP"},null,null,"3ème"]
[19,{"$f":"VLOOKUP($A6,Engagés!$A$1:$E$379,3,FALSE)","v":"FISHER"},{"$f":"VLOOKUP($A6,Engagés!$A$1:$E$379,4,FALSE)","v":"WELLINGTON"},{"$f":"VLOOKUP($A6,Engagés!$A$1:$E$379,5,FALSE)","v":"75-2-SLHP"},null,null,"2ème"]
[30,{"$f":"VLOOKUP($A7,Engagés!$A$1:$E$379,3,FALSE)","v":0},{"$f":"VLOOKUP($A7,Engagés!$A$1:$E$379,4,FALSE)","v":0},{"$f":"VLOOKUP($A7,Engagés!$A$1:$E$379,5,FALSE)","v":0},null,null,"4ème"]
["Si poule de 4 joueurs alors…"]
["Déroulement",null,null,"Joueurs A contre Joueur B",null,"Vainqueur","Score"]
["Match 1",null,null,{"$f":"B4","v":"MOLIN"},{"$f":"B7","v":0}]
["Match 2",null,null,{"$f":"B5","v":"MONS--TOIRON"},{"$f":"B6","v":"FISHER"}]
["Finale vainqueur Match 1 contre vainqueur Match 2",null,null,{"$f":"IF(F10=\"\",\"\",F10)","v":""},{"$f":"IF(F11=\"\",\"\",F11)","v":""}]
["Petite finale entre les deux perdants des matchs 1 et 2",null,null,{"$f":"IF(D12=\"\",\"\",IF(D12=D10,E10,D10))","v":""},{"$f":"IF(E12=\"\",\"\",IF(E12=D11,E11,D11))","v":""}]
["Si poule de 3 joueurs alors…"]
["Déroulement",null,null,"Joueurs A contre Joueur B",null,"Vainqueur","Score"]
["Match 1",null,null,{"$f":"B4","v":"MOLIN"},{"$f":"B6","v":"FISHER"},0]
["Match 2",null,null,{"$f":"B5","v":"MONS--TOIRON"},{"$f":"B6","v":"FISHER"},0]
["Match 3",null,null,{"$f":"B4","v":"MOLIN"},{"$f":"B5","v":"MONS--TOIRON"},0]
["CLASSEMENT",null,null,null,{"$f":"A2","v":"Poule 11"}]
[null,null,"NOM",null,"PRENOM",null,"SIGLE"]
["1er",null,{"$f":"IF($G$4=\"1er\", $B$4,IF($G$5=\"1er\",$B$5,IF($G$6=\"1er\",$B$6,IF($G$7=\"1er\",$B$7,\"\"))))","v":"MOLIN"},null,{"$f":"IF($G$4=\"1er\", $C$4,IF($G$5=\"1er\",$C$5,IF($G$6=\"1er\",$C$6,IF($G$7=\"1er\",$C$7,\"\"))))","v":"BAPTISTE"},null,{"$f":"IF($G$4=\"1er\", $D$4,IF($G$5=\"1er\",$D$5,IF($G$6=\"1er\",$D$6,IF($G$7=\"1er\",$D$7,\"\"))))","v":"75-4-LMAP"}]
["2ème",null,{"$f":"IF($G$4=\"2ème\", $B$4,IF($G$5=\"2ème\",$B$5,IF($G$6=\"2ème\",$B$6,IF($G$7=\"2ème\",$B$7,\"\"))))","v":"FISHER"},null,{"$f":"IF($G$4=\"2ème\", $C$4,IF($G$5=\"2ème\",$C$5,IF($G$6=\"2ème\",$C$6,IF($G$7=\"2ème\",$C$7,\"\"))))","v":"WELLINGTON"},null,{"$f":"IF($G$4=\"2ème\", $D$4,IF($G$5=\"2ème\",$D$5,IF($G$6=\"2ème\",$D$6,IF($G$7=\"2ème\",$D$7,\"\"))))","v":"75-2-SLHP"}]
["3ème",null,{"$f":"IF($G$4=\"3ème\", $B$4,IF($G$5=\"3ème\",$B$5,IF($G$6=\"3ème\",$B$6,IF($G$7=\"3ème\",$B$7,\"\"))))","v":"MONS--TOIRON"},null,{"$f":"IF($G$4=\"3ème\", $C$4,IF($G$5=\"3ème\",$C$5,IF($G$6=\"3ème\",$C$6,IF($G$7=\"3ème\",$C$7,\"\"))))","v":"HUGO"},null,{"$f":"IF($G$4=\"3ème\", $D$4,IF($G$5=\"3ème\",$D$5,IF($G$6=\"3ème\",$D$6,IF($G$7=\"3ème\",$D$7,\"\"))))","v":"75-4-BLOP"}]
["4ème",null,{"$f":"IF($G$4=\"4ème\", $B$4,IF($G$5=\"4ème\",$B$5,IF($G$6=\"4ème\",$B$6,IF($G$7=\"4ème\",$B$7,\"\"))))","v":0},null,{"$f":"IF($G$4=\"4ème\", $C$4,IF($G$5=\"4ème\",$C$5,IF($G$6=\"4ème\",$C$6,IF($G$7=\"4ème\",$C$7,\"\"))))","v":0},null,{"$f":"IF($G$4=\"4ème\", $D$4,IF($G$5=\"4ème\",$D$5,IF($G$6=\"4ème\",$D$6,IF($G$7=\"4ème\",$D$7,\"\"))))","v":0}]

{"sheet":"Poule 12","index":4,"n_rows":24,"n_cols":7,"rows_kept":24,"cut":false,"hidden":false,"merged":[[0,3,0,4],[15,0,15,2],[16,0,16,2],[1,0,1,2],[1,3,1,6],[7,0,7,6],[8,0,8,2],[8,3,8,4],[9,0,9,2],[10,0,10,2],[11,0,11,2],[12,0,12,2],[13,0,13,6],[14,0,14,2],[14,3,14,4],[0,0,0,2],[17,0,17,2],[18,0,18,3],[18,4,18,6],[20,0,20,1],[20,2,20,3],[20,4,20,5],[19,0,19,1],[19,2,19,3],[19,4,19,5],[23,0,23,1],[23,2,23,3],[23,4,23,5],[21,0,21,1],[21,2,21,3],[21,4,21,5],[22,0,22,1],[22,2,22,3],[22,4,22,5]]}
[{"$f":"Engagés!C1","v":"TENNIS DE TABLE"},null,null,{"$f":"Engagés!C3","v":"TABLEAU B"}]
[{"$f":"Engagés!K12","v":"Poule 12"}]
[null,"NOM","Prénom","Sigle","Vict","Def","Classement"]
[4,{"$f":"VLOOKUP($A4,Engagés!$A$1:$E$379,3,FALSE)","v":"ROCHET"},{"$f":"VLOOKUP($A4,Engagés!$A$1:$E$379,4,FALSE)","v":"JEREMY"},{"$f":"VLOOKUP($A4,Engagés!$A$1:$E$379,5,FALSE)","v":"75-4-BLOP"},null,null,"1er"]
[13,{"$f":"VLOOKUP($A5,Engagés!$A$1:$E$379,3,FALSE)","v":"PELAUD"},{"$f":"VLOOKUP($A5,Engagés!$A$1:$E$379,4,FALSE)","v":"PIERRE"},{"$f":"VLOOKUP($A5,Engagés!$A$1:$E$379,5,FALSE)","v":"75-4-PCHP"},null,null,"2ème"]
[20,{"$f":"VLOOKUP($A6,Engagés!$A$1:$E$379,3,FALSE)","v":"ZHANG"},{"$f":"VLOOKUP($A6,Engagés!$A$1:$E$379,4,FALSE)","v":"TONY"},{"$f":"VLOOKUP($A6,Engagés!$A$1:$E$379,5,FALSE)","v":"75-2-SPFP"},null,null,"3ème"]
[29,{"$f":"VLOOKUP($A7,Engagés!$A$1:$E$379,3,FALSE)","v":0},{"$f":"VLOOKUP($A7,Engagés!$A$1:$E$379,4,FALSE)","v":0},{"$f":"VLOOKUP($A7,Engagés!$A$1:$E$379,5,FALSE)","v":0},null,null,"4ème"]
["Si poule de 4 joueurs alors…"]
["Déroulement",null,null,"Joueurs A contre Joueur B",null,"Vainqueur","Score"]
["Match 1",null,null,{"$f":"B4","v":"ROCHET"},{"$f":"B7","v":0},0]
["Match 2",null,null,{"$f":"B5","v":"PELAUD"},{"$f":"B6","v":"ZHANG"},0]
["Finale vainqueur Match 1 contre vainqueur Match 2",null,null,{"$f":"IF(F10=\"\",\"\",F10)","v":0},{"$f":"IF(F11=\"\",\"\",F11)","v":0},0]
["Petite finale entre les deux perdants des matchs 1 et 2",null,null,null,null,0]
["Si poule de 3 joueurs alors…"]
["Déroulement",null,null,"Joueurs A contre Joueur B",null,"Vainqueur","Score"]
["Match 1",null,null,{"$f":"B4","v":"ROCHET"},{"$f":"B6","v":"ZHANG"}]
["Match 2",null,null,{"$f":"B5","v":"PELAUD"},{"$f":"B6","v":"ZHANG"}]
["Match 3",null,null,{"$f":"B4","v":"ROCHET"},{"$f":"B5","v":"PELAUD"}]
["CLASSEMENT",null,null,null,{"$f":"A2","v":"Poule 12"}]
[null,null,"NOM",null,"PRENOM",null,"SIGLE"]
["1er",null,{"$f":"IF($G$4=\"1er\", $B$4,IF($G$5=\"1er\",$B$5,IF($G$6=\"1er\",$B$6,IF($G$7=\"1er\",$B$7,\"\"))))","v":"ROCHET"},null,{"$f":"IF($G$4=\"1er\", $C$4,IF($G$5=\"1er\",$C$5,IF($G$6=\"1er\",$C$6,IF($G$7=\"1er\",$C$7,\"\"))))","v":"JEREMY"},null,{"$f":"IF($G$4=\"1er\", $D$4,IF($G$5=\"1er\",$D$5,IF($G$6=\"1er\",$D$6,IF($G$7=\"1er\",$D$7,\"\"))))","v":"75-4-BLOP"}]
["2ème",null,{"$f":"IF($G$4=\"2ème\", $B$4,IF($G$5=\"2ème\",$B$5,IF($G$6=\"2ème\",$B$6,IF($G$7=\"2ème\",$B$7,\"\"))))","v":"PELAUD"},null,{"$f":"IF($G$4=\"2ème\", $C$4,IF($G$5=\"2ème\",$C$5,IF($G$6=\"2ème\",$C$6,IF($G$7=\"2ème\",$C$7,\"\"))))","v":"PIERRE"},null,{"$f":"IF($G$4=\"2ème\", $D$4,IF($G$5=\"2ème\",$D$5,IF($G$6=\"2ème\",$D$6,IF($G$7=\"2ème\",$D$7,\"\"))))","v":"75-4-PCHP"}]
["3ème",null,{"$f":"IF($G$4=\"3ème\", $B$4,IF($G$5=\"3ème\",$B$5,IF($G$6=\"3ème\",$B$6,IF($G$7=\"3ème\",$B$7,\"\"))))","v":"ZHANG"},null,{"$f":"IF($G$4=\"3ème\", $C$4,IF($G$5=\"3ème\",$C$5,IF($G$6=\"3ème\",$C$6,IF($G$7=\"3ème\",$C$7,\"\"))))","v":"TONY"},null,{"$f":"IF($G$4=\"3ème\", $D$4,IF($G$5=\"3ème\",$D$5,IF($G$6=\"3ème\",$D$6,IF($G$7=\"3ème\",$D$7,\"\"))))","v":"75-2-SPFP"}]
["4ème",null,{"$f":"IF($G$4=\"4ème\", $B$4,IF($G$5=\"4ème\",$B$5,IF($G$6=\"4ème\",$B$6,IF($G$7=\"4ème\",$B$7,\"\"))))","v":0},null,{"$f":"IF($G$4=\"4ème\", $C$4,IF($G$5=\"4ème\",$C$5,IF($G$6=\"4ème\",$C$6,IF($G$7=\"4ème\",$C$7,\"\"))))","v":0},null,{"$f":"IF($G$4=\"4ème\", $D$4,IF($G$5=\"4ème\",$D$5,IF($G$6=\"4ème\",$D$6,IF($G$7=\"4ème\",$D$7,\"\"))))","v":0}]

{"sheet":"Poule 13","index":5,"n_rows":24,"n_cols":7,"rows_kept":24,"cut":false,"hidden":false,"merged":[[12,0,12,2],[13,0,13,6],[0,0,0,2],[0,3,0,4],[10,0,10,2],[11,0,11,2],[1,0,1,2],[1,3,1,6],[7,0,7,6],[8,0,8,2],[8,3,8,4],[9,0,9,2],[20,0,20,1],[20,2,20,3],[20,4,20,5],[14,0,14,2],[14,3,14,4],[15,0,15,2],[18,4,18,6],[19,0,19,1],[19,2,19,3],[19,4,19,5],[16,0,16,2],[17,0,17,2],[18,0,18,3],[23,0,23,1],[23,2,23,3],[23,4,23,5],[21,0,21,1],[21,2,21,3],[21,4,21,5],[22,0,22,1],[22,2,22,3],[22,4,22,5]]}
[{"$f":"Engagés!C1","v":"TENNIS DE TABLE"},null,null,{"$f":"Engagés!C3","v":"TABLEAU B"}]
[{"$f":"Engagés!G18","v":"Poule 13"}]
[null,"NOM","Prénom","Sigle","Vict","Def","Classement"]
[5,{"$f":"VLOOKUP($A4,Engagés!$A$1:$E$379,3,FALSE)","v":"FRANC"},{"$f":"VLOOKUP($A4,Engagés!$A$1:$E$379,4,FALSE)","v":"GASPARD"},{"$f":"VLOOKUP($A4,Engagés!$A$1:$E$379,5,FALSE)","v":"75-4-LMAP"},null,null,"1er"]
[12,{"$f":"VLOOKUP($A5,Engagés!$A$1:$E$379,3,FALSE)","v":"VUILLET"},{"$f":"VLOOKUP($A5,Engagés!$A$1:$E$379,4,FALSE)","v":"OSCAR"},{"$f":"VLOOKUP($A5,Engagés!$A$1:$E$379,5,FALSE)","v":"75-2-SUPA"},null,null,"2ème"]
[21,{"$f":"VLOOKUP($A6,Engagés!$A$1:$E$379,3,FALSE)","v":"HISPA"},{"$f":"VLOOKUP($A6,Engagés!$A$1:$E$379,4,FALSE)","v":"RUBEN"},{"$f":"VLOOKUP($A6,Engagés!$A$1:$E$379,5,FALSE)","v":"75-4-FENP"},null,null,"3ème"]
[28,{"$f":"VLOOKUP($A7,Engagés!$A$1:$E$379,3,FALSE)","v":0},{"$f":"VLOOKUP($A7,Engagés!$A$1:$E$379,4,FALSE)","v":0},{"$f":"VLOOKUP($A7,Engagés!$A$1:$E$379,5,FALSE)","v":0},null,null,"4ème"]
["Si poule de 4 joueurs alors…"]
["Déroulement",null,null,"Joueurs A contre Joueur B",null,"Vainqueur","Score"]
["Match 1",null,null,{"$f":"B4","v":"FRANC"},{"$f":"B7","v":0},0]
["Match 2",null,null,{"$f":"B5","v":"VUILLET"},{"$f":"B6","v":"HISPA"},0]
["Finale vainqueur Match 1 contre vainqueur Match 2",null,null,{"$f":"IF(F10=\"\",\"\",F10)","v":0},{"$f":"IF(F11=\"\",\"\",F11)","v":0},0]
["Petite finale entre les deux perdants des matchs 1 et 2",null,null,null,null,0]
["Si poule de 3 joueurs alors…"]
["Déroulement",null,null,"Joueurs A contre Joueur B",null,"Vainqueur","Score"]
["Match 1",null,null,{"$f":"B4","v":"FRANC"},{"$f":"B6","v":"HISPA"}]
["Match 2",null,null,{"$f":"B5","v":"VUILLET"},{"$f":"B6","v":"HISPA"}]
["Match 3",null,null,{"$f":"B4","v":"FRANC"},{"$f":"B5","v":"VUILLET"}]
["CLASSEMENT",null,null,null,{"$f":"A2","v":"Poule 13"}]
[null,null,"NOM",null,"PRENOM",null,"SIGLE"]
["1er",null,{"$f":"IF($G$4=\"1er\", $B$4,IF($G$5=\"1er\",$B$5,IF($G$6=\"1er\",$B$6,IF($G$7=\"1er\",$B$7,\"\"))))","v":"FRANC"},null,{"$f":"IF($G$4=\"1er\", $C$4,IF($G$5=\"1er\",$C$5,IF($G$6=\"1er\",$C$6,IF($G$7=\"1er\",$C$7,\"\"))))","v":"GASPARD"},null,{"$f":"IF($G$4=\"1er\", $D$4,IF($G$5=\"1er\",$D$5,IF($G$6=\"1er\",$D$6,IF($G$7=\"1er\",$D$7,\"\"))))","v":"75-4-LMAP"}]
["2ème",null,{"$f":"IF($G$4=\"2ème\", $B$4,IF($G$5=\"2ème\",$B$5,IF($G$6=\"2ème\",$B$6,IF($G$7=\"2ème\",$B$7,\"\"))))","v":"VUILLET"},null,{"$f":"IF($G$4=\"2ème\", $C$4,IF($G$5=\"2ème\",$C$5,IF($G$6=\"2ème\",$C$6,IF($G$7=\"2ème\",$C$7,\"\"))))","v":"OSCAR"},null,{"$f":"IF($G$4=\"2ème\", $D$4,IF($G$5=\"2ème\",$D$5,IF($G$6=\"2ème\",$D$6,IF($G$7=\"2ème\",$D$7,\"\"))))","v":"75-2-SUPA"}]
["3ème",null,{"$f":"IF($G$4=\"3ème\", $B$4,IF($G$5=\"3ème\",$B$5,IF($G$6=\"3ème\",$B$6,IF($G$7=\"3ème\",$B$7,\"\"))))","v":"HISPA"},null,{"$f":"IF($G$4=\"3ème\", $C$4,IF($G$5=\"3ème\",$C$5,IF($G$6=\"3ème\",$C$6,IF($G$7=\"3ème\",$C$7,\"\"))))","v":"RUBEN"},null,{"$f":"IF($G$4=\"3ème\", $D$4,IF($G$5=\"3ème\",$D$5,IF($G$6=\"3ème\",$D$6,IF($G$7=\"3ème\",$D$7,\"\"))))","v":"75-4-FENP"}]
["4ème",null,{"$f":"IF($G$4=\"4ème\", $B$4,IF($G$5=\"4ème\",$B$5,IF($G$6=\"4ème\",$B$6,IF($G$7=\"4ème\",$B$7,\"\"))))","v":0},null,{"$f":"IF($G$4=\"4ème\", $C$4,IF($G$5=\"4ème\",$C$5,IF($G$6=\"4ème\",$C$6,IF($G$7=\"4ème\",$C$7,\"\"))))","v":0},null,{"$f":"IF($G$4=\"4ème\", $D$4,IF($G$5=\"4ème\",$D$5,IF($G$6=\"4ème\",$D$6,IF($G$7=\"4ème\",$D$7,\"\"))))","v":0}]

{"sheet":"Poule 14","index":6,"n_rows":24,"n_cols":7,"rows_kept":24,"cut":false,"hidden":false,"merged":[[12,0,12,2],[13,0,13,6],[0,0,0,2],[0,3,0,4],[10,0,10,2],[11,0,11,2],[1,0,1,2],[1,3,1,6],[7,0,7,6],[8,0,8,2],[8,3,8,4],[9,0,9,2],[20,0,20,1],[20,2,20,3],[20,4,20,5],[14,0,14,2],[14,3,14,4],[15,0,15,2],[18,4,18,6],[19,0,19,1],[19,2,19,3],[19,4,19,5],[16,0,16,2],[17,0,17,2],[18,0,18,3],[23,0,23,1],[23,2,23,3],[23,4,23,5],[21,0,21,1],[21,2,21,3],[21,4,21,5],[22,0,22,1],[22,2,22,3],[22,4,22,5]]}
[{"$f":"Engagés!C1","v":"TENNIS DE TABLE"},null,null,{"$f":"Engagés!C3","v":"TABLEAU B"}]
[{"$f":"Engagés!K18","v":"Poule 14"}]
[null,"NOM","Prénom","Sigle","Vict","Def","Classement"]
[6,{"$f":"VLOOKUP($A4,Engagés!$A$1:$E$379,3,FALSE)","v":"RABAUT"},{"$f":"VLOOKUP($A4,Engagés!$A$1:$E$379,4,FALSE)","v":"MAXENCE"},{"$f":"VLOOKUP($A4,Engagés!$A$1:$E$379,5,FALSE)","v":"75-4-PCHP"},null,null,"1er"]
[11,{"$f":"VLOOKUP($A5,Engagés!$A$1:$E$379,3,FALSE)","v":0},{"$f":"VLOOKUP($A5,Engagés!$A$1:$E$379,4,FALSE)","v":0},{"$f":"VLOOKUP($A5,Engagés!$A$1:$E$379,5,FALSE)","v":0},null,null,"3ème"]
[22,{"$f":"VLOOKUP($A6,Engagés!$A$1:$E$379,3,FALSE)","v":"GODOUET"},{"$f":"VLOOKUP($A6,Engagés!$A$1:$E$379,4,FALSE)","v":"MAXIME"},{"$f":"VLOOKUP($A6,Engagés!$A$1:$E$379,5,FALSE)","v":"75-4-LMAP"},null,null,"2ème"]
[27,{"$f":"VLOOKUP($A7,Engagés!$A$1:$E$379,3,FALSE)","v":0},{"$f":"VLOOKUP($A7,Engagés!$A$1:$E$379,4,FALSE)","v":0},{"$f":"VLOOKUP($A7,Engagés!$A$1:$E$379,5,FALSE)","v":0},null,null,"4ème"]
["Si poule de 4 joueurs alors…"]
["Déroulement",null,null,"Joueurs A contre Joueur B",null,"Vainqueur","Score"]
["Match 1",null,null,{"$f":"B4","v":"RABAUT"},{"$f":"B7","v":0},0]
["Match 2",null,null,{"$f":"B5","v":0},{"$f":"B6","v":"GODOUET"},0]
["Finale vainqueur Match 1 contre vainqueur Match 2",null,null,{"$f":"IF(F10=\"\",\"\",F10)","v":0},{"$f":"IF(F11=\"\",\"\",F11)","v":0},0]
["Petite finale entre les deux perdants des matchs 1 et 2",null,null,null,null,0]
["Si poule de 3 joueurs alors…"]
["Déroulement",null,null,"Joueurs A contre Joueur B",null,"Vainqueur","Score"]
["Match 1",null,null,{"$f":"B4","v":"RABAUT"},{"$f":"B6","v":"GODOUET"}]
["Match 2",null,null,{"$f":"B5","v":0},{"$f":"B6","v":"GODOUET"}]
["Match 3",null,null,{"$f":"B4","v":"RABAUT"},{"$f":"B5","v":0}]
["CLASSEMENT",null,null,null,{"$f":"A2","v":"Poule 14"}]
[null,null,"NOM",null,"PRENOM",null,"SIGLE"]
["1er",null,{"$f":"IF($G$4=\"1er\", $B$4,IF($G$5=\"1er\",$B$5,IF($G$6=\"1er\",$B$6,IF($G$7=\"1er\",$B$7,\"\"))))","v":"RABAUT"},null,{"$f":"IF($G$4=\"1er\", $C$4,IF($G$5=\"1er\",$C$5,IF($G$6=\"1er\",$C$6,IF($G$7=\"1er\",$C$7,\"\"))))","v":"MAXENCE"},null,{"$f":"IF($G$4=\"1er\", $D$4,IF($G$5=\"1er\",$D$5,IF($G$6=\"1er\",$D$6,IF($G$7=\"1er\",$D$7,\"\"))))","v":"75-4-PCHP"}]
["2ème",null,{"$f":"IF($G$4=\"2ème\", $B$4,IF($G$5=\"2ème\",$B$5,IF($G$6=\"2ème\",$B$6,IF($G$7=\"2ème\",$B$7,\"\"))))","v":"GODOUET"},null,{"$f":"IF($G$4=\"2ème\", $C$4,IF($G$5=\"2ème\",$C$5,IF($G$6=\"2ème\",$C$6,IF($G$7=\"2ème\",$C$7,\"\"))))","v":"MAXIME"},null,{"$f":"IF($G$4=\"2ème\", $D$4,IF($G$5=\"2ème\",$D$5,IF($G$6=\"2ème\",$D$6,IF($G$7=\"2ème\",$D$7,\"\"))))","v":"75-4-LMAP"}]
["3ème",null,{"$f":"IF($G$4=\"3ème\", $B$4,IF($G$5=\"3ème\",$B$5,IF($G$6=\"3ème\",$B$6,IF($G$7=\"3ème\",$B$7,\"\"))))","v":0},null,{"$f":"IF($G$4=\"3ème\", $C$4,IF($G$5=\"3ème\",$C$5,IF($G$6=\"3ème\",$C$6,IF($G$7=\"3ème\",$C$7,\"\"))))","v":0},null,{"$f":"IF($G$4=\"3ème\", $D$4,IF($G$5=\"3ème\",$D$5,IF($G$6=\"3ème\",$D$6,IF($G$7=\"3ème\",$D$7,\"\"))))","v":0}]
["4ème",null,{"$f":"IF($G$4=\"4ème\", $B$4,IF($G$5=\"4ème\",$B$5,IF($G$6=\"4ème\",$B$6,IF($G$7=\"4ème\",$B$7,\"\"))))","v":0},null,{"$f":"IF($G$4=\"4ème\", $C$4,IF($G$5=\"4ème\",$C$5,IF($G$6=\"4ème\",$C$6,IF($G$7=\"4ème\",$C$7,\"\"))))","v":0},null,{"$f":"IF($G$4=\"4ème\", $D$4,IF($G$5=\"4ème\",$D$5,IF($G$6=\"4ème\",$D$6,IF($G$7=\"4ème\",$D$7,\"\"))))","v":0}]

{"sheet":"Poule 15","index":7,"n_rows":24,"n_cols":7,"rows_kept":24,"cut":false,"hidden":false,"merged":[[12,0,12,2],[13,0,13,6],[0,0,0,2],[0,3,0,4],[10,0,10,2],[11,0,11,2],[1,0,1,2],[1,3,1,6],[7,0,7,6],[8,0,8,2],[8,3,8,4],[9,0,9,2],[20,0,20,1],[20,2,20,3],[20,4,20,5],[14,0,14,2],[14,3,14,4],[15,0,15,2],[18,4,18,6],[19,0,19,1],[19,2,19,3],[19,4,19,5],[16,0,16,2],[17,0,17,2],[18,0,18,3],[23,0,23,1],[23,2,23,3],[23,4,23,5],[21,0,21,1],[21,2,21,3],[21,4,21,5],[22,0,22,1],[22,2,22,3],[22,4,22,5]]}
[{"$f":"Engagés!C1","v":"TENNIS DE TABLE"},null,null,{"$f":"Engagés!C3","v":"TABLEAU B"}]
[{"$f":"Engagés!G24","v":"Poule 15"}]
[null,"NOM","Prénom","Sigle","Vict","Def","Classement"]
[7,{"$f":"VLOOKUP($A4,Engagés!$A$1:$E$379,3,FALSE)","v":"CHOMIENNE"},{"$f":"VLOOKUP($A4,Engagés!$A$1:$E$379,4,FALSE)","v":"ELOI"},{"$f":"VLOOKUP($A4,Engagés!$A$1:$E$379,5,FALSE)","v":"75-4-STAP"},null,null,"1er"]
[10,{"$f":"VLOOKUP($A5,Engagés!$A$1:$E$379,3,FALSE)","v":"ERDEM"},{"$f":"VLOOKUP($A5,Engagés!$A$1:$E$379,4,FALSE)","v":"EDIS"},{"$f":"VLOOKUP($A5,Engagés!$A$1:$E$379,5,FALSE)","v":"75-2-SLHP"},null,null,"3ème"]
[23,{"$f":"VLOOKUP($A6,Engagés!$A$1:$E$379,3,FALSE)","v":"ZARAYA"},{"$f":"VLOOKUP($A6,Engagés!$A$1:$E$379,4,FALSE)","v":"SIMON"},{"$f":"VLOOKUP($A6,Engagés!$A$1:$E$379,5,FALSE)","v":"75-4-LMAP"},null,null,"2ème"]
[26,{"$f":"VLOOKUP($A7,Engagés!$A$1:$E$379,3,FALSE)","v":0},{"$f":"VLOOKUP($A7,Engagés!$A$1:$E$379,4,FALSE)","v":0},{"$f":"VLOOKUP($A7,Engagés!$A$1:$E$379,5,FALSE)","v":0},null,null,"4ème"]
["Si poule de 4 joueurs alors…"]
["Déroulement",null,null,"Joueurs A contre Joueur B",null,"Vainqueur","Score"]
["Match 1",null,null,{"$f":"B4","v":"CHOMIENNE"},{"$f":"B7","v":0},0]
["Match 2",null,null,{"$f":"B5","v":"ERDEM"},{"$f":"B6","v":"ZARAYA"},0]
["Finale vainqueur Match 1 contre vainqueur Match 2",null,null,{"$f":"IF(F10=\"\",\"\",F10)","v":0},{"$f":"IF(F11=\"\",\"\",F11)","v":0},0]
["Petite finale entre les deux perdants des matchs 1 et 2",null,null,null,null,0]
["Si poule de 3 joueurs alors…"]
["Déroulement",null,null,"Joueurs A contre Joueur B",null,"Vainqueur","Score"]
["Match 1",null,null,{"$f":"B4","v":"CHOMIENNE"},{"$f":"B6","v":"ZARAYA"}]
["Match 2",null,null,{"$f":"B5","v":"ERDEM"},{"$f":"B6","v":"ZARAYA"}]
["Match 3",null,null,{"$f":"B4","v":"CHOMIENNE"},{"$f":"B5","v":"ERDEM"}]
["CLASSEMENT",null,null,null,{"$f":"A2","v":"Poule 15"}]
[null,null,"NOM",null,"PRENOM",null,"SIGLE"]
["1er",null,{"$f":"IF($G$4=\"1er\", $B$4,IF($G$5=\"1er\",$B$5,IF($G$6=\"1er\",$B$6,IF($G$7=\"1er\",$B$7,\"\"))))","v":"CHOMIENNE"},null,{"$f":"IF($G$4=\"1er\", $C$4,IF($G$5=\"1er\",$C$5,IF($G$6=\"1er\",$C$6,IF($G$7=\"1er\",$C$7,\"\"))))","v":"ELOI"},null,{"$f":"IF($G$4=\"1er\", $D$4,IF($G$5=\"1er\",$D$5,IF($G$6=\"1er\",$D$6,IF($G$7=\"1er\",$D$7,\"\"))))","v":"75-4-STAP"}]
["2ème",null,{"$f":"IF($G$4=\"2ème\", $B$4,IF($G$5=\"2ème\",$B$5,IF($G$6=\"2ème\",$B$6,IF($G$7=\"2ème\",$B$7,\"\"))))","v":"ZARAYA"},null,{"$f":"IF($G$4=\"2ème\", $C$4,IF($G$5=\"2ème\",$C$5,IF($G$6=\"2ème\",$C$6,IF($G$7=\"2ème\",$C$7,\"\"))))","v":"SIMON"},null,{"$f":"IF($G$4=\"2ème\", $D$4,IF($G$5=\"2ème\",$D$5,IF($G$6=\"2ème\",$D$6,IF($G$7=\"2ème\",$D$7,\"\"))))","v":"75-4-LMAP"}]
["3ème",null,{"$f":"IF($G$4=\"3ème\", $B$4,IF($G$5=\"3ème\",$B$5,IF($G$6=\"3ème\",$B$6,IF($G$7=\"3ème\",$B$7,\"\"))))","v":"ERDEM"},null,{"$f":"IF($G$4=\"3ème\", $C$4,IF($G$5=\"3ème\",$C$5,IF($G$6=\"3ème\",$C$6,IF($G$7=\"3ème\",$C$7,\"\"))))","v":"EDIS"},null,{"$f":"IF($G$4=\"3ème\", $D$4,IF($G$5=\"3ème\",$D$5,IF($G$6=\"3ème\",$D$6,IF($G$7=\"3ème\",$D$7,\"\"))))","v":"75-2-SLHP"}]
["4ème",null,{"$f":"IF($G$4=\"4ème\", $B$4,IF($G$5=\"4ème\",$B$5,IF($G$6=\"4ème\",$B$6,IF($G$7=\"4ème\",$B$7,\"\"))))","v":0},null,{"$f":"IF($G$4=\"4ème\", $C$4,IF($G$5=\"4ème\",$C$5,IF($G$6=\"4ème\",$C$6,IF($G$7=\"4ème\",$C$7,\"\"))))","v":0},null,{"$f":"IF($G$4=\"4ème\", $D$4,IF($G$5=\"4ème\",$D$5,IF($G$6=\"4ème\",$D$6,IF($G$7=\"4ème\",$D$7,\"\"))))","v":0}]

{"sheet":"Poule 16","index":8,"n_rows":24,"n_cols":7,"rows_kept":24,"cut":false,"hidden":false,"merged":[[12,0,12,2],[13,0,13,6],[0,0,0,2],[0,3,0,4],[10,0,10,2],[11,0,11,2],[1,0,1,2],[1,3,1,6],[7,0,7,6],[8,0,8,2],[8,3,8,4],[9,0,9,2],[20,0,20,1],[20,2,20,3],[20,4,20,5],[14,0,14,2],[14,3,14,4],[15,0,15,2],[18,4,18,6],[19,0,19,1],[19,2,19,3],[19,4,19,5],[16,0,16,2],[17,0,17,2],[18,0,18,3],[23,0,23,1],[23,2,23,3],[23,4,23,5],[21,0,21,1],[21,2,21,3],[21,4,21,5],[22,0,22,1],[22,2,22,3],[22,4,22,5]]}
[{"$f":"Engagés!C1","v":"TENNIS DE TABLE"},null,null,{"$f":"Engagés!C3","v":"TABLEAU B"}]
[{"$f":"Engagés!K24","v":"Poule 16"}]
[null,"NOM","Prénom","Sigle","Vict","Def","Classement"]
[8,{"$f":"VLOOKUP($A4,Engagés!$A$1:$E$379,3,FALSE)","v":"ELKOUBY"},{"$f":"VLOOKUP($A4,Engagés!$A$1:$E$379,4,FALSE)","v":"DAN"},{"$f":"VLOOKUP($A4,Engagés!$A$1:$E$379,5,FALSE)","v":"75-4-SMPP"},null,null,"2ème"]
[9,{"$f":"VLOOKUP($A5,Engagés!$A$1:$E$379,3,FALSE)","v":"MARCOTTE DE QUIVIERES"},{"$f":"VLOOKUP($A5,Engagés!$A$1:$E$379,4,FALSE)","v":"VICTOR"},{"$f":"VLOOKUP($A5,Engagés!$A$1:$E$379,5,FALSE)","v":"75-4-LMAP"},null,null,"1er"]
[24,{"$f":"VLOOKUP($A6,Engagés!$A$1:$E$379,3,FALSE)","v":"OZANNE"},{"$f":"VLOOKUP($A6,Engagés!$A$1:$E$379,4,FALSE)","v":"ROBIN"},{"$f":"VLOOKUP($A6,Engagés!$A$1:$E$379,5,FALSE)","v":"75-2-NDLP"},null,null,"3ème"]
[25,{"$f":"VLOOKUP($A7,Engagés!$A$1:$E$379,3,FALSE)","v":0},{"$f":"VLOOKUP($A7,Engagés!$A$1:$E$379,4,FALSE)","v":0},{"$f":"VLOOKUP($A7,Engagés!$A$1:$E$379,5,FALSE)","v":0},null,null,"4ème"]
["Si poule de 4 joueurs alors…"]
["Déroulement",null,null,"Joueurs A contre Joueur B",null,"Vainqueur","Score"]
["Match 1",null,null,{"$f":"B4","v":"ELKOUBY"},{"$f":"B7","v":0},0]
["Match 2",null,null,{"$f":"B5","v":"MARCOTTE DE QUIVIERES"},{"$f":"B6","v":"OZANNE"},0]
["Finale vainqueur Match 1 contre vainqueur Match 2",null,null,{"$f":"IF(F10=\"\",\"\",F10)","v":0},{"$f":"IF(F11=\"\",\"\",F11)","v":0},0]
["Petite finale entre les deux perdants des matchs 1 et 2",null,null,null,null,0]
["Si poule de 3 joueurs alors…"]
["Déroulement",null,null,"Joueurs A contre Joueur B",null,"Vainqueur","Score"]
["Match 1",null,null,{"$f":"B4","v":"ELKOUBY"},{"$f":"B6","v":"OZANNE"}]
["Match 2",null,null,{"$f":"B5","v":"MARCOTTE DE QUIVIERES"},{"$f":"B6","v":"OZANNE"}]
["Match 3",null,null,{"$f":"B4","v":"ELKOUBY"},{"$f":"B5","v":"MARCOTTE DE QUIVIERES"}]
["CLASSEMENT",null,null,null,{"$f":"A2","v":"Poule 16"}]
[null,null,"NOM",null,"PRENOM",null,"SIGLE"]
["1er",null,{"$f":"IF($G$4=\"1er\", $B$4,IF($G$5=\"1er\",$B$5,IF($G$6=\"1er\",$B$6,IF($G$7=\"1er\",$B$7,\"\"))))","v":"MARCOTTE DE QUIVIERES"},null,{"$f":"IF($G$4=\"1er\", $C$4,IF($G$5=\"1er\",$C$5,IF($G$6=\"1er\",$C$6,IF($G$7=\"1er\",$C$7,\"\"))))","v":"VICTOR"},null,{"$f":"IF($G$4=\"1er\", $D$4,IF($G$5=\"1er\",$D$5,IF($G$6=\"1er\",$D$6,IF($G$7=\"1er\",$D$7,\"\"))))","v":"75-4-LMAP"}]
["2ème",null,{"$f":"IF($G$4=\"2ème\", $B$4,IF($G$5=\"2ème\",$B$5,IF($G$6=\"2ème\",$B$6,IF($G$7=\"2ème\",$B$7,\"\"))))","v":"ELKOUBY"},null,{"$f":"IF($G$4=\"2ème\", $C$4,IF($G$5=\"2ème\",$C$5,IF($G$6=\"2ème\",$C$6,IF($G$7=\"2ème\",$C$7,\"\"))))","v":"DAN"},null,{"$f":"IF($G$4=\"2ème\", $D$4,IF($G$5=\"2ème\",$D$5,IF($G$6=\"2ème\",$D$6,IF($G$7=\"2ème\",$D$7,\"\"))))","v":"75-4-SMPP"}]
["3ème",null,{"$f":"IF($G$4=\"3ème\", $B$4,IF($G$5=\"3ème\",$B$5,IF($G$6=\"3ème\",$B$6,IF($G$7=\"3ème\",$B$7,\"\"))))","v":"OZANNE"},null,{"$f":"IF($G$4=\"3ème\", $C$4,IF($G$5=\"3ème\",$C$5,IF($G$6=\"3ème\",$C$6,IF($G$7=\"3ème\",$C$7,\"\"))))","v":"ROBIN"},null,{"$f":"IF($G$4=\"3ème\", $D$4,IF($G$5=\"3ème\",$D$5,IF($G$6=\"3ème\",$D$6,IF($G$7=\"3ème\",$D$7,\"\"))))","v":"75-2-NDLP"}]
["4ème",null,{"$f":"IF($G$4=\"4ème\", $B$4,IF($G$5=\"4ème\",$B$5,IF($G$6=\"4ème\",$B$6,IF($G$7=\"4ème\",$B$7,\"\"))))","v":0},null,{"$f":"IF($G$4=\"4ème\", $C$4,IF($G$5=\"4ème\",$C$5,IF($G$6=\"4ème\",$C$6,IF($G$7=\"4ème\",$C$7,\"\"))))","v":0},null,{"$f":"IF($G$4=\"4ème\", $D$4,IF($G$5=\"4ème\",$D$5,IF($G$6=\"4ème\",$D$6,IF($G$7=\"4ème\",$D$7,\"\"))))","v":0}]

{"sheet":"Résultats de poule","index":9,"n_rows":10,"n_cols":16,"rows_kept":10,"cut":false,"hidden":false,"merged":[[0,0,0,3],[0,4,0,7],[0,8,0,11],[0,12,0,15],[5,0,5,3],[5,4,5,7],[5,8,5,11],[5,12,5,15]]}
[{"$f":"Engagés!G6","v":"Poule 9"},null,null,null,{"$f":"Engagés!K6","v":"Poule 10"},null,null,null,{"$f":"Engagés!G12","v":"Poule 11"},null,null,null,{"$f":"Engagés!K12","v":"Poule 12"}]
["1er",{"$f":"'Poule 9'!$C21","v":"MORO"},{"$f":"'Poule 9'!$E21","v":"COME"},{"$f":"'Poule 9'!$G21","v":"75-4-STAP"},"1er",{"$f":"'Poule 10'!$C21","v":"CHABREL"},{"$f":"'Poule 10'!$E21","v":"HUGO"},{"$f":"'Poule 10'!$G21","v":"75-4-STAP"},"1er",{"$f":"'Poule 11'!$C21","v":"MOLIN"},{"$f":"'Poule 11'!$E21","v":"BAPTISTE"},{"$f":"'Poule 11'!$G21","v":"75-4-LMAP"},"1er",{"$f":"'Poule 12'!$C21","v":"ROCHET"},{"$f":"'Poule 12'!$E21","v":"JEREMY"},{"$f":"'Poule 12'!$G21","v":"75-4-BLOP"}]
["2ème",{"$f":"'Poule 9'!$C22","v":"LE POITTEVIN "},{"$f":"'Poule 9'!$E22","v":"VADIM"},{"$f":"'Poule 9'!$G22","v":"75-4-FENP"},"2ème",{"$f":"'Poule 10'!$C22","v":"MAZO KOENIG"},{"$f":"'Poule 10'!$E22","v":"LEOPOLD"},{"$f":"'Poule 10'!$G22","v":"75-4-PCHP"},"2ème",{"$f":"'Poule 11'!$C22","v":"FISHER"},{"$f":"'Poule 11'!$E22","v":"WELLINGTON"},{"$f":"'Poule 11'!$G22","v":"75-2-SLHP"},"2ème",{"$f":"'Poule 12'!$C22","v":"PELAUD"},{"$f":"'Poule 12'!$E22","v":"PIERRE"},{"$f":"'Poule 12'!$G22","v":"75-4-PCHP"}]
["3ème",{"$f":"'Poule 9'!$C23","v":"BRETTES"},{"$f":"'Poule 9'!$E23","v":"FERDINAND"},{"$f":"'Poule 9'!$G23","v":"75-2-SPFP"},"3ème",{"$f":"'Poule 10'!$C23","v":"BEAU"},{"$f":"'Poule 10'!$E23","v":"GUILHEM"},{"$f":"'Poule 10'!$G23","v":"75-4-SMPP"},"3ème",{"$f":"'Poule 11'!$C23","v":"MONS--TOIRON"},{"$f":"'Poule 11'!$E23","v":"HUGO"},{"$f":"'Poule 11'!$G23","v":"75-4-BLOP"},"3ème",{"$f":"'Poule 12'!$C23","v":"ZHANG"},{"$f":"'Poule 12'!$E23","v":"TONY"},{"$f":"'Poule 12'!$G23","v":"75-2-SPFP"}]
["4ème",{"$f":"'Poule 9'!$C24","v":0},{"$f":"'Poule 9'!$E24","v":0},{"$f":"'Poule 9'!$G24","v":0},"4ème",{"$f":"'Poule 10'!$C24","v":0},{"$f":"'Poule 10'!$E24","v":0},{"$f":"'Poule 10'!$G24","v":0},"4ème",{"$f":"'Poule 11'!$C24","v":0},{"$f":"'Poule 11'!$E24","v":0},{"$f":"'Poule 11'!$G24","v":0},"4ème",{"$f":"'Poule 12'!$C24","v":0},{"$f":"'Poule 12'!$E24","v":0},{"$f":"'Poule 12'!$G24","v":0}]
[{"$f":"Engagés!G18","v":"Poule 13"},null,null,null,{"$f":"Engagés!K18","v":"Poule 14"},null,null,null,{"$f":"Engagés!G24","v":"Poule 15"},null,null,null,{"$f":"Engagés!K24","v":"Poule 16"}]
["1er",{"$f":"'Poule 13'!$C21","v":"FRANC"},{"$f":"'Poule 13'!$E21","v":"GASPARD"},{"$f":"'Poule 13'!$G21","v":"75-4-LMAP"},"1er",{"$f":"'Poule 14'!$C21","v":"RABAUT"},{"$f":"'Poule 14'!$E21","v":"MAXENCE"},{"$f":"'Poule 14'!$G21","v":"75-4-PCHP"},"1er",{"$f":"'Poule 15'!$C21","v":"CHOMIENNE"},{"$f":"'Poule 15'!$E21","v":"ELOI"},{"$f":"'Poule 15'!$G21","v":"75-4-STAP"},"1er",{"$f":"'Poule 16'!$C21","v":"MARCOTTE DE QUIVIERES"},{"$f":"'Poule 16'!$E21","v":"VICTOR"},{"$f":"'Poule 16'!$G21","v":"75-4-LMAP"}]
["2ème",{"$f":"'Poule 13'!$C22","v":"VUILLET"},{"$f":"'Poule 13'!$E22","v":"OSCAR"},{"$f":"'Poule 13'!$G22","v":"75-2-SUPA"},"2ème",{"$f":"'Poule 14'!$C22","v":"GODOUET"},{"$f":"'Poule 14'!$E22","v":"MAXIME"},{"$f":"'Poule 14'!$G22","v":"75-4-LMAP"},"2ème",{"$f":"'Poule 15'!$C22","v":"ZARAYA"},{"$f":"'Poule 15'!$E22","v":"SIMON"},{"$f":"'Poule 15'!$G22","v":"75-4-LMAP"},"2ème",{"$f":"'Poule 16'!$C22","v":"ELKOUBY"},{"$f":"'Poule 16'!$E22","v":"DAN"},{"$f":"'Poule 16'!$G22","v":"75-4-SMPP"}]
["3ème",{"$f":"'Poule 13'!$C23","v":"HISPA"},{"$f":"'Poule 13'!$E23","v":"RUBEN"},{"$f":"'Poule 13'!$G23","v":"75-4-FENP"},"3ème",{"$f":"'Poule 14'!$C23","v":0},{"$f":"'Poule 14'!$E23","v":0},{"$f":"'Poule 14'!$G23","v":0},"3ème",{"$f":"'Poule 15'!$C23","v":"ERDEM"},{"$f":"'Poule 15'!$E23","v":"EDIS"},{"$f":"'Poule 15'!$G23","v":"75-2-SLHP"},"3ème",{"$f":"'Poule 16'!$C23","v":"OZANNE"},{"$f":"'Poule 16'!$E23","v":"ROBIN"},{"$f":"'Poule 16'!$G23","v":"75-2-NDLP"}]
["4ème",{"$f":"'Poule 13'!$C24","v":0},{"$f":"'Poule 13'!$E24","v":0},{"$f":"'Poule 13'!$G24","v":0},"4ème",{"$f":"'Poule 14'!$C24","v":0},{"$f":"'Poule 14'!$E24","v":0},{"$f":"'Poule 14'!$G24","v":0},"4ème",{"$f":"'Poule 15'!$C24","v":0},{"$f":"'Poule 15'!$E24","v":0},{"$f":"'Poule 15'!$G24","v":0},"4ème",{"$f":"'Poule 16'!$C24","v":0},{"$f":"'Poule 16'!$E24","v":0},{"$f":"'Poule 16'!$G24","v":0}]

{"sheet":"Tableau","index":10,"n_rows":92,"n_cols":34,"rows_kept":92,"cut":false,"hidden":false,"merged":[[8,10,8,11],[50,20,50,21],[16,10,16,11],[23,10,23,11],[33,10,33,11],[40,10,40,11],[48,10,48,11],[10,20,10,21],[30,32,30,33],[0,16,0,19],[15,29,15,30],[0,0,0,14],[31,29,31,30],[10,1,10,2],[1,4,1,5],[0,20,0,33],[16,26,16,27],[23,23,23,24],[3,20,3,21],[18,20,18,21],[29,4,29,5],[25,20,25,21],[1,10,1,11],[9,23,9,24],[55,10,55,11],[33,4,33,5],[42,1,42,2],[59,29,59,30],[55,23,55,24],[47,29,47,30],[35,20,35,21],[42,20,42,21],[41,23,41,24],[48,26,48,27],[57,20,57,21]]}
["REPECHAGES ET MATCHS DE CLASSEMENT",null,null,null,null,null,null,null,null,null,null,null,null,null,null,null,"1er tour de tableau",null,null,null,"TABLEAU PRINCIPAL"]
[]
[]
[null,null,null,null,null,null,null,null,null,null,null,null,null,null,null,null,"1er poule 9",{"$f":"'Résultats de poule'!B2","v":"MORO"},{"$f":"'Résultats de poule'!D2","v":"75-4-STAP"},"V","1/8 de finale 1"]
[null,null,null,null,null,null,null,null,null,null,null,null,"P",{"$f":"IF(T4=\"\",\"\",IF(T4=\"p\",S4,S5))","v":0},{"$f":"IF(T4=\"\",\"\",IF(T4=\"p\",R4,R5))","v":0},null,"4ème poule 16",{"$f":"'Résultats de poule'!N10","v":0},{"$f":"'Résultats de poule'!P10","v":0},"P",{"$f":"IF(T4=\"\",\"\",IF(T4=\"v\",R4,R5))","v":"MORO"},{"$f":"IF(T4=\"\",\"\",IF(T4=\"v\",S4,S5))","v":"75-4-STAP"},"V"]
[null,null,null,null,null,null,null,null,null,null,{"$f":"IF(M5=\"\",\"\",IF(M5=\"v\",N5,N7))","v":"75-4-LMAP"},{"$f":"IF(M5=\"\",\"\",IF(M5=\"v\",O5,O7))","v":"GODOUET"},null,null,null,null,null,null,null,null,null,null,null,{"$f":"IF(W5=\"\",\"\",IF(W5=\"v\",U5,U7))","v":"MORO"},{"$f":"IF(W5=\"\",\"\",IF(W5=\"v\",V5,V7))","v":"75-4-STAP"},"V"]
[null,null,null,null,null,null,null,null,null,null,null,null,"V",{"$f":"IF(T7=\"\",\"\",IF(T7=\"p\",S7,S8))","v":"75-4-LMAP"},{"$f":"IF(T7=\"\",\"\",IF(T7=\"p\",R7,R8))","v":"GODOUET"},null,"3ème poule 11",{"$f":"'Résultats de poule'!J4","v":"MONS--TOIRON"},{"$f":"'Résultats de poule'!L4","v":"75-4-BLOP"},"V",{"$f":"IF(T7=\"\",\"\",IF(T7=\"v\",R7,R8))","v":"MONS--TOIRON"},{"$f":"IF(T7=\"\",\"\",IF(T7=\"v\",S7,S8))","v":"75-4-BLOP"},"P"]
[null,null,null,null,null,null,null,null,null,null,null,null,null,null,null,null,"2ème poule 14",{"$f":"'Résultats de poule'!F8","v":"GODOUET"},{"$f":"'Résultats de poule'!H8","v":"75-4-LMAP"},"P"]
[null,null,null,null,null,null,null,{"$f":"IF(J6=\"\",\"\",IF(J6=\"v\",K6,K13))","v":""},{"$f":"IF(J6=\"\",\"\",IF(J6=\"v\",L6,L13))","v":""}]
[null,null,null,null,null,null,null,null,null,null,null,null,null,null,null,null,null,null,null,null,null,null,null,"1/4 finale 1",null,null,{"$f":"IF(Z6=\"\",\"\",IF(Z6=\"v\",X6,X13))","v":"MORO"},{"$f":"IF(Z6=\"\",\"\",IF(Z6=\"v\",Y6,Y13))","v":"75-4-STAP"},"P"]
[null,null,null,null,null,null,null,null,null,null,null,null,null,null,null,null,"2ème poule 12",{"$f":"'Résultats de poule'!N3","v":"PELAUD"},{"$f":"'Résultats de poule'!P3","v":"75-4-PCHP"},"P","1/8 de finale 2"]
[null,null,null,null,null,null,null,null,null,null,null,null,"V",{"$f":"IF(T11=\"\",\"\",IF(T11=\"p\",S11,S12))","v":"75-4-PCHP"},{"$f":"IF(T11=\"\",\"\",IF(T11=\"p\",R11,R12))","v":"PELAUD"},null,"3ème poule 13",{"$f":"'Résultats de poule'!B9","v":"HISPA"},{"$f":"'Résultats de poule'!D9","v":"75-4-FENP"},"V",{"$f":"IF(T11=\"\",\"\",IF(T11=\"v\",R11,R12))","v":"HISPA"},{"$f":"IF(T11=\"\",\"\",IF(T11=\"v\",S11,S12))","v":"75-4-FENP"},"P"]
[null,null,null,null,null,null,null,null,null,null,{"$f":"IF(M12=\"\",\"\",IF(M12=\"v\",N12,N14))","v":"75-4-PCHP"},{"$f":"IF(M12=\"\",\"\",IF(M12=\"v\",O12,O14))","v":"PELAUD"},null,null,null,null,null,null,null,null,null,null,null,{"$f":"IF(W12=\"\",\"\",IF(W12=\"v\",U12,U14))","v":"CHOMIENNE"},{"$f":"IF(W12=\"\",\"\",IF(W12=\"v\",V12,V14))","v":"75-4-STAP"},"P"]
[null,null,null,null,null,null,null,null,null,null,null,null,"P",{"$f":"IF(T14=\"\",\"\",IF(T14=\"p\",S14,S15))","v":0},{"$f":"IF(T14=\"\",\"\",IF(T14=\"p\",R14,R15))","v":0},null,"4ème poule 10",{"$f":"'Résultats de poule'!F5","v":0},{"$f":"'Résultats de poule'!H5","v":0},"P",{"$f":"IF(T14=\"\",\"\",IF(T14=\"v\",R14,R15))","v":"CHOMIENNE"},{"$f":"IF(T14=\"\",\"\",IF(T14=\"v\",S14,S15))","v":"75-4-STAP"},"V"]
[null,null,null,null,null,null,null,null,null,null,null,null,null,null,null,null,"1er poule 15",{"$f":"'Résultats de poule'!J7","v":"CHOMIENNE"},{"$f":"'Résultats de poule'!L7","v":"75-4-STAP"},"V"]
[null,null,null,null,{"$f":"IF(G9=\"\",\"\",IF(G9=\"v\",H9,H24))","v":""},{"$f":"IF(G9=\"\",\"\",IF(G9=\"v\",I9,I24))","v":""}]
[null,null,null,null,null,null,null,null,null,null,null,null,null,null,null,null,null,null,null,null,null,null,null,null,null,null,"1/2 finale A",null,null,{"$f":"IF(AC10=\"\",\"\",IF(AC10=\"v\",AA10,AA24))","v":"ROCHET"},{"$f":"IF(AC10=\"\",\"\",IF(AC10=\"v\",AB10,AB24))","v":"75-4-BLOP"},"P"]
[]
[null,null,null,null,null,null,null,null,null,null,null,null,null,null,null,null,"1er poule 14",{"$f":"'Résultats de poule'!F7","v":"RABAUT"},{"$f":"'Résultats de poule'!H7","v":"75-4-PCHP"},"V","1/8 de finale 3"]
[null,null,null,null,null,null,null,null,null,null,null,null,"P",{"$f":"IF(T19=\"\",\"\",IF(T19=\"p\",S19,S20))","v":0},{"$f":"IF(T19=\"\",\"\",IF(T19=\"p\",R19,R20))","v":0},null,"4ème poule 11",{"$f":"'Résultats de poule'!J5","v":0},{"$f":"'Résultats de poule'!L5","v":0},"P",{"$f":"IF(T19=\"\",\"\",IF(T19=\"v\",R19,R20))","v":"RABAUT"},{"$f":"IF(T19=\"\",\"\",IF(T19=\"v\",S19,S20))","v":"75-4-PCHP"},"V"]
[null,null,null,null,null,null,null,null,null,null,{"$f":"IF(M20=\"\",\"\",IF(M20=\"v\",N20,N22))","v":"75-2-NDLP"},{"$f":"IF(M20=\"\",\"\",IF(M20=\"v\",O20,O22))","v":"OZANNE"},null,null,null,null,null,null,null,null,null,null,null,{"$f":"IF(W20=\"\",\"\",IF(W20=\"v\",U20,U22))","v":"RABAUT"},{"$f":"IF(W20=\"\",\"\",IF(W20=\"v\",V20,V22))","v":"75-4-PCHP"},"P"]
[null,null,null,null,null,null,null,null,null,null,null,null,"V",{"$f":"IF(T22=\"\",\"\",IF(T22=\"p\",S22,S23))","v":"75-2-NDLP"},{"$f":"IF(T22=\"\",\"\",IF(T22=\"p\",R22,R23))","v":"OZANNE"},null,"3ème poule 16",{"$f":"'Résultats de poule'!N9","v":"OZANNE"},{"$f":"'Résultats de poule'!P9","v":"75-2-NDLP"},"P",{"$f":"IF(T22=\"\",\"\",IF(T22=\"v\",R22,R23))","v":"LE POITTEVIN "},{"$f":"IF(T22=\"\",\"\",IF(T22=\"v\",S22,S23))","v":"75-4-FENP"},"P"]
[null,null,null,null,null,null,null,null,null,null,null,null,null,null,null,null,"2ème poule 9",{"$f":"'Résultats de poule'!B3","v":"LE POITTEVIN "},{"$f":"'Résultats de poule'!D3","v":"75-4-FENP"},"V"]
[null,null,null,null,null,null,null,{"$f":"IF(J21=\"\",\"\",IF(J21=\"v\",K21,K28))","v":""},{"$f":"IF(J21=\"\",\"\",IF(J21=\"v\",L21,L28))","v":""},null,null,null,null,null,null,null,null,null,null,null,null,null,null,"1/4 finale 2",null,null,{"$f":"IF(Z21=\"\",\"\",IF(Z21=\"v\",X21,X28))","v":"ROCHET"},{"$f":"IF(Z21=\"\",\"\",IF(Z21=\"v\",Y21,Y28))","v":"75-4-BLOP"},"V"]
[]
[null,null,null,null,null,null,null,null,null,null,null,null,null,null,null,null,"2ème poule 15",{"$f":"'Résultats de poule'!J8","v":"ZARAYA"},{"$f":"'Résultats de poule'!L8","v":"75-4-LMAP"},"P","1/8 de finale 4"]
[null,null,null,null,null,null,null,null,null,null,null,null,"V",{"$f":"IF(T26=\"\",\"\",IF(T26=\"p\",S26,S27))","v":"75-4-LMAP"},{"$f":"IF(T26=\"\",\"\",IF(T26=\"p\",R26,R27))","v":"ZARAYA"},null,"3ème poule 10",{"$f":"'Résultats de poule'!F4","v":"BEAU"},{"$f":"'Résultats de poule'!H4","v":"75-4-SMPP"},"V",{"$f":"IF(T26=\"\",\"\",IF(T26=\"v\",R26,R27))","v":"BEAU"},{"$f":"IF(T26=\"\",\"\",IF(T26=\"v\",S26,S27))","v":"75-4-SMPP"},"P"]
[null,null,null,null,null,null,null,null,null,null,{"$f":"IF(M27=\"\",\"\",IF(M27=\"v\",N27,N29))","v":"75-4-LMAP"},{"$f":"IF(M27=\"\",\"\",IF(M27=\"v\",O27,O29))","v":"ZARAYA"},null,null,null,null,null,null,null,null,null,null,null,{"$f":"IF(W27=\"\",\"\",IF(W27=\"v\",U27,U29))","v":"ROCHET"},{"$f":"IF(W27=\"\",\"\",IF(W27=\"v\",V27,V29))","v":"75-4-BLOP"},"V"]
[null,null,null,null,null,null,null,null,null,null,null,null,"P",{"$f":"IF(T29=\"\",\"\",IF(T29=\"p\",S29,S30))","v":0},{"$f":"IF(T29=\"\",\"\",IF(T29=\"p\",R29,R30))","v":0},null,"4ème poule 13",{"$f":"'Résultats de poule'!B10","v":0},{"$f":"'Résultats de poule'!D10","v":0},"P",{"$f":"IF(T29=\"\",\"\",IF(T29=\"v\",R29,R30))","v":"ROCHET"},{"$f":"IF(T29=\"\",\"\",IF(T29=\"v\",S29,S30))","v":"75-4-BLOP"},"V"]
[null,null,null,null,null,null,null,null,null,null,null,null,null,null,null,null,"1er poule 12",{"$f":"'Résultats de poule'!N2","v":"ROCHET"},{"$f":"'Résultats de poule'!P2","v":"75-4-BLOP"},"V"]
[null,"17ème",null,null,null,null,null,null,null,null,null,null,null,null,null,null,null,null,null,null,null,null,null,null,null,null,null,null,null,null,null,null,"VAINQUEUR"]
[null,{"$f":"IF(D16=\"\",\"\",IF(D16=\"v\",E16,E48))","v":""},{"$f":"IF(D16=\"\",\"\",IF(D16=\"v\",F16,F48))","v":""},null,null,null,null,null,null,null,null,null,null,null,null,null,null,null,null,null,null,null,null,null,null,null,null,null,null,"FINALE",null,null,{"$f":"IF(AF17=\"\",\"\",IF(AF17=\"v\",AD17,AD49))","v":"CHABREL"},{"$f":"IF(AF17=\"\",\"\",IF(AF17=\"v\",AE17,AE49))","v":"75-4-STAP"}]
[]
[]
[]
[null,null,null,null,null,null,null,null,null,null,null,null,null,null,null,null,"1er poule 11",{"$f":"'Résultats de poule'!J2","v":"MOLIN"},{"$f":"'Résultats de poule'!L2","v":"75-4-LMAP"},"V","1/8 de finale 5"]
[null,null,null,null,null,null,null,null,null,null,null,null,"P",{"$f":"IF(T36=\"\",\"\",IF(T36=\"p\",S36,S37))","v":0},{"$f":"IF(T36=\"\",\"\",IF(T36=\"p\",R36,R37))","v":0},null,"4ème poule 14",{"$f":"'Résultats de poule'!F10","v":0},{"$f":"'Résultats de poule'!H10","v":0},"P",{"$f":"IF(T36=\"\",\"\",IF(T36=\"v\",R36,R37))","v":"MOLIN"},{"$f":"IF(T36=\"\",\"\",IF(T36=\"v\",S36,S37))","v":"75-4-LMAP"},"V"]
[null,null,null,null,null,null,null,null,null,null,{"$f":"IF(M37=\"\",\"\",IF(M37=\"v\",N37,N39))","v":"75-2-SPFP"},{"$f":"IF(M37=\"\",\"\",IF(M37=\"v\",O37,O39))","v":"BRETTES"},null,null,null,null,null,null,null,null,null,null,null,{"$f":"IF(W37=\"\",\"\",IF(W37=\"v\",U37,U39))","v":"MOLIN"},{"$f":"IF(W37=\"\",\"\",IF(W37=\"v\",V37,V39))","v":"75-4-LMAP"},"P"]
[null,null,null,null,null,null,null,null,null,null,null,null,"V",{"$f":"IF(T39=\"\",\"\",IF(T39=\"p\",S39,S40))","v":"75-2-SPFP"},{"$f":"IF(T39=\"\",\"\",IF(T39=\"p\",R39,R40))","v":"BRETTES"},null,"3ème poule 9",{"$f":"'Résultats de poule'!B4","v":"BRETTES"},{"$f":"'Résultats de poule'!D4","v":"75-2-SPFP"},"P",{"$f":"IF(T39=\"\",\"\",IF(T39=\"v\",R39,R40))","v":"ELKOUBY"},{"$f":"IF(T39=\"\",\"\",IF(T39=\"v\",S39,S40))","v":"75-4-SMPP"},"P"]
[null,null,null,null,null,null,null,null,null,null,null,null,null,null,null,null,"2ème poule 16",{"$f":"'Résultats de poule'!N8","v":"ELKOUBY"},{"$f":"'Résultats de poule'!P8","v":"75-4-SMPP"},"V"]
[null,null,null,null,null,null,null,{"$f":"IF(J38=\"\",\"\",IF(J38=\"v\",K38,K45))","v":""},{"$f":"IF(J38=\"\",\"\",IF(J38=\"v\",L38,L45))","v":""}]
[null,null,null,null,null,null,null,null,null,null,null,null,null,null,null,null,null,null,null,null,null,null,null,"1/4 finale 3",null,null,{"$f":"IF(Z38=\"\",\"\",IF(Z38=\"v\",X38,X45))","v":"FRANC"},{"$f":"IF(Z38=\"\",\"\",IF(Z38=\"v\",Y38,Y45))","v":"75-4-LMAP"},"P"]
[null,null,null,null,null,null,null,null,null,null,null,null,null,null,null,null,"2ème poule 10",{"$f":"'Résultats de poule'!F3","v":"MAZO KOENIG"},{"$f":"'Résultats de poule'!H3","v":"75-4-PCHP"},"V","1/8 de finale 6"]
[null,null,null,null,null,null,null,null,null,null,null,null,"V",{"$f":"IF(T43=\"\",\"\",IF(T43=\"p\",S43,S44))","v":"75-2-SLHP"},{"$f":"IF(T43=\"\",\"\",IF(T43=\"p\",R43,R44))","v":"ERDEM"},null,"3ème poule 15",{"$f":"'Résultats de poule'!J9","v":"ERDEM"},{"$f":"'Résultats de poule'!L9","v":"75-2-SLHP"},"P",{"$f":"IF(T43=\"\",\"\",IF(T43=\"v\",R43,R44))","v":"MAZO KOENIG"},{"$f":"IF(T43=\"\",\"\",IF(T43=\"v\",S43,S44))","v":"75-4-PCHP"},"P"]
[null,null,null,null,null,null,null,null,null,null,{"$f":"IF(M44=\"\",\"\",IF(M44=\"v\",N44,N46))","v":"75-2-SLHP"},{"$f":"IF(M44=\"\",\"\",IF(M44=\"v\",O44,O46))","v":"ERDEM"},null,null,null,null,null,null,null,null,null,null,null,{"$f":"IF(W44=\"\",\"\",IF(W44=\"v\",U44,U46))","v":"FRANC"},{"$f":"IF(W44=\"\",\"\",IF(W44=\"v\",V44,V46))","v":"75-4-LMAP"},"V"]
[null,null,null,null,null,null,null,null,null,null,null,null,"P",{"$f":"IF(T46=\"\",\"\",IF(T46=\"p\",S46,S47))","v":0},{"$f":"IF(T46=\"\",\"\",IF(T46=\"p\",R46,R47))","v":0},null,"4ème poule 12",{"$f":"'Résultats de poule'!N5","v":0},{"$f":"'Résultats de poule'!P5","v":0},"P",{"$f":"IF(T46=\"\",\"\",IF(T46=\"v\",R46,R47))","v":"FRANC"},{"$f":"IF(T46=\"\",\"\",IF(T46=\"v\",S46,S47))","v":"75-4-LMAP"},"V"]
[null,null,null,null,null,null,null,null,null,null,null,null,null,null,null,null,"1er poule 13",{"$f":"'Résultats de poule'!B7","v":"FRANC"},{"$f":"'Résultats de poule'!D7","v":"75-4-LMAP"},"V"]
[null,null,null,null,{"$f":"IF(G41=\"\",\"\",IF(G41=\"v\",H41,H56))","v":""},{"$f":"IF(G41=\"\",\"\",IF(G41=\"v\",I41,I56))","v":""}]
[null,null,null,null,null,null,null,null,null,null,null,null,null,null,null,null,null,null,null,null,null,null,null,null,null,null,"1/2 finale B",null,null,{"$f":"IF(AC42=\"\",\"\",IF(AC42=\"v\",AA42,AA56))","v":"CHABREL"},{"$f":"IF(AC42=\"\",\"\",IF(AC42=\"v\",AB42,AB56))","v":"75-4-STAP"},"V"]
[]
[null,null,null,null,null,null,null,null,null,null,null,null,null,null,null,null,"1er poule 16",{"$f":"'Résultats de poule'!N7","v":"MARCOTTE DE QUIVIERES"},{"$f":"'Résultats de poule'!P7","v":"75-4-LMAP"},"V","1/8 de finale 7"]
[null,null,null,null,null,null,null,null,null,null,null,null,"V",{"$f":"IF(T51=\"\",\"\",IF(T51=\"p\",S51,S52))","v":0},{"$f":"IF(T51=\"\",\"\",IF(T51=\"p\",R51,R52))","v":0},null,"4ème poule 9",{"$f":"'Résultats de poule'!B5","v":0},{"$f":"'Résultats de poule'!D5","v":0},"P",{"$f":"IF(T51=\"\",\"\",IF(T51=\"v\",R51,R52))","v":"MARCOTTE DE QUIVIERES"},{"$f":"IF(T51=\"\",\"\",IF(T51=\"v\",S51,S52))","v":"75-4-LMAP"},"V"]
[null,null,null,null,null,null,null,null,null,"P",{"$f":"IF(M52=\"\",\"\",IF(M52=\"v\",N52,N54))","v":0},{"$f":"IF(M52=\"\",\"\",IF(M52=\"v\",O52,O54))","v":0},null,null,null,null,null,null,null,null,null,null,null,{"$f":"IF(W52=\"\",\"\",IF(W52=\"v\",U52,U54))","v":"MARCOTTE DE QUIVIERES"},{"$f":"IF(W52=\"\",\"\",IF(W52=\"v\",V52,V54))","v":"75-4-LMAP"},"P"]
[null,null,null,null,null,null,null,null,null,null,null,null,"P",{"$f":"IF(T54=\"\",\"\",IF(T54=\"p\",S54,S55))","v":0},{"$f":"IF(T54=\"\",\"\",IF(T54=\"p\",R54,R55))","v":0},null,"3ème poule 14",{"$f":"'Résultats de poule'!F9","v":0},{"$f":"'Résultats de poule'!H9","v":0},"P",{"$f":"IF(T54=\"\",\"\",IF(T54=\"v\",R54,R55))","v":"FISHER"},{"$f":"IF(T54=\"\",\"\",IF(T54=\"v\",S54,S55))","v":"75-2-SLHP"},"P"]
[null,null,null,null,null,null,null,null,null,null,null,null,null,null,null,null,"2ème poule 11",{"$f":"'Résultats de poule'!J3","v":"FISHER"},{"$f":"'Résultats de poule'!L3","v":"75-2-SLHP"},"V"]
[null,null,null,null,null,null,null,{"$f":"IF(J53=\"\",\"\",IF(J53=\"v\",K53,K60))","v":"75-2-SPFP"},{"$f":"IF(J53=\"\",\"\",IF(J53=\"v\",L53,L60))","v":"ZHANG"},null,null,null,null,null,null,null,null,null,null,null,null,null,null,"1/4 finale 4",null,null,{"$f":"IF(Z53=\"\",\"\",IF(Z53=\"v\",X53,X60))","v":"CHABREL"},{"$f":"IF(Z53=\"\",\"\",IF(Z53=\"v\",Y53,Y60))","v":"75-4-STAP"},"V"]
[]
[null,null,null,null,null,null,null,null,null,null,null,null,null,null,null,null,"2ème poule 13",{"$f":"'Résultats de poule'!B8","v":"VUILLET"},{"$f":"'Résultats de poule'!D8","v":"75-2-SUPA"},"V","1/8 de finale 8"]
[null,null,null,null,null,null,null,null,null,null,null,null,"V",{"$f":"IF(T58=\"\",\"\",IF(T58=\"p\",S58,S59))","v":"75-2-SPFP"},{"$f":"IF(T58=\"\",\"\",IF(T58=\"p\",R58,R59))","v":"ZHANG"},null,"3ème poule 12",{"$f":"'Résultats de poule'!N4","v":"ZHANG"},{"$f":"'Résultats de poule'!P4","v":"75-2-SPFP"},"P",{"$f":"IF(T58=\"\",\"\",IF(T58=\"v\",R58,R59))","v":"VUILLET"},{"$f":"IF(T58=\"\",\"\",IF(T58=\"v\",S58,S59))","v":"75-2-SUPA"},"P"]
[null,"19ème",null,null,{"$f":"IF(G9=\"\",\"\",IF(G9=\"p\",H9,H24))","v":""},{"$f":"IF(G9=\"\",\"\",IF(G9=\"p\",I9,I24))","v":""},null,null,null,"V",{"$f":"IF(M59=\"\",\"\",IF(M59=\"v\",N59,N61))","v":"75-2-SPFP"},{"$f":"IF(M59=\"\",\"\",IF(M59=\"v\",O59,O61))","v":"ZHANG"},null,null,null,null,null,null,null,null,null,null,null,{"$f":"IF(W59=\"\",\"\",IF(W59=\"v\",U59,U61))","v":"CHABREL"},{"$f":"IF(W59=\"\",\"\",IF(W59=\"v\",V59,V61))","v":"75-4-STAP"},"V",null,null,null,"Place de 3ème/4ème"]
[null,{"$f":"IF(D60=\"\",\"\",IF(D60=\"v\",E60,E62))","v":""},{"$f":"IF(D60=\"\",\"\",IF(D60=\"v\",F60,F62))","v":""},null,null,null,null,null,null,null,null,null,"P",{"$f":"IF(T61=\"\",\"\",IF(T61=\"p\",S61,S62))","v":0},{"$f":"IF(T61=\"\",\"\",IF(T61=\"p\",R61,R62))","v":0},null,"4ème poule 15",{"$f":"'Résultats de poule'!J10","v":0},{"$f":"'Résultats de poule'!L10","v":0},"P",{"$f":"IF(T61=\"\",\"\",IF(T61=\"v\",R61,R62))","v":"CHABREL"},{"$f":"IF(T61=\"\",\"\",IF(T61=\"v\",S61,S62))","v":"75-4-STAP"},"V",null,null,null,null,null,null,{"$f":"IF(AC10=\"\",\"\",IF(AC10=\"p\",AA10,AA24))","v":"MORO"},{"$f":"IF(AC10=\"\",\"\",IF(AC10=\"p\",AB10,AB24))","v":"75-4-STAP"},"V"]
[null,null,null,null,{"$f":"IF(G41=\"\",\"\",IF(G41=\"p\",H41,H56))","v":""},{"$f":"IF(G41=\"\",\"\",IF(G41=\"p\",I41,I56))","v":""},null,null,null,null,null,null,null,null,null,null,"1er poule 10",{"$f":"'Résultats de poule'!F2","v":"CHABREL"},{"$f":"'Résultats de poule'!H2","v":"75-4-STAP"},"V",null,null,null,null,null,null,null,null,null,null,null,null,{"$f":"IF(AF61=\"\",\"\",IF(AF61=\"v\",AD61,AD63))","v":"MORO"},{"$f":"IF(AF61=\"\",\"\",IF(AF61=\"v\",AE61,AE63))","v":"75-4-STAP"}]
[null,null,null,null,null,null,null,null,null,null,null,null,null,null,null,null,null,null,null,null,null,null,null,null,null,null,null,null,null,{"$f":"IF(AC42=\"\",\"\",IF(AC42=\"p\",AA42,AA56))","v":"FRANC"},{"$f":"IF(AC42=\"\",\"\",IF(AC42=\"p\",AB42,AB56))","v":"75-4-LMAP"},"P"]
[]
[null,null,null,null,null,null,null,null,null,null,null,null,null,{"$f":"IF(M5=\"\",\"\",IF(M5=\"p\",N5,N7))","v":0},{"$f":"IF(M5=\"\",\"\",IF(M5=\"p\",O5,O7))","v":0},null,null,{"$f":"IF(W5=\"\",\"\",IF(W5=\"p\",U5,U7))","v":"MONS--TOIRON"},{"$f":"IF(W5=\"\",\"\",IF(W5=\"p\",V5,V7))","v":"75-4-BLOP"},"P"]
[null,null,null,null,null,null,null,null,null,null,{"$f":"IF(M65=\"\",\"\",IF(M65=\"v\",N65,N66))","v":""},{"$f":"IF(M65=\"\",\"\",IF(M65=\"v\",O65,O66))","v":""},null,{"$f":"IF(M12=\"\",\"\",IF(M12=\"p\",N12,N14))","v":0},{"$f":"IF(M12=\"\",\"\",IF(M12=\"p\",O12,O14))","v":0},null,null,{"$f":"IF(W12=\"\",\"\",IF(W12=\"p\",U12,U14))","v":"HISPA"},{"$f":"IF(W12=\"\",\"\",IF(W12=\"p\",V12,V14))","v":"75-4-FENP"},"V",{"$f":"IF(T65=\"\",\"\",IF(T65=\"v\",R65,R66))","v":"HISPA"},{"$f":"IF(T65=\"\",\"\",IF(T65=\"v\",S65,S66))","v":"75-4-FENP"},"P"]
[null,null,null,null,null,null,null,{"$f":"IF(J66=\"\",\"\",IF(J66=\"v\",K66,K68))","v":""},{"$f":"IF(J66=\"\",\"\",IF(J66=\"v\",L66,L68))","v":""},null,null,null,null,null,null,null,null,null,null,null,null,null,null,{"$f":"IF(W66=\"\",\"\",IF(W66=\"v\",U66,U68))","v":"LE POITTEVIN "},{"$f":"IF(W66=\"\",\"\",IF(W66=\"v\",V66,V68))","v":"75-4-FENP"},"P"]
[null,null,null,null,null,null,null,null,null,null,{"$f":"IF(M68=\"\",\"\",IF(M68=\"v\",N68,N69))","v":""},{"$f":"IF(M68=\"\",\"\",IF(M68=\"v\",O68,O69))","v":""},null,{"$f":"IF(M20=\"\",\"\",IF(M20=\"p\",N20,N22))","v":0},{"$f":"IF(M20=\"\",\"\",IF(M20=\"p\",O20,O22))","v":0},null,null,{"$f":"IF(W20=\"\",\"\",IF(W20=\"p\",U20,U22))","v":"LE POITTEVIN "},{"$f":"IF(W20=\"\",\"\",IF(W20=\"p\",V20,V22))","v":"75-4-FENP"},"V",{"$f":"IF(T68=\"\",\"\",IF(T68=\"v\",R68,R69))","v":"LE POITTEVIN "},{"$f":"IF(T68=\"\",\"\",IF(T68=\"v\",S68,S69))","v":"75-4-FENP"},"V"]
[null,null,null,null,"25ème",null,null,null,null,null,null,null,null,{"$f":"IF(M27=\"\",\"\",IF(M27=\"p\",N27,N29))","v":0},{"$f":"IF(M27=\"\",\"\",IF(M27=\"p\",O27,O29))","v":0},null,null,{"$f":"IF(W27=\"\",\"\",IF(W27=\"p\",U27,U29))","v":"BEAU"},{"$f":"IF(W27=\"\",\"\",IF(W27=\"p\",V27,V29))","v":"75-4-SMPP"},"P",null,null,null,null,null,null,null,"9ème"]
[null,null,null,null,{"$f":"IF(G67=\"\",\"\",IF(G67=\"v\",H67,H73))","v":""},{"$f":"IF(G67=\"\",\"\",IF(G67=\"v\",I67,I73))","v":""},null,null,null,null,null,null,null,null,null,null,null,null,null,null,null,null,null,null,null,null,{"$f":"IF(Z67=\"\",\"\",IF(Z67=\"v\",X67,X73))","v":"VUILLET"},{"$f":"IF(Z67=\"\",\"\",IF(Z67=\"v\",Y67,Y73))","v":"75-2-SUPA"}]
[null,null,null,null,null,null,null,null,null,null,null,null,null,{"$f":"IF(M37=\"\",\"\",IF(M37=\"p\",N37,N39))","v":0},{"$f":"IF(M37=\"\",\"\",IF(M37=\"p\",O37,O39))","v":0},null,null,{"$f":"IF(W37=\"\",\"\",IF(W37=\"p\",U37,U39))","v":"ELKOUBY"},{"$f":"IF(W37=\"\",\"\",IF(W37=\"p\",V37,V39))","v":"75-4-SMPP"},"V"]
[null,null,null,null,null,null,null,null,null,null,{"$f":"IF(M71=\"\",\"\",IF(M71=\"v\",N71,N72))","v":""},{"$f":"IF(M71=\"\",\"\",IF(M71=\"v\",O71,O72))","v":""},null,{"$f":"IF(M44=\"\",\"\",IF(M44=\"p\",N44,N46))","v":0},{"$f":"IF(M44=\"\",\"\",IF(M44=\"p\",O44,O46))","v":0},null,null,{"$f":"IF(W44=\"\",\"\",IF(W44=\"p\",U44,U46))","v":"MAZO KOENIG"},{"$f":"IF(W44=\"\",\"\",IF(W44=\"p\",V44,V46))","v":"75-4-PCHP"},"P",{"$f":"IF(T71=\"\",\"\",IF(T71=\"v\",R71,R72))","v":"ELKOUBY"},{"$f":"IF(T71=\"\",\"\",IF(T71=\"v\",S71,S72))","v":"75-4-SMPP"},"P"]
[null,null,null,null,null,null,null,{"$f":"IF(J72=\"\",\"\",IF(J72=\"v\",K72,K74))","v":""},{"$f":"IF(J72=\"\",\"\",IF(J72=\"v\",L72,L74))","v":""},null,null,null,null,null,null,null,null,null,null,null,null,null,null,{"$f":"IF(W72=\"\",\"\",IF(W72=\"v\",U72,U74))","v":"VUILLET"},{"$f":"IF(W72=\"\",\"\",IF(W72=\"v\",V72,V74))","v":"75-2-SUPA"},"V"]
[null,null,null,null,null,null,null,null,null,null,{"$f":"IF(M74=\"\",\"\",IF(M74=\"v\",N74,N75))","v":""},{"$f":"IF(M74=\"\",\"\",IF(M74=\"v\",O74,O75))","v":""},null,{"$f":"IF(M52=\"\",\"\",IF(M52=\"p\",N52,N54))","v":0},{"$f":"IF(M52=\"\",\"\",IF(M52=\"p\",O52,O54))","v":0},null,null,{"$f":"IF(W52=\"\",\"\",IF(W52=\"p\",U52,U54))","v":"FISHER"},{"$f":"IF(W52=\"\",\"\",IF(W52=\"p\",V52,V54))","v":"75-2-SLHP"},"P",{"$f":"IF(T74=\"\",\"\",IF(T74=\"v\",R74,R75))","v":"VUILLET"},{"$f":"IF(T74=\"\",\"\",IF(T74=\"v\",S74,S75))","v":"75-2-SUPA"},"V"]
[null,null,null,null,null,null,null,null,null,null,null,null,null,{"$f":"IF(M59=\"\",\"\",IF(M59=\"p\",N59,N61))","v":0},{"$f":"IF(M59=\"\",\"\",IF(M59=\"p\",O59,O61))","v":0},null,null,{"$f":"IF(W59=\"\",\"\",IF(W59=\"p\",U59,U61))","v":"VUILLET"},{"$f":"IF(W59=\"\",\"\",IF(W59=\"p\",V59,V61))","v":"75-2-SUPA"},"V",null,null,null,null,null,null,{"$f":"IF(Z6=\"\",\"\",IF(Z6=\"p\",X6,X13))","v":"CHOMIENNE"},{"$f":"IF(Z6=\"\",\"\",IF(Z6=\"p\",Y6,Y13))","v":"75-4-STAP"},"V"]
[null,null,null,null,null,null,null,null,null,null,null,null,null,null,null,null,null,null,null,null,null,null,null,null,null,null,null,null,null,{"$f":"IF(AC75=\"\",\"\",IF(AC75=\"v\",AA75,AA77))","v":"CHOMIENNE"},{"$f":"IF(AC75=\"\",\"\",IF(AC75=\"v\",AB75,AB77))","v":"75-4-STAP"},"V"]
[null,null,null,null,null,null,null,null,null,null,null,null,null,{"$f":"IF(M65=\"\",\"\",IF(M65=\"p\",N65,N66))","v":""},{"$f":"IF(M65=\"\",\"\",IF(M65=\"p\",O65,O66))","v":""},null,null,{"$f":"IF(T65=\"\",\"\",IF(T65=\"p\",R65,R66))","v":"MONS--TOIRON"},{"$f":"IF(T65=\"\",\"\",IF(T65=\"p\",S65,S66))","v":"75-4-BLOP"},null,null,null,null,null,null,null,{"$f":"IF(Z21=\"\",\"\",IF(Z21=\"p\",X21,X28))","v":"RABAUT"},{"$f":"IF(Z21=\"\",\"\",IF(Z21=\"p\",Y21,Y28))","v":"75-4-PCHP"},"P"]
[null,null,null,null,null,null,null,"29ème",null,null,{"$f":"IF(M77=\"\",\"\",IF(M77=\"v\",N77,N78))","v":""},{"$f":"IF(M77=\"\",\"\",IF(M77=\"v\",O77,O78))","v":""},null,{"$f":"IF(M68=\"\",\"\",IF(M68=\"p\",N68,N69))","v":""},{"$f":"IF(M68=\"\",\"\",IF(M68=\"p\",O68,O69))","v":""},null,null,{"$f":"IF(T68=\"\",\"\",IF(T68=\"p\",R68,R69))","v":"BEAU"},{"$f":"IF(T68=\"\",\"\",IF(T68=\"p\",S68,S69))","v":"75-4-SMPP"},null,{"$f":"IF(T77=\"\",\"\",IF(T77=\"v\",R77,R78))","v":""},{"$f":"IF(T77=\"\",\"\",IF(T77=\"v\",S77,S78))","v":""},null,null,"13ème",null,null,null,null,null,null,null,null,"5ème"]
[null,null,null,null,null,null,null,{"$f":"IF(J78=\"\",\"\",IF(J78=\"v\",K78,K80))","v":""},{"$f":"IF(J78=\"\",\"\",IF(J78=\"v\",L78,L80))","v":""},null,null,null,null,null,null,null,null,null,null,null,null,null,null,{"$f":"IF(W78=\"\",\"\",IF(W78=\"v\",U78,U80))","v":""},{"$f":"IF(W78=\"\",\"\",IF(W78=\"v\",V78,V80))","v":""},null,null,null,null,null,null,null,{"$f":"IF(AF76=\"\",\"\",IF(AF76=\"v\",AD76,AD82))","v":"CHOMIENNE"},{"$f":"IF(AF76=\"\",\"\",IF(AF76=\"v\",AE76,AE82))","v":"75-4-STAP"}]
[null,null,null,null,null,null,null,null,null,null,{"$f":"IF(M80=\"\",\"\",IF(M80=\"v\",N80,N81))","v":""},{"$f":"IF(M80=\"\",\"\",IF(M80=\"v\",O80,O81))","v":""},null,{"$f":"IF(M71=\"\",\"\",IF(M71=\"p\",N71,N72))","v":""},{"$f":"IF(M71=\"\",\"\",IF(M71=\"p\",O71,O72))","v":""},null,null,{"$f":"IF(T71=\"\",\"\",IF(T71=\"p\",R71,R72))","v":"MAZO KOENIG"},{"$f":"IF(T71=\"\",\"\",IF(T71=\"p\",S71,S72))","v":"75-4-PCHP"},null,{"$f":"IF(T80=\"\",\"\",IF(T80=\"v\",R80,R81))","v":""},{"$f":"IF(T80=\"\",\"\",IF(T80=\"v\",S80,S81))","v":""}]
[null,null,null,null,null,null,null,null,null,null,null,null,null,{"$f":"IF(M74=\"\",\"\",IF(M74=\"p\",N74,N75))","v":""},{"$f":"IF(M74=\"\",\"\",IF(M74=\"p\",O74,O75))","v":""},null,null,{"$f":"IF(T74=\"\",\"\",IF(T74=\"p\",R74,R75))","v":"FISHER"},{"$f":"IF(T74=\"\",\"\",IF(T74=\"p\",S74,S75))","v":"75-2-SLHP"},null,null,null,null,null,null,null,{"$f":"IF(Z38=\"\",\"\",IF(Z38=\"p\",X38,X45))","v":"MOLIN"},{"$f":"IF(Z38=\"\",\"\",IF(Z38=\"p\",Y38,Y45))","v":"75-4-LMAP"},"V"]
[null,null,null,null,null,null,null,null,null,null,"27ème",null,null,null,null,null,null,null,null,null,null,"11ème",null,null,null,null,null,null,null,{"$f":"IF(AC81=\"\",\"\",IF(AC81=\"v\",AA81,AA83))","v":"MOLIN"},{"$f":"IF(AC81=\"\",\"\",IF(AC81=\"v\",AB81,AB83))","v":"75-4-LMAP"},"P"]
[null,null,null,null,null,null,null,null,null,null,{"$f":"IF(M83=\"\",\"\",IF(M83=\"v\",N83,N84))","v":""},{"$f":"IF(M83=\"\",\"\",IF(M83=\"v\",O83,O84))","v":""},null,{"$f":"IF(J66=\"\",\"\",IF(J66=\"p\",K66,K68))","v":""},{"$f":"IF(J66=\"\",\"\",IF(J66=\"p\",L66,L68))","v":""},null,null,{"$f":"IF(W66=\"\",\"\",IF(W66=\"p\",U66,U68))","v":"HISPA"},{"$f":"IF(W66=\"\",\"\",IF(W66=\"p\",V66,V68))","v":"75-4-FENP"},null,{"$f":"IF(T83=\"\",\"\",IF(T83=\"v\",R83,R84))","v":""},{"$f":"IF(T83=\"\",\"\",IF(T83=\"v\",S83,S84))","v":""},null,null,null,null,{"$f":"IF(Z53=\"\",\"\",IF(Z53=\"p\",X53,X60))","v":"MARCOTTE DE QUIVIERES"},{"$f":"IF(Z53=\"\",\"\",IF(Z53=\"p\",Y53,Y60))","v":"75-4-LMAP"},"P"]
[null,null,null,null,null,null,null,null,null,null,null,null,null,{"$f":"IF(J72=\"\",\"\",IF(J72=\"p\",K72,K74))","v":""},{"$f":"IF(J72=\"\",\"\",IF(J72=\"p\",L72,L74))","v":""},null,null,{"$f":"IF(W72=\"\",\"\",IF(W72=\"p\",U72,U74))","v":"ELKOUBY"},{"$f":"IF(W72=\"\",\"\",IF(W72=\"p\",V72,V74))","v":"75-4-SMPP"}]
[null,null,null,null,null,null,null,{"$f":"IF(J6=\"\",\"\",IF(J6=\"p\",K6,K13))","v":""},{"$f":"IF(J6=\"\",\"\",IF(J6=\"p\",L6,L13))","v":""},null,null,null,null,null,null,null,null,null,null,null,null,null,null,null,null,null,{"$f":"IF(AC75=\"\",\"\",IF(AC75=\"p\",AA75,AA77))","v":"RABAUT"},{"$f":"IF(AC75=\"\",\"\",IF(AC75=\"p\",AB75,AB77))","v":"75-4-PCHP"},"V",null,"7ème"]
[null,"21ème",null,null,{"$f":"IF(G85=\"\",\"\",IF(G85=\"v\",H85,H86))","v":""},{"$f":"IF(G85=\"\",\"\",IF(G85=\"v\",I85,I86))","v":""},null,{"$f":"IF(J21=\"\",\"\",IF(J21=\"p\",K21,K28))","v":""},{"$f":"IF(J21=\"\",\"\",IF(J21=\"p\",L21,L28))","v":""},null,"31ème",null,null,null,null,null,null,null,null,null,null,"15ème",null,null,null,null,null,null,null,{"$f":"IF(AC85=\"\",\"\",IF(AC85=\"v\",AA85,AA87))","v":"RABAUT"},{"$f":"IF(AC85=\"\",\"\",IF(AC85=\"v\",AB85,AB87))","v":"75-4-PCHP"}]
[null,{"$f":"IF(D86=\"\",\"\",IF(D86=\"v\",E86,E88))","v":""},{"$f":"IF(D86=\"\",\"\",IF(D86=\"v\",F86,F88))","v":""},null,null,null,null,null,null,null,{"$f":"IF(M87=\"\",\"\",IF(M87=\"v\",N87,N88))","v":""},{"$f":"IF(M87=\"\",\"\",IF(M87=\"v\",O87,O88))","v":""},null,{"$f":"IF(M77=\"\",\"\",IF(M77=\"p\",N77,N78))","v":""},{"$f":"IF(M77=\"\",\"\",IF(M77=\"p\",O77,O78))","v":""},null,null,{"$f":"IF(T77=\"\",\"\",IF(T77=\"p\",R77,R78))","v":""},{"$f":"IF(T77=\"\",\"\",IF(T77=\"p\",S77,S78))","v":""},null,{"$f":"IF(T87=\"\",\"\",IF(T87=\"v\",R87,R88))","v":""},{"$f":"IF(T87=\"\",\"\",IF(T87=\"v\",S87,S88))","v":""},null,null,null,null,{"$f":"IF(AC81=\"\",\"\",IF(AC81=\"p\",AA81,AA83))","v":"MARCOTTE DE QUIVIERES"},{"$f":"IF(AC81=\"\",\"\",IF(AC81=\"p\",AB81,AB83))","v":"75-4-LMAP"},"P"]
[null,null,null,null,{"$f":"IF(G88=\"\",\"\",IF(G88=\"v\",H88,H89))","v":""},{"$f":"IF(G88=\"\",\"\",IF(G88=\"v\",I88,I89))","v":""},null,{"$f":"IF(J38=\"\",\"\",IF(J38=\"p\",K38,K45))","v":""},{"$f":"IF(J38=\"\",\"\",IF(J38=\"p\",L38,L45))","v":""},null,null,null,null,{"$f":"IF(M80=\"\",\"\",IF(M80=\"p\",N80,N81))","v":""},{"$f":"IF(M80=\"\",\"\",IF(M80=\"p\",O80,O81))","v":""},null,null,{"$f":"IF(T80=\"\",\"\",IF(T80=\"p\",R80,R81))","v":""},{"$f":"IF(T80=\"\",\"\",IF(T80=\"p\",S80,S81))","v":""}]
[null,null,null,null,null,null,null,{"$f":"IF(J53=\"\",\"\",IF(J53=\"p\",K53,K60))","v":0},{"$f":"IF(J53=\"\",\"\",IF(J53=\"p\",L53,L60))","v":0}]
[null,"23ème"]
[null,{"$f":"IF(D91=\"\",\"\",IF(D91=\"v\",E91,E92))","v":""},{"$f":"IF(D91=\"\",\"\",IF(D91=\"v\",F91,F92))","v":""},null,{"$f":"IF(G85=\"\",\"\",IF(G85=\"p\",H85,H86))","v":""},{"$f":"IF(G85=\"\",\"\",IF(G85=\"p\",I85,I86))","v":""}]
[null,null,null,null,{"$f":"IF(G88=\"\",\"\",IF(G88=\"p\",H88,H89))","v":""},{"$f":"IF(G88=\"\",\"\",IF(G88=\"p\",I88,I89))","v":""}]

{"sheet":"Classement","index":11,"n_rows":35,"n_cols":3,"rows_kept":35,"cut":false,"hidden":false,"merged":[[1,0,1,2],[0,0,0,2]]}
[{"$f":"IF(Engagés!A1=\"\",\"\",Engagés!A1)","v":"Qualifications championnat Comité de Paris "}]
[{"$f":"IF(Engagés!E3=\"\",\"\",Engagés!E3)","v":"MG Promo"}]
["CLASSEMENT","NOMS","Etablissement"]
["1er",{"$f":"Tableau!AG32","v":"CHABREL"},{"$f":"Tableau!AH32","v":"75-4-STAP"}]
["2ème",{"$f":"IF(Tableau!$AF$17=\"\",\"\",IF(Tableau!$AF$17=\"p\",Tableau!$AD$17,Tableau!$AD$49))","v":"ROCHET"},{"$f":"IF(Tableau!$AF$17=\"\",\"\",IF(Tableau!$AF$17=\"p\",Tableau!$AE$17,Tableau!$AE$49))","v":"75-4-BLOP"}]
["3ème",{"$f":"Tableau!AG62","v":"MORO"},{"$f":"Tableau!AH62","v":"75-4-STAP"}]
["4ème",{"$f":"IF(Tableau!AF61=\"\",\"\",IF(Tableau!$AF$61=\"p\",Tableau!$AD$61,Tableau!$AD$63))","v":"FRANC"},{"$f":"IF(Tableau!AF61=\"\",\"\",IF(Tableau!$AF$61=\"p\",Tableau!$AE$61,Tableau!$AE$63))","v":"75-4-LMAP"}]
["5ème",{"$f":"Tableau!AG79","v":"CHOMIENNE"},{"$f":"Tableau!AH79","v":"75-4-STAP"}]
["6ème",{"$f":"IF(Tableau!AF76=\"\",\"\",IF(Tableau!$AF$76=\"p\",Tableau!$AD$76,Tableau!$AD$82))","v":"MOLIN"},{"$f":"IF(Tableau!$AF$76=\"\",\"\",IF(Tableau!$AF$76=\"p\",Tableau!$AE$76,Tableau!$AE$82))","v":"75-4-LMAP"}]
["7ème",{"$f":"Tableau!AD86","v":"RABAUT"},{"$f":"Tableau!AE86","v":"75-4-PCHP"}]
["8ème",{"$f":"IF(Tableau!$AC$85=\"\",\"\",IF(Tableau!$AC$85=\"p\",Tableau!$AA$85,Tableau!$AA$87))","v":"MARCOTTE DE QUIVIERES"},{"$f":"IF(Tableau!$AC$85=\"\",\"\",IF(Tableau!$AC$85=\"p\",Tableau!$AB$85,Tableau!$AB$87))","v":"75-4-LMAP"}]
["9ème",{"$f":"Tableau!AA70","v":"VUILLET"},{"$f":"Tableau!AB70","v":"75-2-SUPA"}]
["10ème",{"$f":"IF(Tableau!$Z$67=\"\",\"\",IF(Tableau!$Z$67=\"p\",Tableau!$X$67,Tableau!$X$73))","v":"LE POITTEVIN "},{"$f":"IF(Tableau!$Z$67=\"\",\"\",IF(Tableau!$Z$67=\"p\",Tableau!$Y$67,Tableau!$Y$73))","v":"75-4-FENP"}]
["11ème",{"$f":"Tableau!U83","v":""},{"$f":"Tableau!V83","v":""}]
["12ème",{"$f":"IF(Tableau!$T$83=\"\",\"\",IF(Tableau!$T$83=\"p\",Tableau!$R$83,Tableau!$R$84))","v":""},{"$f":"IF(Tableau!$T$83=\"\",\"\",IF(Tableau!$T$83=\"p\",Tableau!$S$83,Tableau!$S$84))","v":""}]
["13ème",{"$f":"Tableau!X79","v":""},{"$f":"Tableau!Y79","v":""}]
["14ème",{"$f":"IF(Tableau!$W$78=\"\",\"\",IF(Tableau!$W$78=\"p\",Tableau!$U$78,Tableau!$U$80))","v":""},{"$f":"IF(Tableau!$W$78=\"\",\"\",IF(Tableau!$W$78=\"p\",Tableau!$V$78,Tableau!$V$80))","v":""}]
["15ème",{"$f":"Tableau!U87","v":""},{"$f":"Tableau!V87","v":""}]
["16ème",{"$f":"IF(Tableau!$T$87=\"\",\"\",IF(Tableau!$T$87=\"p\",Tableau!$R$87,Tableau!$R$88))","v":""},{"$f":"IF(Tableau!$T$87=\"\",\"\",IF(Tableau!$T$87=\"p\",Tableau!$S$87,Tableau!$S$88))","v":""}]
["17ème",{"$f":"Tableau!C32","v":""},{"$f":"Tableau!B32","v":""}]
["18ème",{"$f":"IF(Tableau!$D$16=\"\",\"\",IF(Tableau!$D$16=\"p\",Tableau!$F$60,Tableau!$F$48))","v":""},{"$f":"IF(Tableau!$D$16=\"\",\"\",IF(Tableau!$D$16=\"p\",Tableau!$E$16,Tableau!$E$48))","v":""}]
["19ème",{"$f":"Tableau!C61","v":""},{"$f":"Tableau!B61","v":""}]
["20ème",{"$f":"IF(Tableau!D60=\"\",\"\",IF(Tableau!$D$60=\"p\",Tableau!$F$60,Tableau!$F$62))","v":""},{"$f":"IF(Tableau!D60=\"\",\"\",IF(Tableau!$D$60=\"p\",Tableau!$E$60,Tableau!$E$62))","v":""}]
["21ème",{"$f":"Tableau!C87","v":""},{"$f":"Tableau!B87","v":""}]
["22ème",{"$f":"IF(Tableau!$D$86=\"\",\"\",IF(Tableau!$D$86=\"p\",Tableau!$F$86,Tableau!$F$88))","v":""},{"$f":"IF(Tableau!$D$86=\"\",\"\",IF(Tableau!$D$86=\"p\",Tableau!$E$86,Tableau!$E$88))","v":""}]
["23ème",{"$f":"Tableau!C91","v":""},{"$f":"Tableau!B91","v":""}]
["24ème",{"$f":"IF(Tableau!$D$91=\"\",\"\",IF(Tableau!$D$91=\"p\",Tableau!$F$91,Tableau!$F$92))","v":""},{"$f":"IF(Tableau!$D$91=\"\",\"\",IF(Tableau!$D$91=\"p\",Tableau!$E$91,Tableau!$E$92))","v":""}]
["25ème",{"$f":"Tableau!F70","v":""},{"$f":"Tableau!E70","v":""}]
["26ème",{"$f":"IF(Tableau!$G$67=\"\",\"\",IF(Tableau!$G$67=\"p\",Tableau!$I$67,Tableau!$I$73))","v":""},{"$f":"IF(Tableau!$G$67=\"\",\"\",IF(Tableau!$G$67=\"p\",Tableau!$H$73,Tableau!$H$67))","v":""}]
["27ème",{"$f":"Tableau!L83","v":""},{"$f":"Tableau!K83","v":""}]
["28ème",{"$f":"IF(Tableau!$M$83=\"\",\"\",IF(Tableau!$M$83=\"p\",Tableau!$O$83,Tableau!$O$84))","v":""},{"$f":"IF(Tableau!$M$83=\"\",\"\",IF(Tableau!$M$83=\"p\",Tableau!$N$83,Tableau!$N$84))","v":""}]
["29ème",{"$f":"Tableau!I79","v":""},{"$f":"Tableau!H79","v":""}]
["30ème",{"$f":"IF(Tableau!$J$78=\"\",\"\",IF(Tableau!$J$78=\"p\",Tableau!$L$78,Tableau!$L$80))","v":""},{"$f":"IF(Tableau!$J$78=\"\",\"\",IF(Tableau!$J$78=\"p\",Tableau!$K$78,Tableau!$K$80))","v":""}]
["31ème",{"$f":"Tableau!L87","v":""},{"$f":"Tableau!K87","v":""}]
["32ème",{"$f":"IF(Tableau!$M$87=\"\",\"\",IF(Tableau!$M$87=\"p\",Tableau!$O$87,Tableau!$O$88))","v":""},{"$f":"IF(Tableau!$M$87=\"\",\"\",IF(Tableau!$M$87=\"p\",Tableau!$N$87,Tableau!$N$88))","v":""}]