{"text_format":"1","workbook":"xlsx","n_sheets":13,"sheets":["Engagés","Poule 1","Poule 2","Poule 3","Poule 4","Poule 5","Poule 6","Poule 7","Poule 8","Résultats de poule","Tableau","Classement TA","Classement Général"],"not_rendered":{"charts":0,"images":81,"macros":1,"external_links":1,"defined_names":1,"comments":0,"pivot_tables":0},"unopened":[],"bounds":{"document_bytes":16777216,"sheet_cells":100000,"rows_first":2000,"rows_last":500,"rows_between":2000,"halvings":0,"cell_chars":16384,"cell_head_chars":4096},"cells_cut":0,"cells_raw":0,"read":"whole","date_system":"1900"}

{"sheet":"Engagés","index":0,"n_rows":37,"n_cols":14,"rows_kept":37,"cut":false,"hidden":false,"merged":[[17,6,17,9],[17,10,17,13],[23,6,23,9],[23,10,23,13],[0,0,2,1],[0,2,1,2],[5,10,5,13],[5,6,5,9],[11,6,11,9],[11,10,11,13]]}
["Comité de Paris et Est-Francilien",null,"BADMINTON","DATE :","13 dec"]
[null,null,null,"LIEU :","LR"]
[null,null,"TABLEAU A","CATEGORIE :","BG PROMO"]
["Tête de série","ETABLISSEMENT","NOM","PRENOM","SIGLE"]
[]
[1,"ALBERT DE MUN","CHAROLLOIS J","JULES","94-4-ADMN",null,"Poule 1",null,null,null,"Poule 2"]
[2,"MARIE CLOTILDE","GARDES","ADRIEN","75-2-SCP",null,1,{"$f":"VLOOKUP($G7,$A$1:$E$37,3,FALSE)","v":"CHAROLLOIS J"},{"$f":"VLOOKUP($G7,$A$1:$E$37,4,FALSE)","v":"JULES"},{"$f":"VLOOKUP($G7,$A$1:$E$37,5,FALSE)","v":"94-4-ADMN"},2,{"$f":"VLOOKUP($K7,$A$1:$E$37,3,FALSE)","v":"GARDES"},{"$f":"VLOOKUP($K7,$A$1:$E$37,4,FALSE)","v":"ADRIEN"},{"$f":"VLOOKUP($K7,$A$1:$E$37,5,FALSE)","v":"75-2-SCP"}]
[3,"ETOILE SP. LA ROCHEFOUCAULD","BOURDON","MAXIME","75-4-LRPA",null,16,{"$f":"VLOOKUP($G8,$A$1:$E$37,3,FALSE)","v":"COHEN"},{"$f":"VLOOKUP($G8,$A$1:$E$37,4,FALSE)","v":"HADRIEN"},{"$f":"VLOOKUP($G8,$A$1:$E$37,5,FALSE)","v":"94-4-PROV"},15,{"$f":"VLOOKUP($K8,$A$1:$E$37,3,FALSE)","v":"D'HARCOURT"},{"$f":"VLOOKUP($K8,$A$1:$E$37,4,FALSE)","v":"RAPHAEL"},{"$f":"VLOOKUP($K8,$A$1:$E$37,5,FALSE)","v":"75-4-LRPA"}]
[4,"ESSOR SPORTIF ET CULTUREL","DA VINHA","LEANDRE","75-4-ELIP",null,17,{"$f":"VLOOKUP($G9,$A$1:$E$37,3,FALSE)","v":"ROUVIER"},{"$f":"VLOOKUP($G9,$A$1:$E$37,4,FALSE)","v":"RAPHAEL"},{"$f":"VLOOKUP($G9,$A$1:$E$37,5,FALSE)","v":"75-4-BNDP"},18,{"$f":"VLOOKUP($K9,$A$1:$E$37,3,FALSE)","v":"BENNANI BRAOULI"},{"$f":"VLOOKUP($K9,$A$1:$E$37,4,FALSE)","v":"FAYL"},{"$f":"VLOOKUP($K9,$A$1:$E$37,5,FALSE)","v":"94-4-ADMN"}]
[5,"COL-LYC BOSSUET NOTRE DAME","BALAHU DE NOIRON","JULES","75-4-BNDP",null,32,{"$f":"VLOOKUP($G10,$A$1:$E$37,3,FALSE)","v":0},{"$f":"VLOOKUP($G10,$A$1:$E$37,4,FALSE)","v":0},{"$f":"VLOOKUP($G10,$A$1:$E$37,5,FALSE)","v":0},31,{"$f":"VLOOKUP($K10,$A$1:$E$37,3,FALSE)","v":0},{"$f":"VLOOKUP($K10,$A$1:$E$37,4,FALSE)","v":0},{"$f":"VLOOKUP($K10,$A$1:$E$37,5,FALSE)","v":0}]
[6,"ETOILE SP. LA ROCHEFOUCAULD","COULET","SIXTE","75-4-LRPA"]
[7,"STANISLAS","NEOUZE","GUILHEM","75-4-STAP",null,"Poule 3",null,null,null,"Poule 4"]
[8,"ETOILE SP. LA ROCHEFOUCAULD","RAUFFET","HELIE","75-4-LRPA",null,3,{"$f":"VLOOKUP($G13,$A$1:$E$37,3,FALSE)","v":"BOURDON"},{"$f":"VLOOKUP($G13,$A$1:$E$37,4,FALSE)","v":"MAXIME"},{"$f":"VLOOKUP($G13,$A$1:$E$37,5,FALSE)","v":"75-4-LRPA"},4,{"$f":"VLOOKUP($K13,$A$1:$E$37,3,FALSE)","v":"DA VINHA"},{"$f":"VLOOKUP($K13,$A$1:$E$37,4,FALSE)","v":"LEANDRE"},{"$f":"VLOOKUP($K13,$A$1:$E$37,5,FALSE)","v":"75-4-ELIP"}]
[9,"SAINT MICHEL","PROTIN","CLEMENT","94-4-SMSM",null,14,{"$f":"VLOOKUP($G14,$A$1:$E$37,3,FALSE)","v":"ASSIER DE POMPIGNAN"},{"$f":"VLOOKUP($G14,$A$1:$E$37,4,FALSE)","v":"JOSEPH"},{"$f":"VLOOKUP($G14,$A$1:$E$37,5,FALSE)","v":"75-4-STAP"},13,{"$f":"VLOOKUP($K14,$A$1:$E$37,3,FALSE)","v":"JACOB"},{"$f":"VLOOKUP($K14,$A$1:$E$37,4,FALSE)","v":"BAPTISTE"},{"$f":"VLOOKUP($K14,$A$1:$E$37,5,FALSE)","v":"75-4-SMPP"}]
[10,"ESSOR SPORTIF ET CULTUREL","GAREL","ARTHUR","75-4-ELIP",null,19,{"$f":"VLOOKUP($G15,$A$1:$E$37,3,FALSE)","v":"RATOUIS"},{"$f":"VLOOKUP($G15,$A$1:$E$37,4,FALSE)","v":"LEO"},{"$f":"VLOOKUP($G15,$A$1:$E$37,5,FALSE)","v":"94-4-SMSM"},20,{"$f":"VLOOKUP($K15,$A$1:$E$37,3,FALSE)","v":"BAILLON"},{"$f":"VLOOKUP($K15,$A$1:$E$37,4,FALSE)","v":"VICTOR"},{"$f":"VLOOKUP($K15,$A$1:$E$37,5,FALSE)","v":"94-4-ADMN"}]
[11,"COL-LYC BOSSUET NOTRE DAME","ROBERT MENDES","THOMAS","75-4-BNDP",null,30,{"$f":"VLOOKUP($G16,$A$1:$E$37,3,FALSE)","v":0},{"$f":"VLOOKUP($G16,$A$1:$E$37,4,FALSE)","v":0},{"$f":"VLOOKUP($G16,$A$1:$E$37,5,FALSE)","v":0},29,{"$f":"VLOOKUP($K16,$A$1:$E$37,3,FALSE)","v":0},{"$f":"VLOOKUP($K16,$A$1:$E$37,4,FALSE)","v":0},{"$f":"VLOOKUP($K16,$A$1:$E$37,5,FALSE)","v":0}]
[12,"ETOILE SP. LA ROCHEFOUCAULD","LHUERRE","MAXIME","75-4-LRPA"]
[13,"ST MICHEL DE PICPUS","JACOB","BAPTISTE","75-4-SMPP",null,"Poule 5",null,null,null,"Poule 6"]
[14,"STANISLAS","ASSIER DE POMPIGNAN","JOSEPH","75-4-STAP",null,5,{"$f":"VLOOKUP($G19,$A$1:$E$37,3,FALSE)","v":"BALAHU DE NOIRON"},{"$f":"VLOOKUP($G19,$A$1:$E$37,4,FALSE)","v":"JULES"},{"$f":"VLOOKUP($G19,$A$1:$E$37,5,FALSE)","v":"75-4-BNDP"},6,{"$f":"VLOOKUP($K19,$A$1:$E$37,3,FALSE)","v":"COULET"},{"$f":"VLOOKUP($K19,$A$1:$E$37,4,FALSE)","v":"SIXTE"},{"$f":"VLOOKUP($K19,$A$1:$E$37,5,FALSE)","v":"75-4-LRPA"}]
[15,"ETOILE SP. LA ROCHEFOUCAULD","D'HARCOURT","RAPHAEL","75-4-LRPA",null,12,{"$f":"VLOOKUP($G20,$A$1:$E$37,3,FALSE)","v":"LHUERRE"},{"$f":"VLOOKUP($G20,$A$1:$E$37,4,FALSE)","v":"MAXIME"},{"$f":"VLOOKUP($G20,$A$1:$E$37,5,FALSE)","v":"75-4-LRPA"},11,{"$f":"VLOOKUP($K20,$A$1:$E$37,3,FALSE)","v":"ROBERT MENDES"},{"$f":"VLOOKUP($K20,$A$1:$E$37,4,FALSE)","v":"THOMAS"},{"$f":"VLOOKUP($K20,$A$1:$E$37,5,FALSE)","v":"75-4-BNDP"}]
[16,"PROVIDENCE","COHEN","HADRIEN","94-4-PROV",null,21,{"$f":"VLOOKUP($G21,$A$1:$E$37,3,FALSE)","v":"BOUSQUET GRIJALVO"},{"$f":"VLOOKUP($G21,$A$1:$E$37,4,FALSE)","v":"ARTHUR"},{"$f":"VLOOKUP($G21,$A$1:$E$37,5,FALSE)","v":"75-4-ELIP"},22,{"$f":"VLOOKUP($K21,$A$1:$E$37,3,FALSE)","v":"BERGERAULT"},{"$f":"VLOOKUP($K21,$A$1:$E$37,4,FALSE)","v":"SACHA"},{"$f":"VLOOKUP($K21,$A$1:$E$37,5,FALSE)","v":"94-4-SMSM"}]
[17,"COL-LYC BOSSUET NOTRE DAME","ROUVIER","RAPHAEL","75-4-BNDP",null,28,{"$f":"VLOOKUP($G22,$A$1:$E$37,3,FALSE)","v":0},{"$f":"VLOOKUP($G22,$A$1:$E$37,4,FALSE)","v":0},{"$f":"VLOOKUP($G22,$A$1:$E$37,5,FALSE)","v":0},27,{"$f":"VLOOKUP($K22,$A$1:$E$37,3,FALSE)","v":0},{"$f":"VLOOKUP($K22,$A$1:$E$37,4,FALSE)","v":0},{"$f":"VLOOKUP($K22,$A$1:$E$37,5,FALSE)","v":0}]
[18,"ALBERT DE MUN","BENNANI BRAOULI","FAYL","94-4-ADMN"]
[19,"SAINT MICHEL","RATOUIS","LEO","94-4-SMSM",null,"Poule 7",null,null,null,"Poule 8"]
[20,"ALBERT DE MUN","BAILLON","VICTOR","94-4-ADMN",null,7,{"$f":"VLOOKUP($G25,$A$1:$E$37,3,FALSE)","v":"NEOUZE"},{"$f":"VLOOKUP($G25,$A$1:$E$37,4,FALSE)","v":"GUILHEM"},{"$f":"VLOOKUP($G25,$A$1:$E$37,5,FALSE)","v":"75-4-STAP"},8,{"$f":"VLOOKUP($K25,$A$1:$E$37,3,FALSE)","v":"RAUFFET"},{"$f":"VLOOKUP($K25,$A$1:$E$37,4,FALSE)","v":"HELIE"},{"$f":"VLOOKUP($K25,$A$1:$E$37,5,FALSE)","v":"75-4-LRPA"}]
[21,"ESSOR SPORTIF ET CULTUREL","BOUSQUET GRIJALVO","ARTHUR","75-4-ELIP",null,10,{"$f":"VLOOKUP($G26,$A$1:$E$37,3,FALSE)","v":"GAREL"},{"$f":"VLOOKUP($G26,$A$1:$E$37,4,FALSE)","v":"ARTHUR"},{"$f":"VLOOKUP($G26,$A$1:$E$37,5,FALSE)","v":"75-4-ELIP"},9,{"$f":"VLOOKUP($K26,$A$1:$E$37,3,FALSE)","v":"PROTIN"},{"$f":"VLOOKUP($K26,$A$1:$E$37,4,FALSE)","v":"CLEMENT"},{"$f":"VLOOKUP($K26,$A$1:$E$37,5,FALSE)","v":"94-4-SMSM"}]
[22,"SAINT MICHEL","BERGERAULT","SACHA","94-4-SMSM",null,23,{"$f":"VLOOKUP($G27,$A$1:$E$37,3,FALSE)","v":0},{"$f":"VLOOKUP($G27,$A$1:$E$37,4,FALSE)","v":0},{"$f":"VLOOKUP($G27,$A$1:$E$37,5,FALSE)","v":0},24,{"$f":"VLOOKUP($K27,$A$1:$E$37,3,FALSE)","v":0},{"$f":"VLOOKUP($K27,$A$1:$E$37,4,FALSE)","v":0},{"$f":"VLOOKUP($K27,$A$1:$E$37,5,FALSE)","v":0}]
[23,null,null,null,null,null,26,{"$f":"VLOOKUP($G28,$A$1:$E$37,3,FALSE)","v":0},{"$f":"VLOOKUP($G28,$A$1:$E$37,4,FALSE)","v":0},{"$f":"VLOOKUP($G28,$A$1:$E$37,5,FALSE)","v":0},25,{"$f":"VLOOKUP($K28,$A$1:$E$37,3,FALSE)","v":0},{"$f":"VLOOKUP($K28,$A$1:$E$37,4,FALSE)","v":0},{"$f":"VLOOKUP($K28,$A$1:$E$37,5,FALSE)","v":0}]
[24]
[25]
[26]
[27]
[28]
[29]
[30]
[31]
[32]

{"sheet":"Poule 1","index":1,"n_rows":24,"n_cols":7,"rows_kept":24,"cut":false,"hidden":false,"merged":[[22,2,22,3],[20,0,20,1],[18,4,18,6],[11,0,11,2],[12,0,12,2],[14,0,14,2],[17,0,17,2],[18,0,18,3],[21,4,21,5],[19,0,19,1],[15,0,15,2],[16,0,16,2],[19,2,19,3],[8,0,8,2],[9,0,9,2],[10,0,10,2],[1,0,1,2],[1,3,1,6],[0,0,0,2],[0,3,0,4],[22,0,22,1],[20,2,20,3],[23,4,23,5],[22,4,22,5],[13,0,13,6],[14,3,14,4],[23,2,23,3],[21,0,21,1],[23,0,23,1],[21,2,21,3],[19,4,19,5],[20,4,20,5],[7,0,7,6],[8,3,8,4]]}
[{"$f":"Engagés!C1","v":"BADMINTON"},null,null,{"$f":"Engagés!C3","v":"TABLEAU A"}]
["POULE 1"]
[null,"NOM","Prénom","Sigle","Vict","Def","Classement"]
[1,{"$f":"VLOOKUP($A4,Engagés!$A$1:$E$376,3,FALSE)","v":"CHAROLLOIS J"},{"$f":"VLOOKUP($A4,Engagés!$A$1:$E$376,4,FALSE)","v":"JULES"},{"$f":"VLOOKUP($A4,Engagés!$A$1:$E$376,5,FALSE)","v":"94-4-ADMN"},null,null,"1er"]
[16,{"$f":"VLOOKUP($A5,Engagés!$A$1:$E$376,3,FALSE)","v":"COHEN"},{"$f":"VLOOKUP($A5,Engagés!$A$1:$E$376,4,FALSE)","v":"HADRIEN"},{"$f":"VLOOKUP($A5,Engagés!$A$1:$E$376,5,FALSE)","v":"94-4-PROV"},null,null,"3ème"]
[17,{"$f":"VLOOKUP($A6,Engagés!$A$1:$E$376,3,FALSE)","v":"ROUVIER"},{"$f":"VLOOKUP($A6,Engagés!$A$1:$E$376,4,FALSE)","v":"RAPHAEL"},{"$f":"VLOOKUP($A6,Engagés!$A$1:$E$376,5,FALSE)","v":"75-4-BNDP"},null,null,"2ème"]
[32,{"$f":"VLOOKUP($A7,Engagés!$A$1:$E$376,3,FALSE)","v":0},{"$f":"VLOOKUP($A7,Engagés!$A$1:$E$376,4,FALSE)","v":0},{"$f":"VLOOKUP($A7,Engagés!$A$1:$E$376,5,FALSE)","v":0},null,null,"4ème"]
["Si poule de 4 joueurs alors…"]
["Déroulement",null,null,"Joueurs A contre Joueur B",null,"Vainqueur","Score"]
["Match 1",null,null,{"$f":"B4","v":"CHAROLLOIS J"},{"$f":"B7","v":0}]
["Match 2",null,null,{"$f":"B5","v":"COHEN"},{"$f":"B6","v":"ROUVIER"}]
["Finale vainqueur Match 1 contre vainqueur Match 2",null,null,{"$f":"IF(F10=\"\",\"\",F10)","v":""},{"$f":"IF(F11=\"\",\"\",F11)","v":""}]
["Petite finale entre les deux perdants des matchs 1 et 2",null,null,{"$f":"IF(D12=\"\",\"\",IF(D12=D10,E10,D10))","v":""},{"$f":"IF(E12=\"\",\"\",IF(E12=D11,E11,D11))","v":""}]
["Si poule de 3 joueurs alors…"]
["Déroulement",null,null,"Joueurs A contre Joueur B",null,"Vainqueur","Score"]
["Match 1",null,null,{"$f":"B4","v":"CHAROLLOIS J"},{"$f":"B6","v":"ROUVIER"},"CHAROLLOIS J"]
["Match 2",null,null,{"$f":"B5","v":"COHEN"},{"$f":"B6","v":"ROUVIER"},"ROUVIER"]
["Match 3",null,null,{"$f":"B4","v":"CHAROLLOIS J"},{"$f":"B5","v":"COHEN"},"CHAROLLOIS J"]
["CLASSEMENT",null,null,null,{"$f":"A2","v":"POULE 1"}]
[null,null,"NOM",null,"PRENOM",null,"SIGLE"]
["1er",null,{"$f":"IF($G$4=\"1er\", $B$4,IF($G$5=\"1er\",$B$5,IF($G$6=\"1er\",$B$6,IF($G$7=\"1er\",$B$7,\"\"))))","v":"CHAROLLOIS J"},null,{"$f":"IF($G$4=\"1er\", $C$4,IF($G$5=\"1er\",$C$5,IF($G$6=\"1er\",$C$6,IF($G$7=\"1er\",$C$7,\"\"))))","v":"JULES"},null,{"$f":"IF($G$4=\"1er\", $D$4,IF($G$5=\"1er\",$D$5,IF($G$6=\"1er\",$D$6,IF($G$7=\"1er\",$D$7,\"\"))))","v":"94-4-ADMN"}]
["2ème",null,{"$f":"IF($G$4=\"2ème\", $B$4,IF($G$5=\"2ème\",$B$5,IF($G$6=\"2ème\",$B$6,IF($G$7=\"2ème\",$B$7,\"\"))))","v":"ROUVIER"},null,{"$f":"IF($G$4=\"2ème\", $C$4,IF($G$5=\"2ème\",$C$5,IF($G$6=\"2ème\",$C$6,IF($G$7=\"2ème\",$C$7,\"\"))))","v":"RAPHAEL"},null,{"$f":"IF($G$4=\"2ème\", $D$4,IF($G$5=\"2ème\",$D$5,IF($G$6=\"2ème\",$D$6,IF($G$7=\"2ème\",$D$7,\"\"))))","v":"75-4-BNDP"}]
["3ème",null,{"$f":"IF($G$4=\"3ème\", $B$4,IF($G$5=\"3ème\",$B$5,IF($G$6=\"3ème\",$B$6,IF($G$7=\"3ème\",$B$7,\"\"))))","v":"COHEN"},null,{"$f":"IF($G$4=\"3ème\", $C$4,IF($G$5=\"3ème\",$C$5,IF($G$6=\"3ème\",$C$6,IF($G$7=\"3ème\",$C$7,\"\"))))","v":"HADRIEN"},null,{"$f":"IF($G$4=\"3ème\", $D$4,IF($G$5=\"3ème\",$D$5,IF($G$6=\"3ème\",$D$6,IF($G$7=\"3ème\",$D$7,\"\"))))","v":"94-4-PROV"}]
["4ème",null,{"$f":"IF($G$4=\"4ème\", $B$4,IF($G$5=\"4ème\",$B$5,IF($G$6=\"4ème\",$B$6,IF($G$7=\"4ème\",$B$7,\"\"))))","v":0},null,{"$f":"IF($G$4=\"4ème\", $C$4,IF($G$5=\"4ème\",$C$5,IF($G$6=\"4ème\",$C$6,IF($G$7=\"4ème\",$C$7,\"\"))))","v":0},null,{"$f":"IF($G$4=\"4ème\", $D$4,IF($G$5=\"4ème\",$D$5,IF($G$6=\"4ème\",$D$6,IF($G$7=\"4ème\",$D$7,\"\"))))","v":0}]

{"sheet":"Poule 2","index":2,"n_rows":24,"n_cols":7,"rows_kept":24,"cut":false,"hidden":false,"merged":[[23,0,23,1],[23,2,23,3],[23,4,23,5],[21,0,21,1],[21,2,21,3],[21,4,21,5],[22,0,22,1],[22,2,22,3],[22,4,22,5],[17,0,17,2],[18,0,18,3],[18,4,18,6],[20,0,20,1],[20,2,20,3],[20,4,20,5],[19,0,19,1],[19,2,19,3],[19,4,19,5],[0,3,0,4],[15,0,15,2],[16,0,16,2],[1,0,1,2],[1,3,1,6],[7,0,7,6],[8,0,8,2],[8,3,8,4],[9,0,9,2],[10,0,10,2],[11,0,11,2],[12,0,12,2],[13,0,13,6],[14,0,14,2],[14,3,14,4],[0,0,0,2]]}
[{"$f":"Engagés!C1","v":"BADMINTON"},null,null,{"$f":"Engagés!C3","v":"TABLEAU A"}]
["POULE 2"]
[null,"NOM","Prénom","Sigle","Vict","Def","Classement"]
[2,{"$f":"VLOOKUP($A4,Engagés!$A$1:$E$376,3,FALSE)","v":"GARDES"},{"$f":"VLOOKUP($A4,Engagés!$A$1:$E$376,4,FALSE)","v":"ADRIEN"},{"$f":"VLOOKUP($A4,Engagés!$A$1:$E$376,5,FALSE)","v":"75-2-SCP"},null,null,"2ème"]
[15,{"$f":"VLOOKUP($A5,Engagés!$A$1:$E$376,3,FALSE)","v":"D'HARCOURT"},{"$f":"VLOOKUP($A5,Engagés!$A$1:$E$376,4,FALSE)","v":"RAPHAEL"},{"$f":"VLOOKUP($A5,Engagés!$A$1:$E$376,5,FALSE)","v":"75-4-LRPA"},null,null,"1er"]
[18,{"$f":"VLOOKUP($A6,Engagés!$A$1:$E$376,3,FALSE)","v":"BENNANI BRAOULI"},{"$f":"VLOOKUP($A6,Engagés!$A$1:$E$376,4,FALSE)","v":"FAYL"},{"$f":"VLOOKUP($A6,Engagés!$A$1:$E$376,5,FALSE)","v":"94-4-ADMN"},null,null,"3ème"]
[31,{"$f":"VLOOKUP($A7,Engagés!$A$1:$E$376,3,FALSE)","v":0},{"$f":"VLOOKUP($A7,Engagés!$A$1:$E$376,4,FALSE)","v":0},{"$f":"VLOOKUP($A7,Engagés!$A$1:$E$376,5,FALSE)","v":0},null,null,"4ème"]
["Si poule de 4 joueurs alors…"]
["Déroulement",null,null,"Joueurs A contre Joueur B",null,"Vainqueur","Score"]
["Match 1",null,null,{"$f":"B4","v":"GARDES"},{"$f":"B7","v":0}]
["Match 2",null,null,{"$f":"B5","v":"D'HARCOURT"},{"$f":"B6","v":"BENNANI BRAOULI"}]
["Finale vainqueur Match 1 contre vainqueur Match 2",null,null,{"$f":"IF(F10=\"\",\"\",F10)","v":""},{"$f":"IF(F11=\"\",\"\",F11)","v":""}]
["Petite finale entre les deux perdants des matchs 1 et 2",null,null,{"$f":"IF(D12=\"\",\"\",IF(D12=D10,E10,D10))","v":""},{"$f":"IF(E12=\"\",\"\",IF(E12=D11,E11,D11))","v":""}]
["Si poule de 3 joueurs alors…"]
["Déroulement",null,null,"Joueurs A contre Joueur B",null,"Vainqueur","Score"]
["Match 1",null,null,{"$f":"B4","v":"GARDES"},{"$f":"B6","v":"BENNANI BRAOULI"},"GARDES"]
["Match 2",null,null,{"$f":"B5","v":"D'HARCOURT"},{"$f":"B6","v":"BENNANI BRAOULI"},"D'HARCOURT"]
["Match 3",null,null,{"$f":"B4","v":"GARDES"},{"$f":"B5","v":"D'HARCOURT"},"D'HARCOURT"]
["CLASSEMENT",null,null,null,{"$f":"A2","v":"POULE 2"}]
[null,null,"NOM",null,"PRENOM",null,"SIGLE"]
["1er",null,{"$f":"IF($G$4=\"1er\", $B$4,IF($G$5=\"1er\",$B$5,IF($G$6=\"1er\",$B$6,IF($G$7=\"1er\",$B$7,\"\"))))","v":"D'HARCOURT"},null,{"$f":"IF($G$4=\"1er\", $C$4,IF($G$5=\"1er\",$C$5,IF($G$6=\"1er\",$C$6,IF($G$7=\"1er\",$C$7,\"\"))))","v":"RAPHAEL"},null,{"$f":"IF($G$4=\"1er\", $D$4,IF($G$5=\"1er\",$D$5,IF($G$6=\"1er\",$D$6,IF($G$7=\"1er\",$D$7,\"\"))))","v":"75-4-LRPA"}]
["2ème",null,{"$f":"IF($G$4=\"2ème\", $B$4,IF($G$5=\"2ème\",$B$5,IF($G$6=\"2ème\",$B$6,IF($G$7=\"2ème\",$B$7,\"\"))))","v":"GARDES"},null,{"$f":"IF($G$4=\"2ème\", $C$4,IF($G$5=\"2ème\",$C$5,IF($G$6=\"2ème\",$C$6,IF($G$7=\"2ème\",$C$7,\"\"))))","v":"ADRIEN"},null,{"$f":"IF($G$4=\"2ème\", $D$4,IF($G$5=\"2ème\",$D$5,IF($G$6=\"2ème\",$D$6,IF($G$7=\"2ème\",$D$7,\"\"))))","v":"75-2-SCP"}]
["3ème",null,{"$f":"IF($G$4=\"3ème\", $B$4,IF($G$5=\"3ème\",$B$5,IF($G$6=\"3ème\",$B$6,IF($G$7=\"3ème\",$B$7,\"\"))))","v":"BENNANI BRAOULI"},null,{"$f":"IF($G$4=\"3ème\", $C$4,IF($G$5=\"3ème\",$C$5,IF($G$6=\"3ème\",$C$6,IF($G$7=\"3ème\",$C$7,\"\"))))","v":"FAYL"},null,{"$f":"IF($G$4=\"3ème\", $D$4,IF($G$5=\"3ème\",$D$5,IF($G$6=\"3ème\",$D$6,IF($G$7=\"3ème\",$D$7,\"\"))))","v":"94-4-ADMN"}]
["4ème",null,{"$f":"IF($G$4=\"4ème\", $B$4,IF($G$5=\"4ème\",$B$5,IF($G$6=\"4ème\",$B$6,IF($G$7=\"4ème\",$B$7,\"\"))))","v":0},null,{"$f":"IF($G$4=\"4ème\", $C$4,IF($G$5=\"4ème\",$C$5,IF($G$6=\"4ème\",$C$6,IF($G$7=\"4ème\",$C$7,\"\"))))","v":0},null,{"$f":"IF($G$4=\"4ème\", $D$4,IF($G$5=\"4ème\",$D$5,IF($G$6=\"4ème\",$D$6,IF($G$7=\"4ème\",$D$7,\"\"))))","v":0}]

{"sheet":"Poule 3","index":3,"n_rows":24,"n_cols":7,"rows_kept":24,"cut":false,"hidden":false,"merged":[[23,0,23,1],[23,2,23,3],[23,4,23,5],[21,0,21,1],[21,2,21,3],[21,4,21,5],[22,0,22,1],[22,2,22,3],[22,4,22,5],[17,0,17,2],[18,0,18,3],[18,4,18,6],[20,0,20,1],[20,2,20,3],[20,4,20,5],[19,0,19,1],[19,2,19,3],[19,4,19,5],[0,3,0,4],[15,0,15,2],[16,0,16,2],[1,0,1,2],[1,3,1,6],[7,0,7,6],[8,0,8,2],[8,3,8,4],[9,0,9,2],[10,0,10,2],[11,0,11,2],[12,0,12,2],[13,0,13,6],[14,0,14,2],[14,3,14,4],[0,0,0,2]]}
[{"$f":"Engagés!C1","v":"BADMINTON"},null,null,{"$f":"Engagés!C3","v":"TABLEAU A"}]
["POULE 3"]
[null,"NOM","Prénom","Sigle","Vict","Def","Classement"]
[3,{"$f":"VLOOKUP($A4,Engagés!$A$1:$E$376,3,FALSE)","v":"BOURDON"},{"$f":"VLOOKUP($A4,Engagés!$A$1:$E$376,4,FALSE)","v":"MAXIME"},{"$f":"VLOOKUP($A4,Engagés!$A$1:$E$376,5,FALSE)","v":"75-4-LRPA"},null,null,"1er"]
[14,{"$f":"VLOOKUP($A5,Engagés!$A$1:$E$376,3,FALSE)","v":"ASSIER DE POMPIGNAN"},{"$f":"VLOOKUP($A5,Engagés!$A$1:$E$376,4,FALSE)","v":"JOSEPH"},{"$f":"VLOOKUP($A5,Engagés!$A$1:$E$376,5,FALSE)","v":"75-4-STAP"},null,null,"2ème"]
[19,{"$f":"VLOOKUP($A6,Engagés!$A$1:$E$376,3,FALSE)","v":"RATOUIS"},{"$f":"VLOOKUP($A6,Engagés!$A$1:$E$376,4,FALSE)","v":"LEO"},{"$f":"VLOOKUP($A6,Engagés!$A$1:$E$376,5,FALSE)","v":"94-4-SMSM"},null,null,"3ème"]
[30,{"$f":"VLOOKUP($A7,Engagés!$A$1:$E$376,3,FALSE)","v":0},{"$f":"VLOOKUP($A7,Engagés!$A$1:$E$376,4,FALSE)","v":0},{"$f":"VLOOKUP($A7,Engagés!$A$1:$E$376,5,FALSE)","v":0},null,null,"4ème"]
["Si poule de 4 joueurs alors…"]
["Déroulement",null,null,"Joueurs A contre Joueur B",null,"Vainqueur","Score"]
["Match 1",null,null,{"$f":"B4","v":"BOURDON"},{"$f":"B7","v":0}]
["Match 2",null,null,{"$f":"B5","v":"ASSIER DE POMPIGNAN"},{"$f":"B6","v":"RATOUIS"}]
["Finale vainqueur Match 1 contre vainqueur Match 2",null,null,{"$f":"IF(F10=\"\",\"\",F10)","v":""},{"$f":"IF(F11=\"\",\"\",F11)","v":""}]
["Petite finale entre les deux perdants des matchs 1 et 2",null,null,{"$f":"IF(D12=\"\",\"\",IF(D12=D10,E10,D10))","v":""},{"$f":"IF(E12=\"\",\"\",IF(E12=D11,E11,D11))","v":""}]
["Si poule de 3 joueurs alors…"]
["Déroulement",null,null,"Joueurs A contre Joueur B",null,"Vainqueur","Score"]
["Match 1",null,null,{"$f":"B4","v":"BOURDON"},{"$f":"B6","v":"RATOUIS"},"BOURDON"]
["Match 2",null,null,{"$f":"B5","v":"ASSIER DE POMPIGNAN"},{"$f":"B6","v":"RATOUIS"},"ASSIER DE POMPIGNAN"]
["Match 3",null,null,{"$f":"B4","v":"BOURDON"},{"$f":"B5","v":"ASSIER DE POMPIGNAN"},"BOURDON"]
["CLASSEMENT",null,null,null,{"$f":"A2","v":"POULE 3"}]
[null,null,"NOM",null,"PRENOM",null,"SIGLE"]
["1er",null,{"$f":"IF($G$4=\"1er\", $B$4,IF($G$5=\"1er\",$B$5,IF($G$6=\"1er\",$B$6,IF($G$7=\"1er\",$B$7,\"\"))))","v":"BOURDON"},null,{"$f":"IF($G$4=\"1er\", $C$4,IF($G$5=\"1er\",$C$5,IF($G$6=\"1er\",$C$6,IF($G$7=\"1er\",$C$7,\"\"))))","v":"MAXIME"},null,{"$f":"IF($G$4=\"1er\", $D$4,IF($G$5=\"1er\",$D$5,IF($G$6=\"1er\",$D$6,IF($G$7=\"1er\",$D$7,\"\"))))","v":"75-4-LRPA"}]
["2ème",null,{"$f":"IF($G$4=\"2ème\", $B$4,IF($G$5=\"2ème\",$B$5,IF($G$6=\"2ème\",$B$6,IF($G$7=\"2ème\",$B$7,\"\"))))","v":"ASSIER DE POMPIGNAN"},null,{"$f":"IF($G$4=\"2ème\", $C$4,IF($G$5=\"2ème\",$C$5,IF($G$6=\"2ème\",$C$6,IF($G$7=\"2ème\",$C$7,\"\"))))","v":"JOSEPH"},null,{"$f":"IF($G$4=\"2ème\", $D$4,IF($G$5=\"2ème\",$D$5,IF($G$6=\"2ème\",$D$6,IF($G$7=\"2ème\",$D$7,\"\"))))","v":"75-4-STAP"}]
["3ème",null,{"$f":"IF($G$4=\"3ème\", $B$4,IF($G$5=\"3ème\",$B$5,IF($G$6=\"3ème\",$B$6,IF($G$7=\"3ème\",$B$7,\"\"))))","v":"RATOUIS"},null,{"$f":"IF($G$4=\"3ème\", $C$4,IF($G$5=\"3ème\",$C$5,IF($G$6=\"3ème\",$C$6,IF($G$7=\"3ème\",$C$7,\"\"))))","v":"LEO"},null,{"$f":"IF($G$4=\"3ème\", $D$4,IF($G$5=\"3ème\",$D$5,IF($G$6=\"3ème\",$D$6,IF($G$7=\"3ème\",$D$7,\"\"))))","v":"94-4-SMSM"}]
["4ème",null,{"$f":"IF($G$4=\"4ème\", $B$4,IF($G$5=\"4ème\",$B$5,IF($G$6=\"4ème\",$B$6,IF($G$7=\"4ème\",$B$7,\"\"))))","v":0},null,{"$f":"IF($G$4=\"4ème\", $C$4,IF($G$5=\"4ème\",$C$5,IF($G$6=\"4ème\",$C$6,IF($G$7=\"4ème\",$C$7,\"\"))))","v":0},null,{"$f":"IF($G$4=\"4ème\", $D$4,IF($G$5=\"4ème\",$D$5,IF($G$6=\"4ème\",$D$6,IF($G$7=\"4ème\",$D$7,\"\"))))","v":0}]

{"sheet":"Poule 4","index":4,"n_rows":24,"n_cols":7,"rows_kept":24,"cut":false,"hidden":false,"merged":[[23,0,23,1],[23,2,23,3],[23,4,23,5],[21,0,21,1],[21,2,21,3],[21,4,21,5],[22,0,22,1],[22,2,22,3],[22,4,22,5],[17,0,17,2],[18,0,18,3],[18,4,18,6],[20,0,20,1],[20,2,20,3],[20,4,20,5],[19,0,19,1],[19,2,19,3],[19,4,19,5],[0,3,0,4],[15,0,15,2],[16,0,16,2],[1,0,1,2],[1,3,1,6],[7,0,7,6],[8,0,8,2],[8,3,8,4],[9,0,9,2],[10,0,10,2],[11,0,11,2],[12,0,12,2],[13,0,13,6],[14,0,14,2],[14,3,14,4],[0,0,0,2]]}
[{"$f":"Engagés!C1","v":"BADMINTON"},null,null,{"$f":"Engagés!C3","v":"TABLEAU A"}]
["POULE 4"]
[null,"NOM","Prénom","Sigle","Vict","Def","Classement"]
[4,{"$f":"VLOOKUP($A4,Engagés!$A$1:$E$376,3,FALSE)","v":"DA VINHA"},{"$f":"VLOOKUP($A4,Engagés!$A$1:$E$376,4,FALSE)","v":"LEANDRE"},{"$f":"VLOOKUP($A4,Engagés!$A$1:$E$376,5,FALSE)","v":"75-4-ELIP"},null,null,"1er"]
[13,{"$f":"VLOOKUP($A5,Engagés!$A$1:$E$376,3,FALSE)","v":"JACOB"},{"$f":"VLOOKUP($A5,Engagés!$A$1:$E$376,4,FALSE)","v":"BAPTISTE"},{"$f":"VLOOKUP($A5,Engagés!$A$1:$E$376,5,FALSE)","v":"75-4-SMPP"},null,null,"3ème"]
[20,{"$f":"VLOOKUP($A6,Engagés!$A$1:$E$376,3,FALSE)","v":"BAILLON"},{"$f":"VLOOKUP($A6,Engagés!$A$1:$E$376,4,FALSE)","v":"VICTOR"},{"$f":"VLOOKUP($A6,Engagés!$A$1:$E$376,5,FALSE)","v":"94-4-ADMN"},null,null,"2ème"]
[29,{"$f":"VLOOKUP($A7,Engagés!$A$1:$E$376,3,FALSE)","v":0},{"$f":"VLOOKUP($A7,Engagés!$A$1:$E$376,4,FALSE)","v":0},{"$f":"VLOOKUP($A7,Engagés!$A$1:$E$376,5,FALSE)","v":0},null,null,"4ème"]
["Si poule de 4 joueurs alors…"]
["Déroulement",null,null,"Joueurs A contre Joueur B",null,"Vainqueur","Score"]
["Match 1",null,null,{"$f":"B4","v":"DA VINHA"},{"$f":"B7","v":0},0]
["Match 2",null,null,{"$f":"B5","v":"JACOB"},{"$f":"B6","v":"BAILLON"},0]
["Finale vainqueur Match 1 contre vainqueur Match 2",null,null,{"$f":"IF(F10=\"\",\"\",F10)","v":0},{"$f":"IF(F11=\"\",\"\",F11)","v":0},0]
["Petite finale entre les deux perdants des matchs 1 et 2",null,null,null,null,0]
["Si poule de 3 joueurs alors…"]
["Déroulement",null,null,"Joueurs A contre Joueur B",null,"Vainqueur","Score"]
["Match 1",null,null,{"$f":"B4","v":"DA VINHA"},{"$f":"B6","v":"BAILLON"},"DA VINHA"]
["Match 2",null,null,{"$f":"B5","v":"JACOB"},{"$f":"B6","v":"BAILLON"},"BAILLON"]
["Match 3",null,null,{"$f":"B4","v":"DA VINHA"},{"$f":"B5","v":"JACOB"},"DA VINHA"]
["CLASSEMENT",null,null,null,{"$f":"A2","v":"POULE 4"}]
[null,null,"NOM",null,"PRENOM",null,"SIGLE"]
["1er",null,{"$f":"IF($G$4=\"1er\", $B$4,IF($G$5=\"1er\",$B$5,IF($G$6=\"1er\",$B$6,IF($G$7=\"1er\",$B$7,\"\"))))","v":"DA VINHA"},null,{"$f":"IF($G$4=\"1er\", $C$4,IF($G$5=\"1er\",$C$5,IF($G$6=\"1er\",$C$6,IF($G$7=\"1er\",$C$7,\"\"))))","v":"LEANDRE"},null,{"$f":"IF($G$4=\"1er\", $D$4,IF($G$5=\"1er\",$D$5,IF($G$6=\"1er\",$D$6,IF($G$7=\"1er\",$D$7,\"\"))))","v":"75-4-ELIP"}]
["2ème",null,{"$f":"IF($G$4=\"2ème\", $B$4,IF($G$5=\"2ème\",$B$5,IF($G$6=\"2ème\",$B$6,IF($G$7=\"2ème\",$B$7,\"\"))))","v":"BAILLON"},null,{"$f":"IF($G$4=\"2ème\", $C$4,IF($G$5=\"2ème\",$C$5,IF($G$6=\"2ème\",$C$6,IF($G$7=\"2ème\",$C$7,\"\"))))","v":"VICTOR"},null,{"$f":"IF($G$4=\"2ème\", $D$4,IF($G$5=\"2ème\",$D$5,IF($G$6=\"2ème\",$D$6,IF($G$7=\"2ème\",$D$7,\"\"))))","v":"94-4-ADMN"}]
["3ème",null,{"$f":"IF($G$4=\"3ème\", $B$4,IF($G$5=\"3ème\",$B$5,IF($G$6=\"3ème\",$B$6,IF($G$7=\"3ème\",$B$7,\"\"))))","v":"JACOB"},null,{"$f":"IF($G$4=\"3ème\", $C$4,IF($G$5=\"3ème\",$C$5,IF($G$6=\"3ème\",$C$6,IF($G$7=\"3ème\",$C$7,\"\"))))","v":"BAPTISTE"},null,{"$f":"IF($G$4=\"3ème\", $D$4,IF($G$5=\"3ème\",$D$5,IF($G$6=\"3ème\",$D$6,IF($G$7=\"3ème\",$D$7,\"\"))))","v":"75-4-SMPP"}]
["4ème",null,{"$f":"IF($G$4=\"4ème\", $B$4,IF($G$5=\"4ème\",$B$5,IF($G$6=\"4ème\",$B$6,IF($G$7=\"4ème\",$B$7,\"\"))))","v":0},null,{"$f":"IF($G$4=\"4ème\", $C$4,IF($G$5=\"4ème\",$C$5,IF($G$6=\"4ème\",$C$6,IF($G$7=\"4ème\",$C$7,\"\"))))","v":0},null,{"$f":"IF($G$4=\"4ème\", $D$4,IF($G$5=\"4ème\",$D$5,IF($G$6=\"4ème\",$D$6,IF($G$7=\"4ème\",$D$7,\"\"))))","v":0}]

{"sheet":"Poule 5","index":5,"n_rows":24,"n_cols":7,"rows_kept":24,"cut":false,"hidden":false,"merged":[[23,0,23,1],[23,2,23,3],[23,4,23,5],[21,0,21,1],[21,2,21,3],[21,4,21,5],[22,0,22,1],[22,2,22,3],[22,4,22,5],[20,0,20,1],[20,2,20,3],[20,4,20,5],[14,0,14,2],[14,3,14,4],[15,0,15,2],[18,4,18,6],[19,0,19,1],[19,2,19,3],[19,4,19,5],[16,0,16,2],[17,0,17,2],[18,0,18,3],[12,0,12,2],[13,0,13,6],[0,0,0,2],[0,3,0,4],[10,0,10,2],[11,0,11,2],[1,0,1,2],[1,3,1,6],[7,0,7,6],[8,0,8,2],[8,3,8,4],[9,0,9,2]]}
[{"$f":"Engagés!C1","v":"BADMINTON"},null,null,{"$f":"Engagés!C3","v":"TABLEAU A"}]
["POULE 5"]
[null,"NOM","Prénom","Sigle","Vict","Def","Classement"]
[5,{"$f":"VLOOKUP($A4,Engagés!$A$1:$E$376,3,FALSE)","v":"BALAHU DE NOIRON"},{"$f":"VLOOKUP($A4,Engagés!$A$1:$E$376,4,FALSE)","v":"JULES"},{"$f":"VLOOKUP($A4,Engagés!$A$1:$E$376,5,FALSE)","v":"75-4-BNDP"},null,null,"2ème"]
[12,{"$f":"VLOOKUP($A5,Engagés!$A$1:$E$376,3,FALSE)","v":"LHUERRE"},{"$f":"VLOOKUP($A5,Engagés!$A$1:$E$376,4,FALSE)","v":"MAXIME"},{"$f":"VLOOKUP($A5,Engagés!$A$1:$E$376,5,FALSE)","v":"75-4-LRPA"},null,null,"1er"]
[21,{"$f":"VLOOKUP($A6,Engagés!$A$1:$E$376,3,FALSE)","v":"BOUSQUET GRIJALVO"},{"$f":"VLOOKUP($A6,Engagés!$A$1:$E$376,4,FALSE)","v":"ARTHUR"},{"$f":"VLOOKUP($A6,Engagés!$A$1:$E$376,5,FALSE)","v":"75-4-ELIP"},null,null,"3ème"]
[28,{"$f":"VLOOKUP($A7,Engagés!$A$1:$E$376,3,FALSE)","v":0},{"$f":"VLOOKUP($A7,Engagés!$A$1:$E$376,4,FALSE)","v":0},{"$f":"VLOOKUP($A7,Engagés!$A$1:$E$376,5,FALSE)","v":0},null,null,"4ème"]
["Si poule de 4 joueurs alors…"]
["Déroulement",null,null,"Joueurs A contre Joueur B",null,"Vainqueur","Score"]
["Match 1",null,null,{"$f":"B4","v":"BALAHU DE NOIRON"},{"$f":"B7","v":0},0]
["Match 2",null,null,{"$f":"B5","v":"LHUERRE"},{"$f":"B6","v":"BOUSQUET GRIJALVO"},0]
["Finale vainqueur Match 1 contre vainqueur Match 2",null,null,{"$f":"IF(F10=\"\",\"\",F10)","v":0},{"$f":"IF(F11=\"\",\"\",F11)","v":0},0]
["Petite finale entre les deux perdants des matchs 1 et 2",null,null,null,null,0]
["Si poule de 3 joueurs alors…"]
["Déroulement",null,null,"Joueurs A contre Joueur B",null,"Vainqueur","Score"]
["Match 1",null,null,{"$f":"B4","v":"BALAHU DE NOIRON"},{"$f":"B6","v":"BOUSQUET GRIJALVO"},"BALAHU DE NOIRON"]
["Match 2",null,null,{"$f":"B5","v":"LHUERRE"},{"$f":"B6","v":"BOUSQUET GRIJALVO"},"LHUERRE"]
["Match 3",null,null,{"$f":"B4","v":"BALAHU DE NOIRON"},{"$f":"B5","v":"LHUERRE"},"LHUERRE"]
["CLASSEMENT",null,null,null,{"$f":"A2","v":"POULE 5"}]
[null,null,"NOM",null,"PRENOM",null,"SIGLE"]
["1er",null,{"$f":"IF($G$4=\"1er\", $B$4,IF($G$5=\"1er\",$B$5,IF($G$6=\"1er\",$B$6,IF($G$7=\"1er\",$B$7,\"\"))))","v":"LHUERRE"},null,{"$f":"IF($G$4=\"1er\", $C$4,IF($G$5=\"1er\",$C$5,IF($G$6=\"1er\",$C$6,IF($G$7=\"1er\",$C$7,\"\"))))","v":"MAXIME"},null,{"$f":"IF($G$4=\"1er\", $D$4,IF($G$5=\"1er\",$D$5,IF($G$6=\"1er\",$D$6,IF($G$7=\"1er\",$D$7,\"\"))))","v":"75-4-LRPA"}]
["2ème",null,{"$f":"IF($G$4=\"2ème\", $B$4,IF($G$5=\"2ème\",$B$5,IF($G$6=\"2ème\",$B$6,IF($G$7=\"2ème\",$B$7,\"\"))))","v":"BALAHU DE NOIRON"},null,{"$f":"IF($G$4=\"2ème\", $C$4,IF($G$5=\"2ème\",$C$5,IF($G$6=\"2ème\",$C$6,IF($G$7=\"2ème\",$C$7,\"\"))))","v":"JULES"},null,{"$f":"IF($G$4=\"2ème\", $D$4,IF($G$5=\"2ème\",$D$5,IF($G$6=\"2ème\",$D$6,IF($G$7=\"2ème\",$D$7,\"\"))))","v":"75-4-BNDP"}]
["3ème",null,{"$f":"IF($G$4=\"3ème\", $B$4,IF($G$5=\"3ème\",$B$5,IF($G$6=\"3ème\",$B$6,IF($G$7=\"3ème\",$B$7,\"\"))))","v":"BOUSQUET GRIJALVO"},null,{"$f":"IF($G$4=\"3ème\", $C$4,IF($G$5=\"3ème\",$C$5,IF($G$6=\"3ème\",$C$6,IF($G$7=\"3ème\",$C$7,\"\"))))","v":"ARTHUR"},null,{"$f":"IF($G$4=\"3ème\", $D$4,IF($G$5=\"3ème\",$D$5,IF($G$6=\"3ème\",$D$6,IF($G$7=\"3ème\",$D$7,\"\"))))","v":"75-4-ELIP"}]
["4ème",null,{"$f":"IF($G$4=\"4ème\", $B$4,IF($G$5=\"4ème\",$B$5,IF($G$6=\"4ème\",$B$6,IF($G$7=\"4ème\",$B$7,\"\"))))","v":0},null,{"$f":"IF($G$4=\"4ème\", $C$4,IF($G$5=\"4ème\",$C$5,IF($G$6=\"4ème\",$C$6,IF($G$7=\"4ème\",$C$7,\"\"))))","v":0},null,{"$f":"IF($G$4=\"4ème\", $D$4,IF($G$5=\"4ème\",$D$5,IF($G$6=\"4ème\",$D$6,IF($G$7=\"4ème\",$D$7,\"\"))))","v":0}]

{"sheet":"Poule 6","index":6,"n_rows":24,"n_cols":7,"rows_kept":24,"cut":false,"hidden":false,"merged":[[23,0,23,1],[23,2,23,3],[23,4,23,5],[21,0,21,1],[21,2,21,3],[21,4,21,5],[22,0,22,1],[22,2,22,3],[22,4,22,5],[20,0,20,1],[20,2,20,3],[20,4,20,5],[14,0,14,2],[14,3,14,4],[15,0,15,2],[18,4,18,6],[19,0,19,1],[19,2,19,3],[19,4,19,5],[16,0,16,2],[17,0,17,2],[18,0,18,3],[12,0,12,2],[13,0,13,6],[0,0,0,2],[0,3,0,4],[10,0,10,2],[11,0,11,2],[1,0,1,2],[1,3,1,6],[7,0,7,6],[8,0,8,2],[8,3,8,4],[9,0,9,2]]}
[{"$f":"Engagés!C1","v":"BADMINTON"},null,null,{"$f":"Engagés!C3","v":"TABLEAU A"}]
["POULE 6"]
[null,"NOM","Prénom","Sigle","Vict","Def","Classement"]
[6,{"$f":"VLOOKUP($A4,Engagés!$A$1:$E$376,3,FALSE)","v":"COULET"},{"$f":"VLOOKUP($A4,Engagés!$A$1:$E$376,4,FALSE)","v":"SIXTE"},{"$f":"VLOOKUP($A4,Engagés!$A$1:$E$376,5,FALSE)","v":"75-4-LRPA"},null,null,"1er"]
[11,{"$f":"VLOOKUP($A5,Engagés!$A$1:$E$376,3,FALSE)","v":"ROBERT MENDES"},{"$f":"VLOOKUP($A5,Engagés!$A$1:$E$376,4,FALSE)","v":"THOMAS"},{"$f":"VLOOKUP($A5,Engagés!$A$1:$E$376,5,FALSE)","v":"75-4-BNDP"},null,null,"2ème"]
[22,{"$f":"VLOOKUP($A6,Engagés!$A$1:$E$376,3,FALSE)","v":"BERGERAULT"},{"$f":"VLOOKUP($A6,Engagés!$A$1:$E$376,4,FALSE)","v":"SACHA"},{"$f":"VLOOKUP($A6,Engagés!$A$1:$E$376,5,FALSE)","v":"94-4-SMSM"},null,null,"3ème"]
[27,{"$f":"VLOOKUP($A7,Engagés!$A$1:$E$376,3,FALSE)","v":0},{"$f":"VLOOKUP($A7,Engagés!$A$1:$E$376,4,FALSE)","v":0},{"$f":"VLOOKUP($A7,Engagés!$A$1:$E$376,5,FALSE)","v":0},null,null,"4ème"]
["Si poule de 4 joueurs alors…"]
["Déroulement",null,null,"Joueurs A contre Joueur B",null,"Vainqueur","Score"]
["Match 1",null,null,{"$f":"B4","v":"COULET"},{"$f":"B7","v":0},0]
["Match 2",null,null,{"$f":"B5","v":"ROBERT MENDES"},{"$f":"B6","v":"BERGERAULT"},0]
["Finale vainqueur Match 1 contre vainqueur Match 2",null,null,{"$f":"IF(F10=\"\",\"\",F10)","v":0},{"$f":"IF(F11=\"\",\"\",F11)","v":0},0]
["Petite finale entre les deux perdants des matchs 1 et 2",null,null,null,null,0]
["Si poule de 3 joueurs alors…"]
["Déroulement",null,null,"Joueurs A contre Joueur B",null,"Vainqueur","Score"]
["Match 1",null,null,{"$f":"B4","v":"COULET"},{"$f":"B6","v":"BERGERAULT"},"COULET"]
["Match 2",null,null,{"$f":"B5","v":"ROBERT MENDES"},{"$f":"B6","v":"BERGERAULT"},"ROBERT MENDES"]
["Match 3",null,null,{"$f":"B4","v":"COULET"},{"$f":"B5","v":"ROBERT MENDES"},"COULET"]
["CLASSEMENT",null,null,null,{"$f":"A2","v":"POULE 6"}]
[null,null,"NOM",null,"PRENOM",null,"SIGLE"]
["1er",null,{"$f":"IF($G$4=\"1er\", $B$4,IF($G$5=\"1er\",$B$5,IF($G$6=\"1er\",$B$6,IF($G$7=\"1er\",$B$7,\"\"))))","v":"COULET"},null,{"$f":"IF($G$4=\"1er\", $C$4,IF($G$5=\"1er\",$C$5,IF($G$6=\"1er\",$C$6,IF($G$7=\"1er\",$C$7,\"\"))))","v":"SIXTE"},null,{"$f":"IF($G$4=\"1er\", $D$4,IF($G$5=\"1er\",$D$5,IF($G$6=\"1er\",$D$6,IF($G$7=\"1er\",$D$7,\"\"))))","v":"75-4-LRPA"}]
["2ème",null,{"$f":"IF($G$4=\"2ème\", $B$4,IF($G$5=\"2ème\",$B$5,IF($G$6=\"2ème\",$B$6,IF($G$7=\"2ème\",$B$7,\"\"))))","v":"ROBERT MENDES"},null,{"$f":"IF($G$4=\"2ème\", $C$4,IF($G$5=\"2ème\",$C$5,IF($G$6=\"2ème\",$C$6,IF($G$7=\"2ème\",$C$7,\"\"))))","v":"THOMAS"},null,{"$f":"IF($G$4=\"2ème\", $D$4,IF($G$5=\"2ème\",$D$5,IF($G$6=\"2ème\",$D$6,IF($G$7=\"2ème\",$D$7,\"\"))))","v":"75-4-BNDP"}]
["3ème",null,{"$f":"IF($G$4=\"3ème\", $B$4,IF($G$5=\"3ème\",$B$5,IF($G$6=\"3ème\",$B$6,IF($G$7=\"3ème\",$B$7,\"\"))))","v":"BERGERAULT"},null,{"$f":"IF($G$4=\"3ème\", $C$4,IF($G$5=\"3ème\",$C$5,IF($G$6=\"3ème\",$C$6,IF($G$7=\"3ème\",$C$7,\"\"))))","v":"SACHA"},null,{"$f":"IF($G$4=\"3ème\", $D$4,IF($G$5=\"3ème\",$D$5,IF($G$6=\"3ème\",$D$6,IF($G$7=\"3ème\",$D$7,\"\"))))","v":"94-4-SMSM"}]
["4ème",null,{"$f":"IF($G$4=\"4ème\", $B$4,IF($G$5=\"4ème\",$B$5,IF($G$6=\"4ème\",$B$6,IF($G$7=\"4ème\",$B$7,\"\"))))","v":0},null,{"$f":"IF($G$4=\"4ème\", $C$4,IF($G$5=\"4ème\",$C$5,IF($G$6=\"4ème\",$C$6,IF($G$7=\"4ème\",$C$7,\"\"))))","v":0},null,{"$f":"IF($G$4=\"4ème\", $D$4,IF($G$5=\"4ème\",$D$5,IF($G$6=\"4ème\",$D$6,IF($G$7=\"4ème\",$D$7,\"\"))))","v":0}]

{"sheet":"Poule 7","index":7,"n_rows":24,"n_cols":7,"rows_kept":24,"cut":false,"hidden":false,"merged":[[23,0,23,1],[23,2,23,3],[23,4,23,5],[21,0,21,1],[21,2,21,3],[21,4,21,5],[22,0,22,1],[22,2,22,3],[22,4,22,5],[20,0,20,1],[20,2,20,3],[20,4,20,5],[14,0,14,2],[14,3,14,4],[15,0,15,2],[18,4,18,6],[19,0,19,1],[19,2,19,3],[19,4,19,5],[16,0,16,2],[17,0,17,2],[18,0,18,3],[12,0,12,2],[13,0,13,6],[0,0,0,2],[0,3,0,4],[10,0,10,2],[11,0,11,2],[1,0,1,2],[1,3,1,6],[7,0,7,6],[8,0,8,2],[8,3,8,4],[9,0,9,2]]}
[{"$f":"Engagés!C1","v":"BADMINTON"},null,null,{"$f":"Engagés!C3","v":"TABLEAU A"}]
["POULE 7"]
[null,"NOM","Prénom","Sigle","Vict","Def","Classement"]
[7,{"$f":"VLOOKUP($A4,Engagés!$A$1:$E$376,3,FALSE)","v":"NEOUZE"},{"$f":"VLOOKUP($A4,Engagés!$A$1:$E$376,4,FALSE)","v":"GUILHEM"},{"$f":"VLOOKUP($A4,Engagés!$A$1:$E$376,5,FALSE)","v":"75-4-STAP"},null,null,"1er"]
[10,{"$f":"VLOOKUP($A5,Engagés!$A$1:$E$376,3,FALSE)","v":"GAREL"},{"$f":"VLOOKUP($A5,Engagés!$A$1:$E$376,4,FALSE)","v":"ARTHUR"},{"$f":"VLOOKUP($A5,Engagés!$A$1:$E$376,5,FALSE)","v":"75-4-ELIP"},null,null,"2ème"]
[23,{"$f":"VLOOKUP($A6,Engagés!$A$1:$E$376,3,FALSE)","v":0},{"$f":"VLOOKUP($A6,Engagés!$A$1:$E$376,4,FALSE)","v":0},{"$f":"VLOOKUP($A6,Engagés!$A$1:$E$376,5,FALSE)","v":0},null,null,"4ème"]
[26,{"$f":"VLOOKUP($A7,Engagés!$A$1:$E$376,3,FALSE)","v":0},{"$f":"VLOOKUP($A7,Engagés!$A$1:$E$376,4,FALSE)","v":0},{"$f":"VLOOKUP($A7,Engagés!$A$1:$E$376,5,FALSE)","v":0},null,null,"3ème"]
["Si poule de 4 joueurs alors…"]
["Déroulement",null,null,"Joueurs A contre Joueur B",null,"Vainqueur","Score"]
["Match 1",null,null,{"$f":"B4","v":"NEOUZE"},{"$f":"B7","v":0},0]
["Match 2",null,null,{"$f":"B5","v":"GAREL"},{"$f":"B6","v":0},0]
["Finale vainqueur Match 1 contre vainqueur Match 2",null,null,{"$f":"IF(F10=\"\",\"\",F10)","v":0},{"$f":"IF(F11=\"\",\"\",F11)","v":0},0]
["Petite finale entre les deux perdants des matchs 1 et 2",null,null,null,null,0]
["Si poule de 3 joueurs alors…"]
["Déroulement",null,null,"Joueurs A contre Joueur B",null,"Vainqueur","Score"]
["Match 1",null,null,{"$f":"B4","v":"NEOUZE"},{"$f":"B6","v":0}]
["Match 2",null,null,{"$f":"B5","v":"GAREL"},{"$f":"B6","v":0}]
["Match 3",null,null,{"$f":"B4","v":"NEOUZE"},{"$f":"B5","v":"GAREL"},"NEOUZE"]
["CLASSEMENT",null,null,null,{"$f":"A2","v":"POULE 7"}]
[null,null,"NOM",null,"PRENOM",null,"SIGLE"]
["1er",null,{"$f":"IF($G$4=\"1er\", $B$4,IF($G$5=\"1er\",$B$5,IF($G$6=\"1er\",$B$6,IF($G$7=\"1er\",$B$7,\"\"))))","v":"NEOUZE"},null,{"$f":"IF($G$4=\"1er\", $C$4,IF($G$5=\"1er\",$C$5,IF($G$6=\"1er\",$C$6,IF($G$7=\"1er\",$C$7,\"\"))))","v":"GUILHEM"},null,{"$f":"IF($G$4=\"1er\", $D$4,IF($G$5=\"1er\",$D$5,IF($G$6=\"1er\",$D$6,IF($G$7=\"1er\",$D$7,\"\"))))","v":"75-4-STAP"}]
["2ème",null,{"$f":"IF($G$4=\"2ème\", $B$4,IF($G$5=\"2ème\",$B$5,IF($G$6=\"2ème\",$B$6,IF($G$7=\"2ème\",$B$7,\"\"))))","v":"GAREL"},null,{"$f":"IF($G$4=\"2ème\", $C$4,IF($G$5=\"2ème\",$C$5,IF($G$6=\"2ème\",$C$6,IF($G$7=\"2ème\",$C$7,\"\"))))","v":"ARTHUR"},null,{"$f":"IF($G$4=\"2ème\", $D$4,IF($G$5=\"2ème\",$D$5,IF($G$6=\"2ème\",$D$6,IF($G$7=\"2ème\",$D$7,\"\"))))","v":"75-4-ELIP"}]
["3ème",null,{"$f":"IF($G$4=\"3ème\", $B$4,IF($G$5=\"3ème\",$B$5,IF($G$6=\"3ème\",$B$6,IF($G$7=\"3ème\",$B$7,\"\"))))","v":0},null,{"$f":"IF($G$4=\"3ème\", $C$4,IF($G$5=\"3ème\",$C$5,IF($G$6=\"3ème\",$C$6,IF($G$7=\"3ème\",$C$7,\"\"))))","v":0},null,{"$f":"IF($G$4=\"3ème\", $D$4,IF($G$5=\"3ème\",$D$5,IF($G$6=\"3ème\",$D$6,IF($G$7=\"3ème\",$D$7,\"\"))))","v":0}]
["4ème",null,{"$f":"IF($G$4=\"4ème\", $B$4,IF($G$5=\"4ème\",$B$5,IF($G$6=\"4ème\",$B$6,IF($G$7=\"4ème\",$B$7,\"\"))))","v":0},null,{"$f":"IF($G$4=\"4ème\", $C$4,IF($G$5=\"4ème\",$C$5,IF($G$6=\"4ème\",$C$6,IF($G$7=\"4ème\",$C$7,\"\"))))","v":0},null,{"$f":"IF($G$4=\"4ème\", $D$4,IF($G$5=\"4ème\",$D$5,IF($G$6=\"4ème\",$D$6,IF($G$7=\"4ème\",$D$7,\"\"))))","v":0}]

{"sheet":"Poule 8","index":8,"n_rows":24,"n_cols":7,"rows_kept":24,"cut":false,"hidden":false,"merged":[[23,0,23,1],[23,2,23,3],[23,4,23,5],[21,0,21,1],[21,2,21,3],[21,4,21,5],[22,0,22,1],[22,2,22,3],[22,4,22,5],[20,0,20,1],[20,2,20,3],[20,4,20,5],[14,0,14,2],[14,3,14,4],[15,0,15,2],[18,4,18,6],[19,0,19,1],[19,2,19,3],[19,4,19,5],[16,0,16,2],[17,0,17,2],[18,0,18,3],[12,0,12,2],[13,0,13,6],[0,0,0,2],[0,3,0,4],[10,0,10,2],[11,0,11,2],[1,0,1,2],[1,3,1,6],[7,0,7,6],[8,0,8,2],[8,3,8,4],[9,0,9,2]]}
[{"$f":"Engagés!C1","v":"BADMINTON"},null,null,{"$f":"Engagés!C3","v":"TABLEAU A"}]
["POULE 8"]
[null,"NOM","Prénom","Sigle","Vict","Def","Classement"]
[8,{"$f":"VLOOKUP($A4,Engagés!$A$1:$E$376,3,FALSE)","v":"RAUFFET"},{"$f":"VLOOKUP($A4,Engagés!$A$1:$E$376,4,FALSE)","v":"HELIE"},{"$f":"VLOOKUP($A4,Engagés!$A$1:$E$376,5,FALSE)","v":"75-4-LRPA"},null,null,"2ème"]
[9,{"$f":"VLOOKUP($A5,Engagés!$A$1:$E$376,3,FALSE)","v":"PROTIN"},{"$f":"VLOOKUP($A5,Engagés!$A$1:$E$376,4,FALSE)","v":"CLEMENT"},{"$f":"VLOOKUP($A5,Engagés!$A$1:$E$376,5,FALSE)","v":"94-4-SMSM"},null,null,"1er"]
[24,{"$f":"VLOOKUP($A6,Engagés!$A$1:$E$376,3,FALSE)","v":0},{"$f":"VLOOKUP($A6,Engagés!$A$1:$E$376,4,FALSE)","v":0},{"$f":"VLOOKUP($A6,Engagés!$A$1:$E$376,5,FALSE)","v":0},null,null,"4ème"]
[25,{"$f":"VLOOKUP($A7,Engagés!$A$1:$E$376,3,FALSE)","v":0},{"$f":"VLOOKUP($A7,Engagés!$A$1:$E$376,4,FALSE)","v":0},{"$f":"VLOOKUP($A7,Engagés!$A$1:$E$376,5,FALSE)","v":0},null,null,"3ème"]
["Si poule de 4 joueurs alors…"]
["Déroulement",null,null,"Joueurs A contre Joueur B",null,"Vainqueur","Score"]
["Match 1",null,null,{"$f":"B4","v":"RAUFFET"},{"$f":"B7","v":0}]
["Match 2",null,null,{"$f":"B5","v":"PROTIN"},{"$f":"B6","v":0}]
["Finale vainqueur Match 1 contre vainqueur Match 2",null,null,{"$f":"IF(F10=\"\",\"\",F10)","v":""},{"$f":"IF(F11=\"\",\"\",F11)","v":""}]
["Petite finale entre les deux perdants des matchs 1 et 2"]
["Si poule de 3 joueurs alors…"]
["Déroulement",null,null,"Joueurs A contre Joueur B",null,"Vainqueur","Score"]
["Match 1",null,null,{"$f":"B4","v":"RAUFFET"},{"$f":"B6","v":0}]
["Match 2",null,null,{"$f":"B5","v":"PROTIN"},{"$f":"B6","v":0}]
["Match 3",null,null,{"$f":"B4","v":"RAUFFET"},{"$f":"B5","v":"PROTIN"},"PROTIN"]
["CLASSEMENT",null,null,null,{"$f":"A2","v":"POULE 8"}]
[null,null,"NOM",null,"PRENOM",null,"SIGLE"]
["1er",null,{"$f":"IF($G$4=\"1er\", $B$4,IF($G$5=\"1er\",$B$5,IF($G$6=\"1er\",$B$6,IF($G$7=\"1er\",$B$7,\"\"))))","v":"PROTIN"},null,{"$f":"IF($G$4=\"1er\", $C$4,IF($G$5=\"1er\",$C$5,IF($G$6=\"1er\",$C$6,IF($G$7=\"1er\",$C$7,\"\"))))","v":"CLEMENT"},null,{"$f":"IF($G$4=\"1er\", $D$4,IF($G$5=\"1er\",$D$5,IF($G$6=\"1er\",$D$6,IF($G$7=\"1er\",$D$7,\"\"))))","v":"94-4-SMSM"}]
["2ème",null,{"$f":"IF($G$4=\"2ème\", $B$4,IF($G$5=\"2ème\",$B$5,IF($G$6=\"2ème\",$B$6,IF($G$7=\"2ème\",$B$7,\"\"))))","v":"RAUFFET"},null,{"$f":"IF($G$4=\"2ème\", $C$4,IF($G$5=\"2ème\",$C$5,IF($G$6=\"2ème\",$C$6,IF($G$7=\"2ème\",$C$7,\"\"))))","v":"HELIE"},null,{"$f":"IF($G$4=\"2ème\", $D$4,IF($G$5=\"2ème\",$D$5,IF($G$6=\"2ème\",$D$6,IF($G$7=\"2ème\",$D$7,\"\"))))","v":"75-4-LRPA"}]
["3ème",null,{"$f":"IF($G$4=\"3ème\", $B$4,IF($G$5=\"3ème\",$B$5,IF($G$6=\"3ème\",$B$6,IF($G$7=\"3ème\",$B$7,\"\"))))","v":0},null,{"$f":"IF($G$4=\"3ème\", $C$4,IF($G$5=\"3ème\",$C$5,IF($G$6=\"3ème\",$C$6,IF($G$7=\"3ème\",$C$7,\"\"))))","v":0},null,{"$f":"IF($G$4=\"3ème\", $D$4,IF($G$5=\"3ème\",$D$5,IF($G$6=\"3ème\",$D$6,IF($G$7=\"3ème\",$D$7,\"\"))))","v":0}]
["4ème",null,{"$f":"IF($G$4=\"4ème\", $B$4,IF($G$5=\"4ème\",$B$5,IF($G$6=\"4ème\",$B$6,IF($G$7=\"4ème\",$B$7,\"\"))))","v":0},null,{"$f":"IF($G$4=\"4ème\", $C$4,IF($G$5=\"4ème\",$C$5,IF($G$6=\"4ème\",$C$6,IF($G$7=\"4ème\",$C$7,\"\"))))","v":0},null,{"$f":"IF($G$4=\"4ème\", $D$4,IF($G$5=\"4ème\",$D$5,IF($G$6=\"4ème\",$D$6,IF($G$7=\"4ème\",$D$7,\"\"))))","v":0}]

{"sheet":"Résultats de poule","index":9,"n_rows":10,"n_cols":16,"rows_kept":10,"cut":false,"hidden":false,"merged":[[0,0,0,3],[0,4,0,7],[0,8,0,11],[0,12,0,15],[5,0,5,3],[5,4,5,7],[5,8,5,11],[5,12,5,15]]}
["Poule 1",null,null,null,"Poule 2",null,null,null,"Poule 3",null,null,null,"Poule 4"]
["1er",{"$f":"'Poule 1'!$C21","v":"CHAROLLOIS J"},{"$f":"'Poule 1'!$E21","v":"JULES"},{"$f":"'Poule 1'!$G21","v":"94-4-ADMN"},"1er",{"$f":"'Poule 2'!$C21","v":"D'HARCOURT"},{"$f":"'Poule 2'!$E21","v":"RAPHAEL"},{"$f":"'Poule 2'!$G21","v":"75-4-LRPA"},"1er",{"$f":"'Poule 3'!$C21","v":"BOURDON"},{"$f":"'Poule 3'!$E21","v":"MAXIME"},{"$f":"'Poule 3'!$G21","v":"75-4-LRPA"},"1er",{"$f":"'Poule 4'!$C21","v":"DA VINHA"},{"$f":"'Poule 4'!$E21","v":"LEANDRE"},{"$f":"'Poule 4'!$G21","v":"75-4-ELIP"}]
["2ème",{"$f":"'Poule 1'!$C22","v":"ROUVIER"},{"$f":"'Poule 1'!$E22","v":"RAPHAEL"},{"$f":"'Poule 1'!$G22","v":"75-4-BNDP"},"2ème",{"$f":"'Poule 2'!$C22","v":"GARDES"},{"$f":"'Poule 2'!$E22","v":"ADRIEN"},{"$f":"'Poule 2'!$G22","v":"75-2-SCP"},"2ème",{"$f":"'Poule 3'!$C22","v":"ASSIER DE POMPIGNAN"},{"$f":"'Poule 3'!$E22","v":"JOSEPH"},{"$f":"'Poule 3'!$G22","v":"75-4-STAP"},"2ème",{"$f":"'Poule 4'!$C22","v":"BAILLON"},{"$f":"'Poule 4'!$E22","v":"VICTOR"},{"$f":"'Poule 4'!$G22","v":"94-4-ADMN"}]
["3ème",{"$f":"'Poule 1'!$C23","v":"COHEN"},{"$f":"'Poule 1'!$E23","v":"HADRIEN"},{"$f":"'Poule 1'!$G23","v":"94-4-PROV"},"3ème",{"$f":"'Poule 2'!$C23","v":"BENNANI BRAOULI"},{"$f":"'Poule 2'!$E23","v":"FAYL"},{"$f":"'Poule 2'!$G23","v":"94-4-ADMN"},"3ème",{"$f":"'Poule 3'!$C23","v":"RATOUIS"},{"$f":"'Poule 3'!$E23","v":"LEO"},{"$f":"'Poule 3'!$G23","v":"94-4-SMSM"},"3ème",{"$f":"'Poule 4'!$C23","v":"JACOB"},{"$f":"'Poule 4'!$E23","v":"BAPTISTE"},{"$f":"'Poule 4'!$G23","v":"75-4-SMPP"}]
["4ème",{"$f":"'Poule 1'!$C24","v":0},{"$f":"'Poule 1'!$E24","v":0},{"$f":"'Poule 1'!$G24","v":0},"4ème",{"$f":"'Poule 2'!$C24","v":0},{"$f":"'Poule 2'!$E24","v":0},{"$f":"'Poule 2'!$G24","v":0},"4ème",{"$f":"'Poule 3'!$C24","v":0},{"$f":"'Poule 3'!$E24","v":0},{"$f":"'Poule 3'!$G24","v":0},"4ème",{"$f":"'Poule 4'!$C24","v":0},{"$f":"'Poule 4'!$E24","v":0},{"$f":"'Poule 4'!$G24","v":0}]
["Poule 5",null,null,null,"Poule 6",null,null,null,"Poule 7",null,null,null,"Poule 8"]
["1er",{"$f":"'Poule 5'!$C21","v":"LHUERRE"},{"$f":"'Poule 5'!$E21","v":"MAXIME"},{"$f":"'Poule 5'!$G21","v":"75-4-LRPA"},"1er",{"$f":"'Poule 6'!$C21","v":"COULET"},{"$f":"'Poule 6'!$E21","v":"SIXTE"},{"$f":"'Poule 6'!$G21","v":"75-4-LRPA"},"1er",{"$f":"'Poule 7'!$C21","v":"NEOUZE"},{"$f":"'Poule 7'!$E21","v":"GUILHEM"},{"$f":"'Poule 7'!$G21","v":"75-4-STAP"},"1er",{"$f":"'Poule 8'!$C21","v":"PROTIN"},{"$f":"'Poule 8'!$E21","v":"CLEMENT"},{"$f":"'Poule 8'!$G21","v":"94-4-SMSM"}]
["2ème",{"$f":"'Poule 5'!$C22","v":"BALAHU DE NOIRON"},{"$f":"'Poule 5'!$E22","v":"JULES"},{"$f":"'Poule 5'!$G22","v":"75-4-BNDP"},"2ème",{"$f":"'Poule 6'!$C22","v":"ROBERT MENDES"},{"$f":"'Poule 6'!$E22","v":"THOMAS"},{"$f":"'Poule 6'!$G22","v":"75-4-BNDP"},"2ème",{"$f":"'Poule 7'!$C22","v":"GAREL"},{"$f":"'Poule 7'!$E22","v":"ARTHUR"},{"$f":"'Poule 7'!$G22","v":"75-4-ELIP"},"2ème",{"$f":"'Poule 8'!$C22","v":"RAUFFET"},{"$f":"'Poule 8'!$E22","v":"HELIE"},{"$f":"'Poule 8'!$G22","v":"75-4-LRPA"}]
["3ème",{"$f":"'Poule 5'!$C23","v":"BOUSQUET GRIJALVO"},{"$f":"'Poule 5'!$E23","v":"ARTHUR"},{"$f":"'Poule 5'!$G23","v":"75-4-ELIP"},"3ème",{"$f":"'Poule 6'!$C23","v":"BERGERAULT"},{"$f":"'Poule 6'!$E23","v":"SACHA"},{"$f":"'Poule 6'!$G23","v":"94-4-SMSM"},"3ème",{"$f":"'Poule 7'!$C23","v":0},{"$f":"'Poule 7'!$E23","v":0},{"$f":"'Poule 7'!$G23","v":0},"3ème",{"$f":"'Poule 8'!$C23","v":0},{"$f":"'Poule 8'!$E23","v":0},{"$f":"'Poule 8'!$G23","v":0}]
["4ème",{"$f":"'Poule 5'!$C24","v":0},{"$f":"'Poule 5'!$E24","v":0},{"$f":"'Poule 5'!$G24","v":0},"4ème",{"$f":"'Poule 6'!$C24","v":0},{"$f":"'Poule 6'!$E24","v":0},{"$f":"'Poule 6'!$G24","v":0},"4ème",{"$f":"'Poule 7'!$C24","v":0},{"$f":"'Poule 7'!$E24","v":0},{"$f":"'Poule 7'!$G24","v":0},"4ème",{"$f":"'Poule 8'!$C24","v":0},{"$f":"'Poule 8'!$E24","v":0},{"$f":"'Poule 8'!$G24","v":0}]

{"sheet":"Tableau","index":10,"n_rows":92,"n_cols":34,"rows_kept":92,"cut":false,"hidden":false,"merged":[[55,10,55,11],[33,4,33,5],[42,1,42,2],[59,29,59,30],[55,23,55,24],[47,29,47,30],[35,20,35,21],[42,20,42,21],[41,23,41,24],[48,26,48,27],[57,20,57,21],[30,32,30,33],[0,16,0,19],[15,29,15,30],[0,0,0,14],[31,29,31,30],[10,1,10,2],[1,4,1,5],[0,20,0,33],[16,26,16,27],[23,23,23,24],[3,20,3,21],[18,20,18,21],[29,4,29,5],[25,20,25,21],[1,10,1,11],[9,23,9,24],[8,10,8,11],[50,20,50,21],[16,10,16,11],[23,10,23,11],[33,10,33,11],[40,10,40,11],[48,10,48,11],[10,20,10,21]]}
["REPECHAGES ET MATCHS DE CLASSEMENT",null,null,null,null,null,null,null,null,null,null,null,null,null,null,null,"1er tour de tableau",null,null,null,"TABLEAU PRINCIPAL"]
[]
[]
[null,null,null,null,null,null,null,null,null,null,null,null,null,null,null,null,"1er poule 1",{"$f":"'Résultats de poule'!B2","v":"CHAROLLOIS J"},{"$f":"'Résultats de poule'!D2","v":"94-4-ADMN"},"V","1/8 de finale 1"]
[null,null,null,null,null,null,null,null,null,null,null,null,"P",{"$f":"IF(T4=\"\",\"\",IF(T4=\"p\",S4,S5))","v":0},{"$f":"IF(T4=\"\",\"\",IF(T4=\"p\",R4,R5))","v":0},null,"4ème poule 8",{"$f":"'Résultats de poule'!N10","v":0},{"$f":"'Résultats de poule'!P10","v":0},"P",{"$f":"IF(T4=\"\",\"\",IF(T4=\"v\",R4,R5))","v":"CHAROLLOIS J"},{"$f":"IF(T4=\"\",\"\",IF(T4=\"v\",S4,S5))","v":"94-4-ADMN"},"V"]
[null,null,null,null,null,null,null,null,null,"P",{"$f":"IF(M5=\"\",\"\",IF(M5=\"v\",N5,N7))","v":"SMSM"},{"$f":"IF(M5=\"\",\"\",IF(M5=\"v\",O5,O7))","v":"RATOUIS"},null,null,null,null,null,null,null,null,null,null,null,{"$f":"IF(W5=\"\",\"\",IF(W5=\"v\",U5,U7))","v":"CHAROLLOIS J"},{"$f":"IF(W5=\"\",\"\",IF(W5=\"v\",V5,V7))","v":"94-4-ADMN"},"V"]
[null,null,null,null,null,null,null,null,null,null,null,null,"V","SMSM","RATOUIS",null,"3ème poule 3",{"$f":"'Résultats de poule'!J4","v":"RATOUIS"},{"$f":"'Résultats de poule'!L4","v":"94-4-SMSM"},"P","ROBERT MENDES","75-4-BNDP","P"]
[null,null,null,null,null,null,null,null,null,null,null,null,null,null,null,null,"2ème poule 6",{"$f":"'Résultats de poule'!F8","v":"ROBERT MENDES"},{"$f":"'Résultats de poule'!H8","v":"75-4-BNDP"},"V"]
[null,null,null,null,null,null,"P",{"$f":"IF(J6=\"\",\"\",IF(J6=\"v\",K6,K13))","v":"ADMN"},{"$f":"IF(J6=\"\",\"\",IF(J6=\"v\",L6,L13))","v":"BAILLON"}]
[null,null,null,null,null,null,null,null,null,null,null,null,null,null,null,null,null,null,null,null,null,null,null,"1/4 finale 1",null,null,{"$f":"IF(Z6=\"\",\"\",IF(Z6=\"v\",X6,X13))","v":"CHAROLLOIS J"},{"$f":"IF(Z6=\"\",\"\",IF(Z6=\"v\",Y6,Y13))","v":"94-4-ADMN"},"V"]
[null,null,null,null,null,null,null,null,null,null,null,null,null,null,null,null,"2ème poule 4",{"$f":"'Résultats de poule'!N3","v":"BAILLON"},{"$f":"'Résultats de poule'!P3","v":"94-4-ADMN"},"P","1/8 de finale 2"]
[null,null,null,null,null,null,null,null,null,null,null,null,"V","ADMN","BAILLON",null,"3ème poule 5",{"$f":"'Résultats de poule'!B9","v":"BOUSQUET GRIJALVO"},{"$f":"'Résultats de poule'!D9","v":"75-4-ELIP"},"V","BOUSQUET GRILJALVO","75-4-ELIP","P"]
[null,null,null,null,null,null,null,null,null,"V",{"$f":"IF(M12=\"\",\"\",IF(M12=\"v\",N12,N14))","v":"ADMN"},{"$f":"IF(M12=\"\",\"\",IF(M12=\"v\",O12,O14))","v":"BAILLON"},null,null,null,null,null,null,null,null,null,null,null,{"$f":"IF(W12=\"\",\"\",IF(W12=\"v\",U12,U14))","v":"NEOUZE"},{"$f":"IF(W12=\"\",\"\",IF(W12=\"v\",V12,V14))","v":"75-4-STAP"},"P"]
[null,null,null,null,null,null,null,null,null,null,null,null,"P",{"$f":"IF(T14=\"\",\"\",IF(T14=\"p\",S14,S15))","v":0},{"$f":"IF(T14=\"\",\"\",IF(T14=\"p\",R14,R15))","v":0},null,"4ème poule 2",{"$f":"'Résultats de poule'!F5","v":0},{"$f":"'Résultats de poule'!H5","v":0},"P",{"$f":"IF(T14=\"\",\"\",IF(T14=\"v\",R14,R15))","v":"NEOUZE"},{"$f":"IF(T14=\"\",\"\",IF(T14=\"v\",S14,S15))","v":"75-4-STAP"},"V"]
[null,null,null,null,null,null,null,null,null,null,null,null,null,null,null,null,"1er poule 7",{"$f":"'Résultats de poule'!J7","v":"NEOUZE"},{"$f":"'Résultats de poule'!L7","v":"75-4-STAP"},"V"]
[null,null,null,"V",{"$f":"IF(G9=\"\",\"\",IF(G9=\"v\",H9,H24))","v":"ADMN"},{"$f":"IF(G9=\"\",\"\",IF(G9=\"v\",I9,I24))","v":"BENNANI BRAOULI"}]
[null,null,null,null,null,null,null,null,null,null,null,null,null,null,null,null,null,null,null,null,null,null,null,null,null,null,"1/2 finale A",null,null,{"$f":"IF(AC10=\"\",\"\",IF(AC10=\"v\",AA10,AA24))","v":"CHAROLLOIS J"},{"$f":"IF(AC10=\"\",\"\",IF(AC10=\"v\",AB10,AB24))","v":"94-4-ADMN"},"V"]
[]
[null,null,null,null,null,null,null,null,null,null,null,null,null,null,null,null,"1er poule 6",{"$f":"'Résultats de poule'!F7","v":"COULET"},{"$f":"'Résultats de poule'!H7","v":"75-4-LRPA"},"V","1/8 de finale 3"]
[null,null,null,null,null,null,null,null,null,null,null,null,"P",{"$f":"IF(T19=\"\",\"\",IF(T19=\"p\",S19,S20))","v":0},{"$f":"IF(T19=\"\",\"\",IF(T19=\"p\",R19,R20))","v":0},null,"4ème poule 3",{"$f":"'Résultats de poule'!J5","v":0},{"$f":"'Résultats de poule'!L5","v":0},"P","COULET",{"$f":"IF(T19=\"\",\"\",IF(T19=\"v\",S19,S20))","v":"75-4-LRPA"},"V"]
[null,null,null,null,null,null,null,null,null,"P",{"$f":"IF(M20=\"\",\"\",IF(M20=\"v\",N20,N22))","v":0},{"$f":"IF(M20=\"\",\"\",IF(M20=\"v\",O20,O22))","v":0},null,null,null,null,null,null,null,null,null,null,null,{"$f":"IF(W20=\"\",\"\",IF(W20=\"v\",U20,U22))","v":"COULET"},{"$f":"IF(W20=\"\",\"\",IF(W20=\"v\",V20,V22))","v":"75-4-LRPA"},"V"]
[null,null,null,null,null,null,null,null,null,null,null,null,"V",{"$f":"IF(T22=\"\",\"\",IF(T22=\"p\",S22,S23))","v":0},{"$f":"IF(T22=\"\",\"\",IF(T22=\"p\",R22,R23))","v":0},null,"3ème poule 8",{"$f":"'Résultats de poule'!N9","v":0},{"$f":"'Résultats de poule'!P9","v":0},"P",{"$f":"IF(T22=\"\",\"\",IF(T22=\"v\",R22,R23))","v":"ROUVIER"},{"$f":"IF(T22=\"\",\"\",IF(T22=\"v\",S22,S23))","v":"75-4-BNDP"},"P"]
[null,null,null,null,null,null,null,null,null,null,null,null,null,null,null,null,"2ème poule 1",{"$f":"'Résultats de poule'!B3","v":"ROUVIER"},{"$f":"'Résultats de poule'!D3","v":"75-4-BNDP"},"V"]
[null,null,null,null,null,null,"V",{"$f":"IF(J21=\"\",\"\",IF(J21=\"v\",K21,K28))","v":"ADMN"},{"$f":"IF(J21=\"\",\"\",IF(J21=\"v\",L21,L28))","v":"BENNANI BRAOULI"},null,null,null,null,null,null,null,null,null,null,null,null,null,null,"1/4 finale 2",null,null,{"$f":"IF(Z21=\"\",\"\",IF(Z21=\"v\",X21,X28))","v":"COULET"},{"$f":"IF(Z21=\"\",\"\",IF(Z21=\"v\",Y21,Y28))","v":"75-4-LRPA"},"P"]
[]
[null,null,null,null,null,null,null,null,null,null,null,null,null,null,null,null,"2ème poule 7",{"$f":"'Résultats de poule'!J8","v":"GAREL"},{"$f":"'Résultats de poule'!L8","v":"75-4-ELIP"},"V","1/8 de finale 4"]
[null,null,null,null,null,null,null,null,null,null,null,null,"V","ADMN","BENNANI BRAOULI",null,"3ème poule 2",{"$f":"'Résultats de poule'!F4","v":"BENNANI BRAOULI"},{"$f":"'Résultats de poule'!H4","v":"94-4-ADMN"},"P","GAREL","75-4-ELIP","P"]
[null,null,null,null,null,null,null,null,null,"V",{"$f":"IF(M27=\"\",\"\",IF(M27=\"v\",N27,N29))","v":"ADMN"},{"$f":"IF(M27=\"\",\"\",IF(M27=\"v\",O27,O29))","v":"BENNANI BRAOULI"},null,null,null,null,null,null,null,null,null,null,null,{"$f":"IF(W27=\"\",\"\",IF(W27=\"v\",U27,U29))","v":"DA VINHA"},{"$f":"IF(W27=\"\",\"\",IF(W27=\"v\",V27,V29))","v":"75-4-ELIP"},"P"]
[null,null,null,null,null,null,null,null,null,null,null,null,"P",{"$f":"IF(T29=\"\",\"\",IF(T29=\"p\",S29,S30))","v":0},{"$f":"IF(T29=\"\",\"\",IF(T29=\"p\",R29,R30))","v":0},null,"4ème poule 5",{"$f":"'Résultats de poule'!B10","v":0},{"$f":"'Résultats de poule'!D10","v":0},"P",{"$f":"IF(T29=\"\",\"\",IF(T29=\"v\",R29,R30))","v":"DA VINHA"},{"$f":"IF(T29=\"\",\"\",IF(T29=\"v\",S29,S30))","v":"75-4-ELIP"},"V"]
[null,null,null,null,null,null,null,null,null,null,null,null,null,null,null,null,"1er poule 4",{"$f":"'Résultats de poule'!N2","v":"DA VINHA"},{"$f":"'Résultats de poule'!P2","v":"75-4-ELIP"},"V"]
[null,"17ème",null,null,null,null,null,null,null,null,null,null,null,null,null,null,null,null,null,null,null,null,null,null,null,null,null,null,null,null,null,null,"VAINQUEUR"]
[null,{"$f":"IF(D16=\"\",\"\",IF(D16=\"v\",E16,E48))","v":"ADMN"},{"$f":"IF(D16=\"\",\"\",IF(D16=\"v\",F16,F48))","v":"BENNANI BRAOULI"},null,null,null,null,null,null,null,null,null,null,null,null,null,null,null,null,null,null,null,null,null,null,null,null,null,null,"FINALE",null,null,{"$f":"IF(AF17=\"\",\"\",IF(AF17=\"v\",AD17,AD49))","v":"CHAROLLOIS J"},{"$f":"IF(AF17=\"\",\"\",IF(AF17=\"v\",AE17,AE49))","v":"94-4-ADMN"}]
[]
[]
[]
[null,null,null,null,null,null,null,null,null,null,null,null,null,null,null,null,"1er poule 3",{"$f":"'Résultats de poule'!J2","v":"BOURDON"},{"$f":"'Résultats de poule'!L2","v":"75-4-LRPA"},"V","1/8 de finale 5"]
[null,null,null,null,null,null,null,null,null,null,null,null,"P",{"$f":"IF(T36=\"\",\"\",IF(T36=\"p\",S36,S37))","v":0},{"$f":"IF(T36=\"\",\"\",IF(T36=\"p\",R36,R37))","v":0},null,"4ème poule 6",{"$f":"'Résultats de poule'!F10","v":0},{"$f":"'Résultats de poule'!H10","v":0},"P",{"$f":"IF(T36=\"\",\"\",IF(T36=\"v\",R36,R37))","v":"BOURDON"},{"$f":"IF(T36=\"\",\"\",IF(T36=\"v\",S36,S37))","v":"75-4-LRPA"},"V"]
[null,null,null,null,null,null,null,null,null,"V",{"$f":"IF(M37=\"\",\"\",IF(M37=\"v\",N37,N39))","v":"94-4-PROV"},{"$f":"IF(M37=\"\",\"\",IF(M37=\"v\",O37,O39))","v":"COHEN"},null,null,null,null,null,null,null,null,null,null,null,{"$f":"IF(W37=\"\",\"\",IF(W37=\"v\",U37,U39))","v":"BOURDON"},{"$f":"IF(W37=\"\",\"\",IF(W37=\"v\",V37,V39))","v":"75-4-LRPA"},"P"]
[null,null,null,null,null,null,null,null,null,null,null,null,"V",{"$f":"IF(T39=\"\",\"\",IF(T39=\"p\",S39,S40))","v":"94-4-PROV"},{"$f":"IF(T39=\"\",\"\",IF(T39=\"p\",R39,R40))","v":"COHEN"},null,"3ème poule 1",{"$f":"'Résultats de poule'!B4","v":"COHEN"},{"$f":"'Résultats de poule'!D4","v":"94-4-PROV"},"P",{"$f":"IF(T39=\"\",\"\",IF(T39=\"v\",R39,R40))","v":"RAUFFET"},{"$f":"IF(T39=\"\",\"\",IF(T39=\"v\",S39,S40))","v":"75-4-LRPA"},"P"]
[null,null,null,null,null,null,null,null,null,null,null,null,null,null,null,null,"2ème poule 8",{"$f":"'Résultats de poule'!N8","v":"RAUFFET"},{"$f":"'Résultats de poule'!P8","v":"75-4-LRPA"},"V"]
[null,null,null,null,null,null,"V",{"$f":"IF(J38=\"\",\"\",IF(J38=\"v\",K38,K45))","v":"94-4-PROV"},{"$f":"IF(J38=\"\",\"\",IF(J38=\"v\",L38,L45))","v":"COHEN"}]
[null,null,null,null,null,null,null,null,null,null,null,null,null,null,null,null,null,null,null,null,null,null,null,"1/4 finale 3",null,null,{"$f":"IF(Z38=\"\",\"\",IF(Z38=\"v\",X38,X45))","v":"GARDES"},{"$f":"IF(Z38=\"\",\"\",IF(Z38=\"v\",Y38,Y45))","v":"75-2-SCP"},"V"]
[null,null,null,null,null,null,null,null,null,null,null,null,null,null,null,null,"2ème poule 2",{"$f":"'Résultats de poule'!F3","v":"GARDES"},{"$f":"'Résultats de poule'!H3","v":"75-2-SCP"},"V","1/8 de finale 6"]
[null,null,null,null,null,null,null,null,null,null,null,null,"V",{"$f":"IF(T43=\"\",\"\",IF(T43=\"p\",S43,S44))","v":0},{"$f":"IF(T43=\"\",\"\",IF(T43=\"p\",R43,R44))","v":0},null,"3ème poule 7",{"$f":"'Résultats de poule'!J9","v":0},{"$f":"'Résultats de poule'!L9","v":0},"P",{"$f":"IF(T43=\"\",\"\",IF(T43=\"v\",R43,R44))","v":"GARDES"},{"$f":"IF(T43=\"\",\"\",IF(T43=\"v\",S43,S44))","v":"75-2-SCP"},"V"]
[null,null,null,null,null,null,null,null,null,"P",{"$f":"IF(M44=\"\",\"\",IF(M44=\"v\",N44,N46))","v":0},{"$f":"IF(M44=\"\",\"\",IF(M44=\"v\",O44,O46))","v":0},null,null,null,null,null,null,null,null,null,null,null,{"$f":"IF(W44=\"\",\"\",IF(W44=\"v\",U44,U46))","v":"GARDES"},{"$f":"IF(W44=\"\",\"\",IF(W44=\"v\",V44,V46))","v":"75-2-SCP"},"V"]
[null,null,null,null,null,null,null,null,null,null,null,null,"P",{"$f":"IF(T46=\"\",\"\",IF(T46=\"p\",S46,S47))","v":0},{"$f":"IF(T46=\"\",\"\",IF(T46=\"p\",R46,R47))","v":0},null,"4ème poule 4",{"$f":"'Résultats de poule'!N5","v":0},{"$f":"'Résultats de poule'!P5","v":0},"P",{"$f":"IF(T46=\"\",\"\",IF(T46=\"v\",R46,R47))","v":"LHUERRE"},{"$f":"IF(T46=\"\",\"\",IF(T46=\"v\",S46,S47))","v":"75-4-LRPA"},"P"]
[null,null,null,null,null,null,null,null,null,null,null,null,null,null,null,null,"1er poule 5",{"$f":"'Résultats de poule'!B7","v":"LHUERRE"},{"$f":"'Résultats de poule'!D7","v":"75-4-LRPA"},"V"]
[null,null,null,"P",{"$f":"IF(G41=\"\",\"\",IF(G41=\"v\",H41,H56))","v":"94-4-PROV"},{"$f":"IF(G41=\"\",\"\",IF(G41=\"v\",I41,I56))","v":"COHEN"}]
[null,null,null,null,null,null,null,null,null,null,null,null,null,null,null,null,null,null,null,null,null,null,null,null,null,null,"1/2 finale B",null,null,{"$f":"IF(AC42=\"\",\"\",IF(AC42=\"v\",AA42,AA56))","v":"GARDES"},{"$f":"IF(AC42=\"\",\"\",IF(AC42=\"v\",AB42,AB56))","v":"75-2-SCP"},"P"]
[]
[null,null,null,null,null,null,null,null,null,null,null,null,null,null,null,null,"1er poule 8",{"$f":"'Résultats de poule'!N7","v":"PROTIN"},{"$f":"'Résultats de poule'!P7","v":"94-4-SMSM"},"V","1/8 de finale 7"]
[null,null,null,null,null,null,null,null,null,null,null,null,"P",{"$f":"IF(T51=\"\",\"\",IF(T51=\"p\",S51,S52))","v":0},{"$f":"IF(T51=\"\",\"\",IF(T51=\"p\",R51,R52))","v":0},null,"4ème poule 1",{"$f":"'Résultats de poule'!B5","v":0},{"$f":"'Résultats de poule'!D5","v":0},"P",{"$f":"IF(T51=\"\",\"\",IF(T51=\"v\",R51,R52))","v":"PROTIN"},{"$f":"IF(T51=\"\",\"\",IF(T51=\"v\",S51,S52))","v":"94-4-SMSM"},"V"]
[null,null,null,null,null,null,null,null,null,"P",{"$f":"IF(M52=\"\",\"\",IF(M52=\"v\",N52,N54))","v":"75-4-STAP"},{"$f":"IF(M52=\"\",\"\",IF(M52=\"v\",O52,O54))","v":"ASSIER DE POMPIGNAN"},null,null,null,null,null,null,null,null,null,null,null,{"$f":"IF(W52=\"\",\"\",IF(W52=\"v\",U52,U54))","v":"PROTIN"},{"$f":"IF(W52=\"\",\"\",IF(W52=\"v\",V52,V54))","v":"94-4-SMSM"},"P"]
[null,null,null,null,null,null,null,null,null,null,null,null,"V",{"$f":"IF(T54=\"\",\"\",IF(T54=\"p\",S54,S55))","v":"75-4-STAP"},{"$f":"IF(T54=\"\",\"\",IF(T54=\"p\",R54,R55))","v":"ASSIER DE POMPIGNAN"},null,"3ème poule 6",{"$f":"'Résultats de poule'!F9","v":"BERGERAULT"},{"$f":"'Résultats de poule'!H9","v":"94-4-SMSM"},"V",{"$f":"IF(T54=\"\",\"\",IF(T54=\"v\",R54,R55))","v":"BERGERAULT"},{"$f":"IF(T54=\"\",\"\",IF(T54=\"v\",S54,S55))","v":"94-4-SMSM"},"P"]
[null,null,null,null,null,null,null,null,null,null,null,null,null,null,null,null,"2ème poule 3",{"$f":"'Résultats de poule'!J3","v":"ASSIER DE POMPIGNAN"},{"$f":"'Résultats de poule'!L3","v":"75-4-STAP"},"P"]
[null,null,null,null,null,null,"P",{"$f":"IF(J53=\"\",\"\",IF(J53=\"v\",K53,K60))","v":"75-4-SMPP"},{"$f":"IF(J53=\"\",\"\",IF(J53=\"v\",L53,L60))","v":"JACOB"},null,null,null,null,null,null,null,null,null,null,null,null,null,null,"1/4 finale 4",null,null,{"$f":"IF(Z53=\"\",\"\",IF(Z53=\"v\",X53,X60))","v":"D'HARCOURT"},{"$f":"IF(Z53=\"\",\"\",IF(Z53=\"v\",Y53,Y60))","v":"75-4-LRPA"},"P"]
[]
[null,null,null,null,null,null,null,null,null,null,null,null,null,null,null,null,"2ème poule 5",{"$f":"'Résultats de poule'!B8","v":"BALAHU DE NOIRON"},{"$f":"'Résultats de poule'!D8","v":"75-4-BNDP"},"V","1/8 de finale 8"]
[null,null,null,null,null,null,null,null,null,null,null,null,"V",{"$f":"IF(T58=\"\",\"\",IF(T58=\"p\",S58,S59))","v":"75-4-SMPP"},{"$f":"IF(T58=\"\",\"\",IF(T58=\"p\",R58,R59))","v":"JACOB"},null,"3ème poule 4",{"$f":"'Résultats de poule'!N4","v":"JACOB"},{"$f":"'Résultats de poule'!P4","v":"75-4-SMPP"},"P",{"$f":"IF(T58=\"\",\"\",IF(T58=\"v\",R58,R59))","v":"BALAHU DE NOIRON"},{"$f":"IF(T58=\"\",\"\",IF(T58=\"v\",S58,S59))","v":"75-4-BNDP"},"P"]
[null,"19ème",null,"V",{"$f":"IF(G9=\"\",\"\",IF(G9=\"p\",H9,H24))","v":"ADMN"},{"$f":"IF(G9=\"\",\"\",IF(G9=\"p\",I9,I24))","v":"BAILLON"},null,null,null,"V",{"$f":"IF(M59=\"\",\"\",IF(M59=\"v\",N59,N61))","v":"75-4-SMPP"},{"$f":"IF(M59=\"\",\"\",IF(M59=\"v\",O59,O61))","v":"JACOB"},null,null,null,null,null,null,null,null,null,null,null,{"$f":"IF(W59=\"\",\"\",IF(W59=\"v\",U59,U61))","v":"D'HARCOURT"},{"$f":"IF(W59=\"\",\"\",IF(W59=\"v\",V59,V61))","v":"75-4-LRPA"},"V",null,null,null,"Place de 3ème/4ème"]
[null,{"$f":"IF(D60=\"\",\"\",IF(D60=\"v\",E60,E62))","v":"ADMN"},{"$f":"IF(D60=\"\",\"\",IF(D60=\"v\",F60,F62))","v":"BAILLON"},null,null,null,null,null,null,null,null,null,"P",{"$f":"IF(T61=\"\",\"\",IF(T61=\"p\",S61,S62))","v":0},{"$f":"IF(T61=\"\",\"\",IF(T61=\"p\",R61,R62))","v":0},null,"4ème poule 7",{"$f":"'Résultats de poule'!J10","v":0},{"$f":"'Résultats de poule'!L10","v":0},"P",{"$f":"IF(T61=\"\",\"\",IF(T61=\"v\",R61,R62))","v":"D'HARCOURT"},{"$f":"IF(T61=\"\",\"\",IF(T61=\"v\",S61,S62))","v":"75-4-LRPA"},"V",null,null,null,null,null,null,{"$f":"IF(AC10=\"\",\"\",IF(AC10=\"p\",AA10,AA24))","v":"COULET"},{"$f":"IF(AC10=\"\",\"\",IF(AC10=\"p\",AB10,AB24))","v":"75-4-LRPA"},"P"]
[null,null,null,"P",{"$f":"IF(G41=\"\",\"\",IF(G41=\"p\",H41,H56))","v":"75-4-SMPP"},{"$f":"IF(G41=\"\",\"\",IF(G41=\"p\",I41,I56))","v":"JACOB"},null,null,null,null,null,null,null,null,null,null,"1er poule 2",{"$f":"'Résultats de poule'!F2","v":"D'HARCOURT"},{"$f":"'Résultats de poule'!H2","v":"75-4-LRPA"},"V",null,null,null,null,null,null,null,null,null,null,null,null,{"$f":"IF(AF61=\"\",\"\",IF(AF61=\"v\",AD61,AD63))","v":"D'HARCOURT"},{"$f":"IF(AF61=\"\",\"\",IF(AF61=\"v\",AE61,AE63))","v":"75-4-LRPA"}]
[null,null,null,null,null,null,null,null,null,null,null,null,null,null,null,null,null,null,null,null,null,null,null,null,null,null,null,null,null,{"$f":"IF(AC42=\"\",\"\",IF(AC42=\"p\",AA42,AA56))","v":"D'HARCOURT"},{"$f":"IF(AC42=\"\",\"\",IF(AC42=\"p\",AB42,AB56))","v":"75-4-LRPA"},"V"]
[]
[null,null,null,null,null,null,null,null,null,null,null,null,"P",{"$f":"IF(M5=\"\",\"\",IF(M5=\"p\",N5,N7))","v":0},{"$f":"IF(M5=\"\",\"\",IF(M5=\"p\",O5,O7))","v":0},null,null,{"$f":"IF(W5=\"\",\"\",IF(W5=\"p\",U5,U7))","v":"ROBERT MENDES"},{"$f":"IF(W5=\"\",\"\",IF(W5=\"p\",V5,V7))","v":"75-4-BNDP"},"P"]
[null,null,null,null,null,null,null,null,null,"V",{"$f":"IF(M65=\"\",\"\",IF(M65=\"v\",N65,N66))","v":0},{"$f":"IF(M65=\"\",\"\",IF(M65=\"v\",O65,O66))","v":0},"V",{"$f":"IF(M12=\"\",\"\",IF(M12=\"p\",N12,N14))","v":0},{"$f":"IF(M12=\"\",\"\",IF(M12=\"p\",O12,O14))","v":0},null,null,{"$f":"IF(W12=\"\",\"\",IF(W12=\"p\",U12,U14))","v":"BOUSQUET GRILJALVO"},{"$f":"IF(W12=\"\",\"\",IF(W12=\"p\",V12,V14))","v":"75-4-ELIP"},"V",{"$f":"IF(T65=\"\",\"\",IF(T65=\"v\",R65,R66))","v":"BOUSQUET GRILJALVO"},{"$f":"IF(T65=\"\",\"\",IF(T65=\"v\",S65,S66))","v":"75-4-ELIP"},"P"]
[null,null,null,null,null,null,"V",{"$f":"IF(J66=\"\",\"\",IF(J66=\"v\",K66,K68))","v":0},{"$f":"IF(J66=\"\",\"\",IF(J66=\"v\",L66,L68))","v":0},null,null,null,null,null,null,null,null,null,null,null,null,null,null,{"$f":"IF(W66=\"\",\"\",IF(W66=\"v\",U66,U68))","v":"ROUVIER"},{"$f":"IF(W66=\"\",\"\",IF(W66=\"v\",V66,V68))","v":"75-4-BNDP"},"P"]
[null,null,null,null,null,null,null,null,null,"P",{"$f":"IF(M68=\"\",\"\",IF(M68=\"v\",N68,N69))","v":0},{"$f":"IF(M68=\"\",\"\",IF(M68=\"v\",O68,O69))","v":0},"V",{"$f":"IF(M20=\"\",\"\",IF(M20=\"p\",N20,N22))","v":0},{"$f":"IF(M20=\"\",\"\",IF(M20=\"p\",O20,O22))","v":0},null,null,{"$f":"IF(W20=\"\",\"\",IF(W20=\"p\",U20,U22))","v":"ROUVIER"},{"$f":"IF(W20=\"\",\"\",IF(W20=\"p\",V20,V22))","v":"75-4-BNDP"},"V",{"$f":"IF(T68=\"\",\"\",IF(T68=\"v\",R68,R69))","v":"ROUVIER"},{"$f":"IF(T68=\"\",\"\",IF(T68=\"v\",S68,S69))","v":"75-4-BNDP"},"V"]
[null,null,null,null,"25ème",null,null,null,null,null,null,null,"P",{"$f":"IF(M27=\"\",\"\",IF(M27=\"p\",N27,N29))","v":0},{"$f":"IF(M27=\"\",\"\",IF(M27=\"p\",O27,O29))","v":0},null,null,{"$f":"IF(W27=\"\",\"\",IF(W27=\"p\",U27,U29))","v":"GAREL"},{"$f":"IF(W27=\"\",\"\",IF(W27=\"p\",V27,V29))","v":"75-4-ELIP"},"P",null,null,null,null,null,null,null,"9ème"]
[null,null,null,null,{"$f":"IF(G67=\"\",\"\",IF(G67=\"v\",H67,H73))","v":0},{"$f":"IF(G67=\"\",\"\",IF(G67=\"v\",I67,I73))","v":0},null,null,null,null,null,null,null,null,null,null,null,null,null,null,null,null,null,null,null,null,{"$f":"IF(Z67=\"\",\"\",IF(Z67=\"v\",X67,X73))","v":"LHUERRE"},{"$f":"IF(Z67=\"\",\"\",IF(Z67=\"v\",Y67,Y73))","v":"75-4-LRPA"}]
[null,null,null,null,null,null,null,null,null,null,null,null,"V",{"$f":"IF(M37=\"\",\"\",IF(M37=\"p\",N37,N39))","v":0},{"$f":"IF(M37=\"\",\"\",IF(M37=\"p\",O37,O39))","v":0},null,null,{"$f":"IF(W37=\"\",\"\",IF(W37=\"p\",U37,U39))","v":"RAUFFET"},{"$f":"IF(W37=\"\",\"\",IF(W37=\"p\",V37,V39))","v":"75-4-LRPA"},"P"]
[null,null,null,null,null,null,null,null,null,"V",{"$f":"IF(M71=\"\",\"\",IF(M71=\"v\",N71,N72))","v":0},{"$f":"IF(M71=\"\",\"\",IF(M71=\"v\",O71,O72))","v":0},"P",{"$f":"IF(M44=\"\",\"\",IF(M44=\"p\",N44,N46))","v":0},{"$f":"IF(M44=\"\",\"\",IF(M44=\"p\",O44,O46))","v":0},null,null,{"$f":"IF(W44=\"\",\"\",IF(W44=\"p\",U44,U46))","v":"LHUERRE"},{"$f":"IF(W44=\"\",\"\",IF(W44=\"p\",V44,V46))","v":"75-4-LRPA"},"V",{"$f":"IF(T71=\"\",\"\",IF(T71=\"v\",R71,R72))","v":"LHUERRE"},{"$f":"IF(T71=\"\",\"\",IF(T71=\"v\",S71,S72))","v":"75-4-LRPA"},"V"]
[null,null,null,null,null,null,"P",{"$f":"IF(J72=\"\",\"\",IF(J72=\"v\",K72,K74))","v":0},{"$f":"IF(J72=\"\",\"\",IF(J72=\"v\",L72,L74))","v":0},null,null,null,null,null,null,null,null,null,null,null,null,null,null,{"$f":"IF(W72=\"\",\"\",IF(W72=\"v\",U72,U74))","v":"LHUERRE"},{"$f":"IF(W72=\"\",\"\",IF(W72=\"v\",V72,V74))","v":"75-4-LRPA"},"V"]
[null,null,null,null,null,null,null,null,null,"P",{"$f":"IF(M74=\"\",\"\",IF(M74=\"v\",N74,N75))","v":0},{"$f":"IF(M74=\"\",\"\",IF(M74=\"v\",O74,O75))","v":0},"V",{"$f":"IF(M52=\"\",\"\",IF(M52=\"p\",N52,N54))","v":0},{"$f":"IF(M52=\"\",\"\",IF(M52=\"p\",O52,O54))","v":0},null,null,{"$f":"IF(W52=\"\",\"\",IF(W52=\"p\",U52,U54))","v":"BERGERAULT"},{"$f":"IF(W52=\"\",\"\",IF(W52=\"p\",V52,V54))","v":"94-4-SMSM"},"P",{"$f":"IF(T74=\"\",\"\",IF(T74=\"v\",R74,R75))","v":"BALAHU DE NOIRON"},{"$f":"IF(T74=\"\",\"\",IF(T74=\"v\",S74,S75))","v":"75-4-BNDP"},"P"]
[null,null,null,null,null,null,null,null,null,null,null,null,"P",{"$f":"IF(M59=\"\",\"\",IF(M59=\"p\",N59,N61))","v":0},{"$f":"IF(M59=\"\",\"\",IF(M59=\"p\",O59,O61))","v":0},null,null,{"$f":"IF(W59=\"\",\"\",IF(W59=\"p\",U59,U61))","v":"BALAHU DE NOIRON"},{"$f":"IF(W59=\"\",\"\",IF(W59=\"p\",V59,V61))","v":"75-4-BNDP"},"V",null,null,null,null,null,null,{"$f":"IF(Z6=\"\",\"\",IF(Z6=\"p\",X6,X13))","v":"NEOUZE"},{"$f":"IF(Z6=\"\",\"\",IF(Z6=\"p\",Y6,Y13))","v":"75-4-STAP"},"P"]
[null,null,null,null,null,null,null,null,null,null,null,null,null,null,null,null,null,null,null,null,null,null,null,null,null,null,null,null,null,{"$f":"IF(AC75=\"\",\"\",IF(AC75=\"v\",AA75,AA77))","v":"DA VINHA"},{"$f":"IF(AC75=\"\",\"\",IF(AC75=\"v\",AB75,AB77))","v":"75-4-ELIP"},"V"]
[null,null,null,null,null,null,null,null,null,null,null,null,"V",{"$f":"IF(M65=\"\",\"\",IF(M65=\"p\",N65,N66))","v":0},{"$f":"IF(M65=\"\",\"\",IF(M65=\"p\",O65,O66))","v":0},null,null,{"$f":"IF(T65=\"\",\"\",IF(T65=\"p\",R65,R66))","v":"ROBERT MENDES"},{"$f":"IF(T65=\"\",\"\",IF(T65=\"p\",S65,S66))","v":"75-4-BNDP"},"V",null,null,null,null,null,null,{"$f":"IF(Z21=\"\",\"\",IF(Z21=\"p\",X21,X28))","v":"DA VINHA"},{"$f":"IF(Z21=\"\",\"\",IF(Z21=\"p\",Y21,Y28))","v":"75-4-ELIP"},"V"]
[null,null,null,null,null,null,null,"29ème",null,"V",{"$f":"IF(M77=\"\",\"\",IF(M77=\"v\",N77,N78))","v":0},{"$f":"IF(M77=\"\",\"\",IF(M77=\"v\",O77,O78))","v":0},"P",{"$f":"IF(M68=\"\",\"\",IF(M68=\"p\",N68,N69))","v":0},{"$f":"IF(M68=\"\",\"\",IF(M68=\"p\",O68,O69))","v":0},null,null,{"$f":"IF(T68=\"\",\"\",IF(T68=\"p\",R68,R69))","v":"GAREL"},{"$f":"IF(T68=\"\",\"\",IF(T68=\"p\",S68,S69))","v":"75-4-ELIP"},"P",{"$f":"IF(T77=\"\",\"\",IF(T77=\"v\",R77,R78))","v":"ROBERT MENDES"},{"$f":"IF(T77=\"\",\"\",IF(T77=\"v\",S77,S78))","v":"75-4-BNDP"},"V",null,"13ème",null,null,null,null,null,null,null,null,"5ème"]
[null,null,null,null,null,null,null,{"$f":"IF(J78=\"\",\"\",IF(J78=\"v\",K78,K80))","v":0},{"$f":"IF(J78=\"\",\"\",IF(J78=\"v\",L78,L80))","v":0},null,null,null,null,null,null,null,null,null,null,null,null,null,null,{"$f":"IF(W78=\"\",\"\",IF(W78=\"v\",U78,U80))","v":"ROBERT MENDES"},{"$f":"IF(W78=\"\",\"\",IF(W78=\"v\",V78,V80))","v":"75-4-BNDP"},null,null,null,null,null,null,null,{"$f":"IF(AF76=\"\",\"\",IF(AF76=\"v\",AD76,AD82))","v":"DA VINHA"},{"$f":"IF(AF76=\"\",\"\",IF(AF76=\"v\",AE76,AE82))","v":"75-4-ELIP"}]
[null,null,null,null,null,null,null,null,null,"P",{"$f":"IF(M80=\"\",\"\",IF(M80=\"v\",N80,N81))","v":0},{"$f":"IF(M80=\"\",\"\",IF(M80=\"v\",O80,O81))","v":0},"V",{"$f":"IF(M71=\"\",\"\",IF(M71=\"p\",N71,N72))","v":0},{"$f":"IF(M71=\"\",\"\",IF(M71=\"p\",O71,O72))","v":0},null,null,{"$f":"IF(T71=\"\",\"\",IF(T71=\"p\",R71,R72))","v":"RAUFFET"},{"$f":"IF(T71=\"\",\"\",IF(T71=\"p\",S71,S72))","v":"75-4-LRPA"},"P",{"$f":"IF(T80=\"\",\"\",IF(T80=\"v\",R80,R81))","v":"BERGERAULT"},{"$f":"IF(T80=\"\",\"\",IF(T80=\"v\",S80,S81))","v":"94-4-SMSM"},"P"]
[null,null,null,null,null,null,null,null,null,null,null,null,"P",{"$f":"IF(M74=\"\",\"\",IF(M74=\"p\",N74,N75))","v":0},{"$f":"IF(M74=\"\",\"\",IF(M74=\"p\",O74,O75))","v":0},null,null,{"$f":"IF(T74=\"\",\"\",IF(T74=\"p\",R74,R75))","v":"BERGERAULT"},{"$f":"IF(T74=\"\",\"\",IF(T74=\"p\",S74,S75))","v":"94-4-SMSM"},"V",null,null,null,null,null,null,{"$f":"IF(Z38=\"\",\"\",IF(Z38=\"p\",X38,X45))","v":"BOURDON"},{"$f":"IF(Z38=\"\",\"\",IF(Z38=\"p\",Y38,Y45))","v":"75-4-LRPA"},"V"]
[null,null,null,null,null,null,null,null,null,null,"27ème",null,null,null,null,null,null,null,null,null,null,"11ème",null,null,null,null,null,null,null,{"$f":"IF(AC81=\"\",\"\",IF(AC81=\"v\",AA81,AA83))","v":"BOURDON"},{"$f":"IF(AC81=\"\",\"\",IF(AC81=\"v\",AB81,AB83))","v":"75-4-LRPA"},"P"]
[null,null,null,null,null,null,null,null,null,null,{"$f":"IF(M83=\"\",\"\",IF(M83=\"v\",N83,N84))","v":0},{"$f":"IF(M83=\"\",\"\",IF(M83=\"v\",O83,O84))","v":0},"V",{"$f":"IF(J66=\"\",\"\",IF(J66=\"p\",K66,K68))","v":0},{"$f":"IF(J66=\"\",\"\",IF(J66=\"p\",L66,L68))","v":0},null,null,{"$f":"IF(W66=\"\",\"\",IF(W66=\"p\",U66,U68))","v":"BOUSQUET GRILJALVO"},{"$f":"IF(W66=\"\",\"\",IF(W66=\"p\",V66,V68))","v":"75-4-ELIP"},"V",{"$f":"IF(T83=\"\",\"\",IF(T83=\"v\",R83,R84))","v":"BOUSQUET GRILJALVO"},{"$f":"IF(T83=\"\",\"\",IF(T83=\"v\",S83,S84))","v":"75-4-ELIP"},null,null,null,null,{"$f":"IF(Z53=\"\",\"\",IF(Z53=\"p\",X53,X60))","v":"PROTIN"},{"$f":"IF(Z53=\"\",\"\",IF(Z53=\"p\",Y53,Y60))","v":"94-4-SMSM"},"P"]
[null,null,null,null,null,null,null,null,null,null,null,null,"P",{"$f":"IF(J72=\"\",\"\",IF(J72=\"p\",K72,K74))","v":0},{"$f":"IF(J72=\"\",\"\",IF(J72=\"p\",L72,L74))","v":0},null,null,{"$f":"IF(W72=\"\",\"\",IF(W72=\"p\",U72,U74))","v":"BALAHU DE NOIRON"},{"$f":"IF(W72=\"\",\"\",IF(W72=\"p\",V72,V74))","v":"75-4-BNDP"},"P"]
[null,null,null,null,null,null,"V",{"$f":"IF(J6=\"\",\"\",IF(J6=\"p\",K6,K13))","v":"SMSM"},{"$f":"IF(J6=\"\",\"\",IF(J6=\"p\",L6,L13))","v":"RATOUIS"},null,null,null,null,null,null,null,null,null,null,null,null,null,null,null,null,null,{"$f":"IF(AC75=\"\",\"\",IF(AC75=\"p\",AA75,AA77))","v":"NEOUZE"},{"$f":"IF(AC75=\"\",\"\",IF(AC75=\"p\",AB75,AB77))","v":"75-4-STAP"},"V",null,"7ème"]
[null,"21ème",null,"P",{"$f":"IF(G85=\"\",\"\",IF(G85=\"v\",H85,H86))","v":"SMSM"},{"$f":"IF(G85=\"\",\"\",IF(G85=\"v\",I85,I86))","v":"RATOUIS"},"P",{"$f":"IF(J21=\"\",\"\",IF(J21=\"p\",K21,K28))","v":0},{"$f":"IF(J21=\"\",\"\",IF(J21=\"p\",L21,L28))","v":0},null,"31ème",null,null,null,null,null,null,null,null,null,null,"15ème",null,null,null,null,null,null,null,{"$f":"IF(AC85=\"\",\"\",IF(AC85=\"v\",AA85,AA87))","v":"NEOUZE"},{"$f":"IF(AC85=\"\",\"\",IF(AC85=\"v\",AB85,AB87))","v":"75-4-STAP"}]
[null,{"$f":"IF(D86=\"\",\"\",IF(D86=\"v\",E86,E88))","v":"75-4-STAP"},{"$f":"IF(D86=\"\",\"\",IF(D86=\"v\",F86,F88))","v":"ASSIER DE POMPIGNAN"},null,null,null,null,null,null,null,{"$f":"IF(M87=\"\",\"\",IF(M87=\"v\",N87,N88))","v":0},{"$f":"IF(M87=\"\",\"\",IF(M87=\"v\",O87,O88))","v":0},"V",{"$f":"IF(M77=\"\",\"\",IF(M77=\"p\",N77,N78))","v":0},{"$f":"IF(M77=\"\",\"\",IF(M77=\"p\",O77,O78))","v":0},null,null,{"$f":"IF(T77=\"\",\"\",IF(T77=\"p\",R77,R78))","v":"GAREL"},{"$f":"IF(T77=\"\",\"\",IF(T77=\"p\",S77,S78))","v":"75-4-ELIP"},"P",{"$f":"IF(T87=\"\",\"\",IF(T87=\"v\",R87,R88))","v":"RAUFFET"},{"$f":"IF(T87=\"\",\"\",IF(T87=\"v\",S87,S88))","v":"75-4-LRPA"},null,null,null,null,{"$f":"IF(AC81=\"\",\"\",IF(AC81=\"p\",AA81,AA83))","v":"PROTIN"},{"$f":"IF(AC81=\"\",\"\",IF(AC81=\"p\",AB81,AB83))","v":"94-4-SMSM"},"P"]
[null,null,null,"V",{"$f":"IF(G88=\"\",\"\",IF(G88=\"v\",H88,H89))","v":"75-4-STAP"},{"$f":"IF(G88=\"\",\"\",IF(G88=\"v\",I88,I89))","v":"ASSIER DE POMPIGNAN"},"P",{"$f":"IF(J38=\"\",\"\",IF(J38=\"p\",K38,K45))","v":0},{"$f":"IF(J38=\"\",\"\",IF(J38=\"p\",L38,L45))","v":0},null,null,null,"P",{"$f":"IF(M80=\"\",\"\",IF(M80=\"p\",N80,N81))","v":0},{"$f":"IF(M80=\"\",\"\",IF(M80=\"p\",O80,O81))","v":0},null,null,{"$f":"IF(T80=\"\",\"\",IF(T80=\"p\",R80,R81))","v":"RAUFFET"},{"$f":"IF(T80=\"\",\"\",IF(T80=\"p\",S80,S81))","v":"75-4-LRPA"},"V"]
[null,null,null,null,null,null,"V",{"$f":"IF(J53=\"\",\"\",IF(J53=\"p\",K53,K60))","v":"75-4-STAP"},{"$f":"IF(J53=\"\",\"\",IF(J53=\"p\",L53,L60))","v":"ASSIER DE POMPIGNAN"}]
[null,"23ème"]
[null,{"$f":"IF(D91=\"\",\"\",IF(D91=\"v\",E91,E92))","v":0},{"$f":"IF(D91=\"\",\"\",IF(D91=\"v\",F91,F92))","v":0},"V",{"$f":"IF(G85=\"\",\"\",IF(G85=\"p\",H85,H86))","v":0},{"$f":"IF(G85=\"\",\"\",IF(G85=\"p\",I85,I86))","v":0}]
[null,null,null,"P",{"$f":"IF(G88=\"\",\"\",IF(G88=\"p\",H88,H89))","v":0},{"$f":"IF(G88=\"\",\"\",IF(G88=\"p\",I88,I89))","v":0}]

{"sheet":"Classement TA","index":11,"n_rows":35,"n_cols":3,"rows_kept":35,"cut":false,"hidden":false,"merged":[[1,0,1,2],[0,0,0,2]]}
[{"$f":"IF(Engagés!A1=\"\",\"\",Engagés!A1)","v":"Comité de Paris et Est-Francilien"}]
[{"$f":"IF(Engagés!E3=\"\",\"\",Engagés!E3)","v":"BG PROMO"}]
["CLASSEMENT","NOMS","Etablissement"]
["1er",{"$f":"Tableau!AG32","v":"CHAROLLOIS J"},{"$f":"Tableau!AH32","v":"94-4-ADMN"}]
["2ème",{"$f":"IF(Tableau!$AF$17=\"\",\"\",IF(Tableau!$AF$17=\"p\",Tableau!$AD$17,Tableau!$AD$49))","v":"GARDES"},{"$f":"IF(Tableau!$AF$17=\"\",\"\",IF(Tableau!$AF$17=\"p\",Tableau!$AE$17,Tableau!$AE$49))","v":"75-2-SCP"}]
["3ème",{"$f":"Tableau!AG62","v":"D'HARCOURT"},{"$f":"Tableau!AH62","v":"75-4-LRPA"}]
["4ème",{"$f":"IF(Tableau!AF61=\"\",\"\",IF(Tableau!$AF$61=\"p\",Tableau!$AD$61,Tableau!$AD$63))","v":"COULET"},{"$f":"IF(Tableau!AF61=\"\",\"\",IF(Tableau!$AF$61=\"p\",Tableau!$AE$61,Tableau!$AE$63))","v":"75-4-LRPA"}]
["5ème",{"$f":"Tableau!AG79","v":"DA VINHA"},{"$f":"Tableau!AH79","v":"75-4-ELIP"}]
["6ème",{"$f":"IF(Tableau!AF76=\"\",\"\",IF(Tableau!$AF$76=\"p\",Tableau!$AD$76,Tableau!$AD$82))","v":"BOURDON"},{"$f":"IF(Tableau!$AF$76=\"\",\"\",IF(Tableau!$AF$76=\"p\",Tableau!$AE$76,Tableau!$AE$82))","v":"75-4-LRPA"}]
["7ème",{"$f":"Tableau!AD86","v":"NEOUZE"},{"$f":"Tableau!AE86","v":"75-4-STAP"}]
["8ème",{"$f":"IF(Tableau!$AC$85=\"\",\"\",IF(Tableau!$AC$85=\"p\",Tableau!$AA$85,Tableau!$AA$87))","v":"PROTIN"},{"$f":"IF(Tableau!$AC$85=\"\",\"\",IF(Tableau!$AC$85=\"p\",Tableau!$AB$85,Tableau!$AB$87))","v":"94-4-SMSM"}]
["9ème",{"$f":"Tableau!AA70","v":"LHUERRE"},{"$f":"Tableau!Y73","v":"75-4-LRPA"}]
["10ème",{"$f":"IF(Tableau!$Z$67=\"\",\"\",IF(Tableau!$Z$67=\"p\",Tableau!$X$67,Tableau!$X$73))","v":"ROUVIER"},{"$f":"IF(Tableau!$Z$67=\"\",\"\",IF(Tableau!$Z$67=\"p\",Tableau!$Y$67,Tableau!$Y$73))","v":"75-4-BNDP"}]
["11ème",{"$f":"Tableau!U83","v":"BOUSQUET GRILJALVO"},{"$f":"Tableau!V83","v":"75-4-ELIP"}]
["12ème",{"$f":"IF(Tableau!$T$83=\"\",\"\",IF(Tableau!$T$83=\"p\",Tableau!$R$83,Tableau!$R$84))","v":"BALAHU DE NOIRON"},{"$f":"IF(Tableau!$T$83=\"\",\"\",IF(Tableau!$T$83=\"p\",Tableau!$S$83,Tableau!$S$84))","v":"75-4-BNDP"}]
["13ème",{"$f":"Tableau!X79","v":"ROBERT MENDES"},{"$f":"Tableau!Y79","v":"75-4-BNDP"}]
["14ème",{"$f":"IF(Tableau!$W$78=\"\",\"\",IF(Tableau!$W$78=\"p\",Tableau!$U$78,Tableau!$U$80))","v":"BERGERAULT"},{"$f":"IF(Tableau!$W$78=\"\",\"\",IF(Tableau!$W$78=\"p\",Tableau!$V$78,Tableau!$V$80))","v":"94-4-SMSM"}]
["15ème",{"$f":"Tableau!U87","v":"RAUFFET"},{"$f":"Tableau!V87","v":"75-4-LRPA"}]
["16ème",{"$f":"IF(Tableau!$T$87=\"\",\"\",IF(Tableau!$T$87=\"p\",Tableau!$R$87,Tableau!$R$88))","v":"GAREL"},{"$f":"IF(Tableau!$T$87=\"\",\"\",IF(Tableau!$T$87=\"p\",Tableau!$S$87,Tableau!$S$88))","v":"75-4-ELIP"}]
["17ème",{"$f":"Tableau!C32","v":"BENNANI BRAOULI"},{"$f":"Tableau!B32","v":"ADMN"}]
["18ème",{"$f":"IF(Tableau!$D$16=\"\",\"\",IF(Tableau!$D$16=\"p\",Tableau!$F$60,Tableau!$F$48))","v":"COHEN"},{"$f":"IF(Tableau!$D$16=\"\",\"\",IF(Tableau!$D$16=\"p\",Tableau!$E$16,Tableau!$E$48))","v":"94-4-PROV"}]
["19ème",{"$f":"Tableau!C61","v":"BAILLON"},{"$f":"Tableau!B61","v":"ADMN"}]
["20ème",{"$f":"IF(Tableau!D60=\"\",\"\",IF(Tableau!$D$60=\"p\",Tableau!$F$60,Tableau!$F$62))","v":"JACOB"},{"$f":"IF(Tableau!D60=\"\",\"\",IF(Tableau!$D$60=\"p\",Tableau!$E$60,Tableau!$E$62))","v":"75-4-SMPP"}]
["21ème",{"$f":"Tableau!C87","v":"ASSIER DE POMPIGNAN"},{"$f":"Tableau!B87","v":"75-4-STAP"}]
["22ème",{"$f":"IF(Tableau!$D$86=\"\",\"\",IF(Tableau!$D$86=\"p\",Tableau!$F$86,Tableau!$F$88))","v":"RATOUIS"},{"$f":"IF(Tableau!$D$86=\"\",\"\",IF(Tableau!$D$86=\"p\",Tableau!$E$86,Tableau!$E$88))","v":"SMSM"}]
["23ème",{"$f":"Tableau!C91","v":0},{"$f":"Tableau!B91","v":0}]
["24ème",{"$f":"IF(Tableau!$D$91=\"\",\"\",IF(Tableau!$D$91=\"p\",Tableau!$F$91,Tableau!$F$92))","v":0},{"$f":"IF(Tableau!$D$91=\"\",\"\",IF(Tableau!$D$91=\"p\",Tableau!$E$91,Tableau!$E$92))","v":0}]
["25ème",{"$f":"Tableau!F70","v":0},{"$f":"Tableau!E70","v":0}]
["26ème",{"$f":"IF(Tableau!$G$67=\"\",\"\",IF(Tableau!$G$67=\"p\",Tableau!$I$67,Tableau!$I$73))","v":0},{"$f":"IF(Tableau!$G$67=\"\",\"\",IF(Tableau!$G$67=\"p\",Tableau!$H$73,Tableau!$H$67))","v":0}]
["27ème",{"$f":"Tableau!L83","v":0},{"$f":"Tableau!K83","v":0}]
["28ème",{"$f":"IF(Tableau!$M$83=\"\",\"\",IF(Tableau!$M$83=\"p\",Tableau!$O$83,Tableau!$O$84))","v":0},{"$f":"IF(Tableau!$M$83=\"\",\"\",IF(Tableau!$M$83=\"p\",Tableau!$N$83,Tableau!$N$84))","v":0}]
["29ème",{"$f":"Tableau!I79","v":0},{"$f":"Tableau!H79","v":0}]
["30ème",{"$f":"IF(Tableau!$J$78=\"\",\"\",IF(Tableau!$J$78=\"p\",Tableau!$L$78,Tableau!$L$80))","v":0},{"$f":"IF(Tableau!$J$78=\"\",\"\",IF(Tableau!$J$78=\"p\",Tableau!$K$78,Tableau!$K$80))","v":0}]
["31ème",{"$f":"Tableau!L87","v":0},{"$f":"Tableau!K87","v":0}]
["32ème",{"$f":"IF(Tableau!$M$87=\"\",\"\",IF(Tableau!$M$87=\"p\",Tableau!$O$87,Tableau!$O$88))","v":0},{"$f":"IF(Tableau!$M$87=\"\",\"\",IF(Tableau!$M$87=\"p\",Tableau!$N$87,Tableau!$N$88))","v":0}]

{"sheet":"Classement Général","index":12,"n_rows":31,"n_cols":11,"rows_kept":31,"cut":false,"hidden":false,"merged":[[0,4,0,5],[0,7,0,8]]}
[null,null,null,null,"VAINQUEUR DU MATCH",null,null,"PERDANT DU MATCH"]
["1er TA",{"$f":"'Classement TA'!B4","v":"CHAROLLOIS J"},{"$f":"'Classement TA'!C4","v":"94-4-ADMN"}]
["1er TB","VIVIER","STAP",null,"CHALOLLOIS J","ADMN",null,"VIVIER","STAP"]
[null,null,null,null,null,"1er",null,null,"2ème"]
["2ème TA",{"$f":"'Classement TA'!B5","v":"GARDES"},{"$f":"'Classement TA'!C5","v":"75-2-SCP"}]
["2ème TB","PERRIN","ADMN",null,"GARDES","SCP",null,"PERRIN","ADMN"]
[null,null,null,null,null,"3ème",null,null,"4ème"]
["3ème TA",{"$f":"'Classement TA'!B6","v":"D'HARCOURT"},{"$f":"'Classement TA'!C6","v":"75-4-LRPA"}]
["3ème TB","ROUQUETTE","BNDP",null,"ROUQUETTE","BNDP",null,"D'HARCOURT","LRPA"]
[null,null,null,null,null,"5ème",null,null,"6ème"]
["4ème TA",{"$f":"'Classement TA'!B7","v":"COULET"},{"$f":"'Classement TA'!C7","v":"75-4-LRPA"}]
["4ème TB","PELISSIER-COMBESCURE","STAP",null,"COULET","LRPA",null,"PELISSIER-COMBESCURE","STAP",null,{"$f":"IF([1]Tableau!AO66=\"\",\"\",IF([1]Tableau!$AF$61=\"p\",[1]Tableau!$AD$61,[1]Tableau!$AD$63))","v":""}]
[null,null,null,null,null,"7ème",null,null,"8ème"]
["5ème TA",{"$f":"'Classement TA'!B8","v":"DA VINHA"},{"$f":"'Classement TA'!C8","v":"75-4-ELIP"}]
["5ème TB","CHAROLLOIS A","ÄDMN",null,"DA VINHA","ELIP",null,"CHAROLLOIS A","ADM"]
[null,null,null,null,null,"9ème",null,null,"10ème"]
["6ème TA",{"$f":"'Classement TA'!B9","v":"BOURDON"},{"$f":"'Classement TA'!C9","v":"75-4-LRPA"}]
["6ème TB","MAINGUY","PROV",null,"MAINGUY","PROV",null,"BOURDON","LRPA"]
[null,null,null,null,null,"11ème",null,null,"12ème"]
["7ème TA",{"$f":"'Classement TA'!B10","v":"NEOUZE"},{"$f":"'Classement TA'!C10","v":"75-4-STAP"}]
["7ème TB","REMY RAMELLI","ELIP",null,"NEOUZE","STAP",null,"REMY RAMELLI","ELIP"]
[null,null,null,null,null,"13ème",null,null,"14ème"]
["8ème TA",{"$f":"'Classement TA'!B11","v":"PROTIN"},{"$f":"'Classement TA'!C11","v":"94-4-SMSM"}]
["8ème TB","DIAB","ELIP",null,"PROTIN","SMSM",null,"DIAB","ELIP"]
[null,null,null,null,null,"15ème",null,null,"16ème"]
["9ème TA",{"$f":"'Classement TA'!B12","v":"LHUERRE"},{"$f":"'Classement TA'!C12","v":"75-4-LRPA"}]
["9ème TB","BIASINI","SCP",null,"LHUERRE","LRPA",null,"BIASINI","SCP"]
[null,null,null,null,null,"17ème",null,null,"18ème"]
["10ème TA",{"$f":"'Classement TA'!B13","v":"ROUVIER"},{"$f":"'Classement TA'!C13","v":"75-4-BNDP"}]
["10ème TB","RODIER","ELIP",null,"RODIER","ELIP",null,"ROUVIER","BNDP"]
[null,null,null,null,null,"19ème",null,null,"20ème"]