{"text_format":"1","workbook":"xlsx","n_sheets":13,"sheets":["Engagés","Poule 1","Poule 2","Poule 3","Poule 4","Poule 5","Poule 6","Poule 7","Poule 8","Résultats de poule","Tableau","Classement TA","Classement Général"],"not_rendered":{"charts":0,"images":81,"macros":1,"external_links":1,"defined_names":1,"comments":0,"pivot_tables":0},"unopened":[],"bounds":{"document_bytes":16777216,"sheet_cells":100000,"rows_first":2000,"rows_last":500,"rows_between":2000,"halvings":0,"cell_chars":16384,"cell_head_chars":4096},"cells_cut":0,"cells_raw":0,"read":"whole","date_system":"1900"}

{"sheet":"Engagés","index":0,"n_rows":37,"n_cols":14,"rows_kept":37,"cut":false,"hidden":false,"merged":[[17,6,17,9],[17,10,17,13],[23,6,23,9],[23,10,23,13],[0,0,2,1],[0,2,1,2],[5,10,5,13],[5,6,5,9],[11,6,11,9],[11,10,11,13]]}
["Comité de Paris et Est-Francilien",null,"BADMINTON","DATE :","13 dec"]
[null,null,null,"LIEU :","LR"]
[null,null,"TABLEAU A","CATEGORIE :","BG PROMO"]
["Tête de série","ETABLISSEMENT","NOM","PRENOM","SIGLE"]
[]
[1,"ALBERT DE MUN","CHAROLLOIS J","JULES","94-4-ADMN",null,"Poule 1",null,null,null,"Poule 2"]
[2,"MARIE CLOTILDE","GARDES","ADRIEN","75-2-SCP",null,1,{"$f":"VLOOKUP($G7,$A$1:$E$37,3,FALSE)","v":"CHAROLLOIS J"},{"$f":"VLOOKUP($G7,$A$1:$E$37,4,FALSE)","v":"JULES"},{"$f":"VLOOKUP($G7,$A$1:$E$37,5,FALSE)","v":"94-4-ADMN"},2,{"$f":"VLOOKUP($K7,$A$1:$E$37,3,FALSE)","v":"GARDES"},{"$f":"VLOOKUP($K7,$A$1:$E$37,4,FALSE)","v":"ADRIEN"},{"$f":"VLOOKUP($K7,$A$1:$E$37,5,FALSE)","v":"75-2-SCP"}]
[3,"ETOILE SP. LA ROCHEFOUCAULD","BOURDON","MAXIME","75-4-LRPA",null,16,{"$f":"VLOOKUP($G8,$A$1:$E$37,3,FALSE)","v":"COHEN"},{"$f":"VLOOKUP($G8,$A$1:$E$37,4,FALSE)","v":"HADRIEN"},{"$f":"VLOOKUP($G8,$A$1:$E$37,5,FALSE)","v":"94-4-PROV"},15,{"$f":"VLOOKUP($K8,$A$1:$E$37,3,FALSE)","v":"D'HARCOURT"},{"$f":"VLOOKUP($K8,$A$1:$E$37,4,FALSE)","v":"RAPHAEL"},{"$f":"VLOOKUP($K8,$A$1:$E$37,5,FALSE)","v":"75-4-LRPA"}]
[4,"ESSOR SPORTIF ET CULTUREL","DA VINHA","LEANDRE","75-4-ELIP",null,17,{"$f":"VLOOKUP($G9,$A$1:$E$37,3,FALSE)","v":"ROUVIER"},{"$f":"VLOOKUP($G9,$A$1:$E$37,4,FALSE)","v":"RAPHAEL"},{"$f":"VLOOKUP($G9,$A$1:$E$37,5,FALSE)","v":"75-4-BNDP"},18,{"$f":"VLOOKUP($K9,$A$1:$E$37,3,FALSE)","v":"BENNANI BRAOULI"},{"$f":"VLOOKUP($K9,$A$1:$E$37,4,FALSE)","v":"FAYL"},{"$f":"VLOOKUP($K9,$A$1:$E$37,5,FALSE)","v":"94-4-ADMN"}]
[5,"COL-LYC BOSSUET NOTRE DAME","BALAHU DE NOIRON","JULES","75-4-BNDP",null,32,{"$f":"VLOOKUP($G10,$A$1:$E$37,3,FALSE)","v":0},{"$f":"VLOOKUP($G10,$A$1:$E$37,4,FALSE)","v":0},{"$f":"VLOOKUP($G10,$A$1:$E$37,5,FALSE)","v":0},31,{"$f":"VLOOKUP($K10,$A$1:$E$37,3,FALSE)","v":0},{"$f":"VLOOKUP($K10,$A$1:$E$37,4,FALSE)","v":0},{"$f":"VLOOKUP($K10,$A$1:$E$37,5,FALSE)","v":0}]
{"$rows_left_out":28}
{"sheet":"Poule 1","index":1,"n_rows":24,"n_cols":7,"rows_kept":24,"cut":false,"hidden":false,"merged":[[22,2,22,3],[20,0,20,1],[18,4,18,6],[11,0,11,2],[12,0,12,2],[14,0,14,2],[17,0,17,2],[18,0,18,3],[21,4,21,5],[19,0,19,1],[15,0,15,2],[16,0,16,2],[19,2,19,3],[8,0,8,2],[9,0,9,2],[10,0,10,2],[1,0,1,2],[1,3,1,6],[0,0,0,2],[0,3,0,4],[22,0,22,1],[20,2,20,3],[23,4,23,5],[22,4,22,5],[13,0,13,6],[14,3,14,4],[23,2,23,3],[21,0,21,1],[23,0,23,1],[21,2,21,3],[19,4,19,5],[20,4,20,5],[7,0,7,6],[8,3,8,4]]}
[{"$f":"Engagés!C1","v":"BADMINTON"},null,null,{"$f":"Engagés!C3","v":"TABLEAU A"}]
["POULE 1"]
[null,"NOM","Prénom","Sigle","Vict","Def","Classement"]
[1,{"$f":"VLOOKUP($A4,Engagés!$A$1:$E$376,3,FALSE)","v":"CHAROLLOIS J"},{"$f":"VLOOKUP($A4,Engagés!$A$1:$E$376,4,FALSE)","v":"JULES"},{"$f":"VLOOKUP($A4,Engagés!$A$1:$E$376,5,FALSE)","v":"94-4-ADMN"},null,null,"1er"]
[16,{"$f":"VLOOKUP($A5,Engagés!$A$1:$E$376,3,FALSE)","v":"COHEN"},{"$f":"VLOOKUP($A5,Engagés!$A$1:$E$376,4,FALSE)","v":"HADRIEN"},{"$f":"VLOOKUP($A5,Engagés!$A$1:$E$376,5,FALSE)","v":"94-4-PROV"},null,null,"3ème"]
[17,{"$f":"VLOOKUP($A6,Engagés!$A$1:$E$376,3,FALSE)","v":"ROUVIER"},{"$f":"VLOOKUP($A6,Engagés!$A$1:$E$376,4,FALSE)","v":"RAPHAEL"},{"$f":"VLOOKUP($A6,Engagés!$A$1:$E$376,5,FALSE)","v":"75-4-BNDP"},null,null,"2ème"]
[32,{"$f":"VLOOKUP($A7,Engagés!$A$1:$E$376,3,FALSE)","v":0},{"$f":"VLOOKUP($A7,Engagés!$A$1:$E$376,4,FALSE)","v":0},{"$f":"VLOOKUP($A7,Engagés!$A$1:$E$376,5,FALSE)","v":0},null,null,"4ème"]
["Si poule de 4 joueurs alors…"]
["Déroulement",null,null,"Joueurs A contre Joueur B",null,"Vainqueur","Score"]
["Match 1",null,null,{"$f":"B4","v":"CHAROLLOIS J"},{"$f":"B7","v":0}]
{"$rows_left_out":15}
{"sheet":"Poule 2","index":2,"n_rows":24,"n_cols":7,"rows_kept":24,"cut":false,"hidden":false,"merged":[[23,0,23,1],[23,2,23,3],[23,4,23,5],[21,0,21,1],[21,2,21,3],[21,4,21,5],[22,0,22,1],[22,2,22,3],[22,4,22,5],[17,0,17,2],[18,0,18,3],[18,4,18,6],[20,0,20,1],[20,2,20,3],[20,4,20,5],[19,0,19,1],[19,2,19,3],[19,4,19,5],[0,3,0,4],[15,0,15,2],[16,0,16,2],[1,0,1,2],[1,3,1,6],[7,0,7,6],[8,0,8,2],[8,3,8,4],[9,0,9,2],[10,0,10,2],[11,0,11,2],[12,0,12,2],[13,0,13,6],[14,0,14,2],[14,3,14,4],[0,0,0,2]]}
[{"$f":"Engagés!C1","v":"BADMINTON"},null,null,{"$f":"Engagés!C3","v":"TABLEAU A"}]
["POULE 2"]
[null,"NOM","Prénom","Sigle","Vict","Def","Classement"]
[2,{"$f":"VLOOKUP($A4,Engagés!$A$1:$E$376,3,FALSE)","v":"GARDES"},{"$f":"VLOOKUP($A4,Engagés!$A$1:$E$376,4,FALSE)","v":"ADRIEN"},{"$f":"VLOOKUP($A4,Engagés!$A$1:$E$376,5,FALSE)","v":"75-2-SCP"},null,null,"2ème"]
[15,{"$f":"VLOOKUP($A5,Engagés!$A$1:$E$376,3,FALSE)","v":"D'HARCOURT"},{"$f":"VLOOKUP($A5,Engagés!$A$1:$E$376,4,FALSE)","v":"RAPHAEL"},{"$f":"VLOOKUP($A5,Engagés!$A$1:$E$376,5,FALSE)","v":"75-4-LRPA"},null,null,"1er"]
[18,{"$f":"VLOOKUP($A6,Engagés!$A$1:$E$376,3,FALSE)","v":"BENNANI BRAOULI"},{"$f":"VLOOKUP($A6,Engagés!$A$1:$E$376,4,FALSE)","v":"FAYL"},{"$f":"VLOOKUP($A6,Engagés!$A$1:$E$376,5,FALSE)","v":"94-4-ADMN"},null,null,"3ème"]
[31,{"$f":"VLOOKUP($A7,Engagés!$A$1:$E$376,3,FALSE)","v":0},{"$f":"VLOOKUP($A7,Engagés!$A$1:$E$376,4,FALSE)","v":0},{"$f":"VLOOKUP($A7,Engagés!$A$1:$E$376,5,FALSE)","v":0},null,null,"4ème"]
["Si poule de 4 joueurs alors…"]
["Déroulement",null,null,"Joueurs A contre Joueur B",null,"Vainqueur","Score"]
["Match 1",null,null,{"$f":"B4","v":"GARDES"},{"$f":"B7","v":0}]
{"$rows_left_out":15}
{"sheet":"Poule 3","index":3,"n_rows":24,"n_cols":7,"rows_kept":24,"cut":false,"hidden":false,"merged":[[23,0,23,1],[23,2,23,3],[23,4,23,5],[21,0,21,1],[21,2,21,3],[21,4,21,5],[22,0,22,1],[22,2,22,3],[22,4,22,5],[17,0,17,2],[18,0,18,3],[18,4,18,6],[20,0,20,1],[20,2,20,3],[20,4,20,5],[19,0,19,1],[19,2,19,3],[19,4,19,5],[0,3,0,4],[15,0,15,2],[16,0,16,2],[1,0,1,2],[1,3,1,6],[7,0,7,6],[8,0,8,2],[8,3,8,4],[9,0,9,2],[10,0,10,2],[11,0,11,2],[12,0,12,2],[13,0,13,6],[14,0,14,2],[14,3,14,4],[0,0,0,2]]}
[{"$f":"Engagés!C1","v":"BADMINTON"},null,null,{"$f":"Engagés!C3","v":"TABLEAU A"}]
["POULE 3"]
[null,"NOM","Prénom","Sigle","Vict","Def","Classement"]
[3,{"$f":"VLOOKUP($A4,Engagés!$A$1:$E$376,3,FALSE)","v":"BOURDON"},{"$f":"VLOOKUP($A4,Engagés!$A$1:$E$376,4,FALSE)","v":"MAXIME"},{"$f":"VLOOKUP($A4,Engagés!$A$1:$E$376,5,FALSE)","v":"75-4-LRPA"},null,null,"1er"]
[14,{"$f":"VLOOKUP($A5,Engagés!$A$1:$E$376,3,FALSE)","v":"ASSIER DE POMPIGNAN"},{"$f":"VLOOKUP($A5,Engagés!$A$1:$E$376,4,FALSE)","v":"JOSEPH"},{"$f":"VLOOKUP($A5,Engagés!$A$1:$E$376,5,FALSE)","v":"75-4-STAP"},null,null,"2ème"]
[19,{"$f":"VLOOKUP($A6,Engagés!$A$1:$E$376,3,FALSE)","v":"RATOUIS"},{"$f":"VLOOKUP($A6,Engagés!$A$1:$E$376,4,FALSE)","v":"LEO"},{"$f":"VLOOKUP($A6,Engagés!$A$1:$E$376,5,FALSE)","v":"94-4-SMSM"},null,null,"3ème"]
[30,{"$f":"VLOOKUP($A7,Engagés!$A$1:$E$376,3,FALSE)","v":0},{"$f":"VLOOKUP($A7,Engagés!$A$1:$E$376,4,FALSE)","v":0},{"$f":"VLOOKUP($A7,Engagés!$A$1:$E$376,5,FALSE)","v":0},null,null,"4ème"]
["Si poule de 4 joueurs alors…"]
["Déroulement",null,null,"Joueurs A contre Joueur B",null,"Vainqueur","Score"]
["Match 1",null,null,{"$f":"B4","v":"BOURDON"},{"$f":"B7","v":0}]
{"$rows_left_out":15}
{"sheet":"Poule 4","index":4,"n_rows":24,"n_cols":7,"rows_kept":24,"cut":false,"hidden":false,"merged":[[23,0,23,1],[23,2,23,3],[23,4,23,5],[21,0,21,1],[21,2,21,3],[21,4,21,5],[22,0,22,1],[22,2,22,3],[22,4,22,5],[17,0,17,2],[18,0,18,3],[18,4,18,6],[20,0,20,1],[20,2,20,3],[20,4,20,5],[19,0,19,1],[19,2,19,3],[19,4,19,5],[0,3,0,4],[15,0,15,2],[16,0,16,2],[1,0,1,2],[1,3,1,6],[7,0,7,6],[8,0,8,2],[8,3,8,4],[9,0,9,2],[10,0,10,2],[11,0,11,2],[12,0,12,2],[13,0,13,6],[14,0,14,2],[14,3,14,4],[0,0,0,2]]}
[{"$f":"Engagés!C1","v":"BADMINTON"},null,null,{"$f":"Engagés!C3","v":"TABLEAU A"}]
["POULE 4"]
[null,"NOM","Prénom","Sigle","Vict","Def","Classement"]
[4,{"$f":"VLOOKUP($A4,Engagés!$A$1:$E$376,3,FALSE)","v":"DA VINHA"},{"$f":"VLOOKUP($A4,Engagés!$A$1:$E$376,4,FALSE)","v":"LEANDRE"},{"$f":"VLOOKUP($A4,Engagés!$A$1:$E$376,5,FALSE)","v":"75-4-ELIP"},null,null,"1er"]
[13,{"$f":"VLOOKUP($A5,Engagés!$A$1:$E$376,3,FALSE)","v":"JACOB"},{"$f":"VLOOKUP($A5,Engagés!$A$1:$E$376,4,FALSE)","v":"BAPTISTE"},{"$f":"VLOOKUP($A5,Engagés!$A$1:$E$376,5,FALSE)","v":"75-4-SMPP"},null,null,"3ème"]
[20,{"$f":"VLOOKUP($A6,Engagés!$A$1:$E$376,3,FALSE)","v":"BAILLON"},{"$f":"VLOOKUP($A6,Engagés!$A$1:$E$376,4,FALSE)","v":"VICTOR"},{"$f":"VLOOKUP($A6,Engagés!$A$1:$E$376,5,FALSE)","v":"94-4-ADMN"},null,null,"2ème"]
[29,{"$f":"VLOOKUP($A7,Engagés!$A$1:$E$376,3,FALSE)","v":0},{"$f":"VLOOKUP($A7,Engagés!$A$1:$E$376,4,FALSE)","v":0},{"$f":"VLOOKUP($A7,Engagés!$A$1:$E$376,5,FALSE)","v":0},null,null,"4ème"]
["Si poule de 4 joueurs alors…"]
["Déroulement",null,null,"Joueurs A contre Joueur B",null,"Vainqueur","Score"]
["Match 1",null,null,{"$f":"B4","v":"DA VINHA"},{"$f":"B7","v":0},0]
{"$rows_left_out":15}
{"sheet":"Poule 5","index":5,"n_rows":24,"n_cols":7,"rows_kept":24,"cut":false,"hidden":false,"merged":[[23,0,23,1],[23,2,23,3],[23,4,23,5],[21,0,21,1],[21,2,21,3],[21,4,21,5],[22,0,22,1],[22,2,22,3],[22,4,22,5],[20,0,20,1],[20,2,20,3],[20,4,20,5],[14,0,14,2],[14,3,14,4],[15,0,15,2],[18,4,18,6],[19,0,19,1],[19,2,19,3],[19,4,19,5],[16,0,16,2],[17,0,17,2],[18,0,18,3],[12,0,12,2],[13,0,13,6],[0,0,0,2],[0,3,0,4],[10,0,10,2],[11,0,11,2],[1,0,1,2],[1,3,1,6],[7,0,7,6],[8,0,8,2],[8,3,8,4],[9,0,9,2]]}
[{"$f":"Engagés!C1","v":"BADMINTON"},null,null,{"$f":"Engagés!C3","v":"TABLEAU A"}]
["POULE 5"]
[null,"NOM","Prénom","Sigle","Vict","Def","Classement"]
[5,{"$f":"VLOOKUP($A4,Engagés!$A$1:$E$376,3,FALSE)","v":"BALAHU DE NOIRON"},{"$f":"VLOOKUP($A4,Engagés!$A$1:$E$376,4,FALSE)","v":"JULES"},{"$f":"VLOOKUP($A4,Engagés!$A$1:$E$376,5,FALSE)","v":"75-4-BNDP"},null,null,"2ème"]
[12,{"$f":"VLOOKUP($A5,Engagés!$A$1:$E$376,3,FALSE)","v":"LHUERRE"},{"$f":"VLOOKUP($A5,Engagés!$A$1:$E$376,4,FALSE)","v":"MAXIME"},{"$f":"VLOOKUP($A5,Engagés!$A$1:$E$376,5,FALSE)","v":"75-4-LRPA"},null,null,"1er"]
[21,{"$f":"VLOOKUP($A6,Engagés!$A$1:$E$376,3,FALSE)","v":"BOUSQUET GRIJALVO"},{"$f":"VLOOKUP($A6,Engagés!$A$1:$E$376,4,FALSE)","v":"ARTHUR"},{"$f":"VLOOKUP($A6,Engagés!$A$1:$E$376,5,FALSE)","v":"75-4-ELIP"},null,null,"3ème"]
[28,{"$f":"VLOOKUP($A7,Engagés!$A$1:$E$376,3,FALSE)","v":0},{"$f":"VLOOKUP($A7,Engagés!$A$1:$E$376,4,FALSE)","v":0},{"$f":"VLOOKUP($A7,Engagés!$A$1:$E$376,5,FALSE)","v":0},null,null,"4ème"]
["Si poule de 4 joueurs alors…"]
["Déroulement",null,null,"Joueurs A contre Joueur B",null,"Vainqueur","Score"]
["Match 1",null,null,{"$f":"B4","v":"BALAHU DE NOIRON"},{"$f":"B7","v":0},0]
{"$rows_left_out":15}
{"sheet":"Poule 6","index":6,"n_rows":24,"n_cols":7,"rows_kept":24,"cut":false,"hidden":false,"merged":[[23,0,23,1],[23,2,23,3],[23,4,23,5],[21,0,21,1],[21,2,21,3],[21,4,21,5],[22,0,22,1],[22,2,22,3],[22,4,22,5],[20,0,20,1],[20,2,20,3],[20,4,20,5],[14,0,14,2],[14,3,14,4],[15,0,15,2],[18,4,18,6],[19,0,19,1],[19,2,19,3],[19,4,19,5],[16,0,16,2],[17,0,17,2],[18,0,18,3],[12,0,12,2],[13,0,13,6],[0,0,0,2],[0,3,0,4],[10,0,10,2],[11,0,11,2],[1,0,1,2],[1,3,1,6],[7,0,7,6],[8,0,8,2],[8,3,8,4],[9,0,9,2]]}
[{"$f":"Engagés!C1","v":"BADMINTON"},null,null,{"$f":"Engagés!C3","v":"TABLEAU A"}]
["POULE 6"]
[null,"NOM","Prénom","Sigle","Vict","Def","Classement"]
[6,{"$f":"VLOOKUP($A4,Engagés!$A$1:$E$376,3,FALSE)","v":"COULET"},{"$f":"VLOOKUP($A4,Engagés!$A$1:$E$376,4,FALSE)","v":"SIXTE"},{"$f":"VLOOKUP($A4,Engagés!$A$1:$E$376,5,FALSE)","v":"75-4-LRPA"},null,null,"1er"]
[11,{"$f":"VLOOKUP($A5,Engagés!$A$1:$E$376,3,FALSE)","v":"ROBERT MENDES"},{"$f":"VLOOKUP($A5,Engagés!$A$1:$E$376,4,FALSE)","v":"THOMAS"},{"$f":"VLOOKUP($A5,Engagés!$A$1:$E$376,5,FALSE)","v":"75-4-BNDP"},null,null,"2ème"]
[22,{"$f":"VLOOKUP($A6,Engagés!$A$1:$E$376,3,FALSE)","v":"BERGERAULT"},{"$f":"VLOOKUP($A6,Engagés!$A$1:$E$376,4,FALSE)","v":"SACHA"},{"$f":"VLOOKUP($A6,Engagés!$A$1:$E$376,5,FALSE)","v":"94-4-SMSM"},null,null,"3ème"]
[27,{"$f":"VLOOKUP($A7,Engagés!$A$1:$E$376,3,FALSE)","v":0},{"$f":"VLOOKUP($A7,Engagés!$A$1:$E$376,4,FALSE)","v":0},{"$f":"VLOOKUP($A7,Engagés!$A$1:$E$376,5,FALSE)","v":0},null,null,"4ème"]
["Si poule de 4 joueurs alors…"]
["Déroulement",null,null,"Joueurs A contre Joueur B",null,"Vainqueur","Score"]
["Match 1",null,null,{"$f":"B4","v":"COULET"},{"$f":"B7","v":0},0]
{"$rows_left_out":15}
{"sheet":"Poule 7","index":7,"n_rows":24,"n_cols":7,"rows_kept":24,"cut":false,"hidden":false,"merged":[[23,0,23,1],[23,2,23,3],[23,4,23,5],[21,0,21,1],[21,2,21,3],[21,4,21,5],[22,0,22,1],[22,2,22,3],[22,4,22,5],[20,0,20,1],[20,2,20,3],[20,4,20,5],[14,0,14,2],[14,3,14,4],[15,0,15,2],[18,4,18,6],[19,0,19,1],[19,2,19,3],[19,4,19,5],[16,0,16,2],[17,0,17,2],[18,0,18,3],[12,0,12,2],[13,0,13,6],[0,0,0,2],[0,3,0,4],[10,0,10,2],[11,0,11,2],[1,0,1,2],[1,3,1,6],[7,0,7,6],[8,0,8,2],[8,3,8,4],[9,0,9,2]]}
[{"$f":"Engagés!C1","v":"BADMINTON"},null,null,{"$f":"Engagés!C3","v":"TABLEAU A"}]
["POULE 7"]
[null,"NOM","Prénom","Sigle","Vict","Def","Classement"]
[7,{"$f":"VLOOKUP($A4,Engagés!$A$1:$E$376,3,FALSE)","v":"NEOUZE"},{"$f":"VLOOKUP($A4,Engagés!$A$1:$E$376,4,FALSE)","v":"GUILHEM"},{"$f":"VLOOKUP($A4,Engagés!$A$1:$E$376,5,FALSE)","v":"75-4-STAP"},null,null,"1er"]
[10,{"$f":"VLOOKUP($A5,Engagés!$A$1:$E$376,3,FALSE)","v":"GAREL"},{"$f":"VLOOKUP($A5,Engagés!$A$1:$E$376,4,FALSE)","v":"ARTHUR"},{"$f":"VLOOKUP($A5,Engagés!$A$1:$E$376,5,FALSE)","v":"75-4-ELIP"},null,null,"2ème"]
[23,{"$f":"VLOOKUP($A6,Engagés!$A$1:$E$376,3,FALSE)","v":0},{"$f":"VLOOKUP($A6,Engagés!$A$1:$E$376,4,FALSE)","v":0},{"$f":"VLOOKUP($A6,Engagés!$A$1:$E$376,5,FALSE)","v":0},null,null,"4ème"]
[26,{"$f":"VLOOKUP($A7,Engagés!$A$1:$E$376,3,FALSE)","v":0},{"$f":"VLOOKUP($A7,Engagés!$A$1:$E$376,4,FALSE)","v":0},{"$f":"VLOOKUP($A7,Engagés!$A$1:$E$376,5,FALSE)","v":0},null,null,"3ème"]
["Si poule de 4 joueurs alors…"]
["Déroulement",null,null,"Joueurs A contre Joueur B",null,"Vainqueur","Score"]
["Match 1",null,null,{"$f":"B4","v":"NEOUZE"},{"$f":"B7","v":0},0]
{"$rows_left_out":15}
{"sheet":"Poule 8","index":8,"n_rows":24,"n_cols":7,"rows_kept":24,"cut":false,"hidden":false,"merged":[[23,0,23,1],[23,2,23,3],[23,4,23,5],[21,0,21,1],[21,2,21,3],[21,4,21,5],[22,0,22,1],[22,2,22,3],[22,4,22,5],[20,0,20,1],[20,2,20,3],[20,4,20,5],[14,0,14,2],[14,3,14,4],[15,0,15,2],[18,4,18,6],[19,0,19,1],[19,2,19,3],[19,4,19,5],[16,0,16,2],[17,0,17,2],[18,0,18,3],[12,0,12,2],[13,0,13,6],[0,0,0,2],[0,3,0,4],[10,0,10,2],[11,0,11,2],[1,0,1,2],[1,3,1,6],[7,0,7,6],[8,0,8,2],[8,3,8,4],[9,0,9,2]]}
[{"$f":"Engagés!C1","v":"BADMINTON"},null,null,{"$f":"Engagés!C3","v":"TABLEAU A"}]
["POULE 8"]
[null,"NOM","Prénom","Sigle","Vict","Def","Classement"]
[8,{"$f":"VLOOKUP($A4,Engagés!$A$1:$E$376,3,FALSE)","v":"RAUFFET"},{"$f":"VLOOKUP($A4,Engagés!$A$1:$E$376,4,FALSE)","v":"HELIE"},{"$f":"VLOOKUP($A4,Engagés!$A$1:$E$376,5,FALSE)","v":"75-4-LRPA"},null,null,"2ème"]
[9,{"$f":"VLOOKUP($A5,Engagés!$A$1:$E$376,3,FALSE)","v":"PROTIN"},{"$f":"VLOOKUP($A5,Engagés!$A$1:$E$376,4,FALSE)","v":"CLEMENT"},{"$f":"VLOOKUP($A5,Engagés!$A$1:$E$376,5,FALSE)","v":"94-4-SMSM"},null,null,"1er"]
[24,{"$f":"VLOOKUP($A6,Engagés!$A$1:$E$376,3,FALSE)","v":0},{"$f":"VLOOKUP($A6,Engagés!$A$1:$E$376,4,FALSE)","v":0},{"$f":"VLOOKUP($A6,Engagés!$A$1:$E$376,5,FALSE)","v":0},null,null,"4ème"]
[25,{"$f":"VLOOKUP($A7,Engagés!$A$1:$E$376,3,FALSE)","v":0},{"$f":"VLOOKUP($A7,Engagés!$A$1:$E$376,4,FALSE)","v":0},{"$f":"VLOOKUP($A7,Engagés!$A$1:$E$376,5,FALSE)","v":0},null,null,"3ème"]
["Si poule de 4 joueurs alors…"]
["Déroulement",null,null,"Joueurs A contre Joueur B",null,"Vainqueur","Score"]
["Match 1",null,null,{"$f":"B4","v":"RAUFFET"},{"$f":"B7","v":0}]
{"$rows_left_out":15}
{"sheet":"Résultats de poule","index":9,"n_rows":10,"n_cols":16,"rows_kept":10,"cut":false,"hidden":false,"merged":[[0,0,0,3],[0,4,0,7],[0,8,0,11],[0,12,0,15],[5,0,5,3],[5,4,5,7],[5,8,5,11],[5,12,5,15]]}
["Poule 1",null,null,null,"Poule 2",null,null,null,"Poule 3",null,null,null,"Poule 4"]
["1er",{"$f":"'Poule 1'!$C21","v":"CHAROLLOIS J"},{"$f":"'Poule 1'!$E21","v":"JULES"},{"$f":"'Poule 1'!$G21","v":"94-4-ADMN"},"1er",{"$f":"'Poule 2'!$C21","v":"D'HARCOURT"},{"$f":"'Poule 2'!$E21","v":"RAPHAEL"},{"$f":"'Poule 2'!$G21","v":"75-4-LRPA"},"1er",{"$f":"'Poule 3'!$C21","v":"BOURDON"},{"$f":"'Poule 3'!$E21","v":"MAXIME"},{"$f":"'Poule 3'!$G21","v":"75-4-LRPA"},"1er",{"$f":"'Poule 4'!$C21","v":"DA VINHA"},{"$f":"'Poule 4'!$E21","v":"LEANDRE"},{"$f":"'Poule 4'!$G21","v":"75-4-ELIP"}]
["2ème",{"$f":"'Poule 1'!$C22","v":"ROUVIER"},{"$f":"'Poule 1'!$E22","v":"RAPHAEL"},{"$f":"'Poule 1'!$G22","v":"75-4-BNDP"},"2ème",{"$f":"'Poule 2'!$C22","v":"GARDES"},{"$f":"'Poule 2'!$E22","v":"ADRIEN"},{"$f":"'Poule 2'!$G22","v":"75-2-SCP"},"2ème",{"$f":"'Poule 3'!$C22","v":"ASSIER DE POMPIGNAN"},{"$f":"'Poule 3'!$E22","v":"JOSEPH"},{"$f":"'Poule 3'!$G22","v":"75-4-STAP"},"2ème",{"$f":"'Poule 4'!$C22","v":"BAILLON"},{"$f":"'Poule 4'!$E22","v":"VICTOR"},{"$f":"'Poule 4'!$G22","v":"94-4-ADMN"}]
["3ème",{"$f":"'Poule 1'!$C23","v":"COHEN"},{"$f":"'Poule 1'!$E23","v":"HADRIEN"},{"$f":"'Poule 1'!$G23","v":"94-4-PROV"},"3ème",{"$f":"'Poule 2'!$C23","v":"BENNANI BRAOULI"},{"$f":"'Poule 2'!$E23","v":"FAYL"},{"$f":"'Poule 2'!$G23","v":"94-4-ADMN"},"3ème",{"$f":"'Poule 3'!$C23","v":"RATOUIS"},{"$f":"'Poule 3'!$E23","v":"LEO"},{"$f":"'Poule 3'!$G23","v":"94-4-SMSM"},"3ème",{"$f":"'Poule 4'!$C23","v":"JACOB"},{"$f":"'Poule 4'!$E23","v":"BAPTISTE"},{"$f":"'Poule 4'!$G23","v":"75-4-SMPP"}]
["4ème",{"$f":"'Poule 1'!$C24","v":0},{"$f":"'Poule 1'!$E24","v":0},{"$f":"'Poule 1'!$G24","v":0},"4ème",{"$f":"'Poule 2'!$C24","v":0},{"$f":"'Poule 2'!$E24","v":0},{"$f":"'Poule 2'!$G24","v":0},"4ème",{"$f":"'Poule 3'!$C24","v":0},{"$f":"'Poule 3'!$E24","v":0},{"$f":"'Poule 3'!$G24","v":0},"4ème",{"$f":"'Poule 4'!$C24","v":0},{"$f":"'Poule 4'!$E24","v":0},{"$f":"'Poule 4'!$G24","v":0}]
["Poule 5",null,null,null,"Poule 6",null,null,null,"Poule 7",null,null,null,"Poule 8"]
["1er",{"$f":"'Poule 5'!$C21","v":"LHUERRE"},{"$f":"'Poule 5'!$E21","v":"MAXIME"},{"$f":"'Poule 5'!$G21","v":"75-4-LRPA"},"1er",{"$f":"'Poule 6'!$C21","v":"COULET"},{"$f":"'Poule 6'!$E21","v":"SIXTE"},{"$f":"'Poule 6'!$G21","v":"75-4-LRPA"},"1er",{"$f":"'Poule 7'!$C21","v":"NEOUZE"},{"$f":"'Poule 7'!$E21","v":"GUILHEM"},{"$f":"'Poule 7'!$G21","v":"75-4-STAP"},"1er",{"$f":"'Poule 8'!$C21","v":"PROTIN"},{"$f":"'Poule 8'!$E21","v":"CLEMENT"},{"$f":"'Poule 8'!$G21","v":"94-4-SMSM"}]
["2ème",{"$f":"'Poule 5'!$C22","v":"BALAHU DE NOIRON"},{"$f":"'Poule 5'!$E22","v":"JULES"},{"$f":"'Poule 5'!$G22","v":"75-4-BNDP"},"2ème",{"$f":"'Poule 6'!$C22","v":"ROBERT MENDES"},{"$f":"'Poule 6'!$E22","v":"THOMAS"},{"$f":"'Poule 6'!$G22","v":"75-4-BNDP"},"2ème",{"$f":"'Poule 7'!$C22","v":"GAREL"},{"$f":"'Poule 7'!$E22","v":"ARTHUR"},{"$f":"'Poule 7'!$G22","v":"75-4-ELIP"},"2ème",{"$f":"'Poule 8'!$C22","v":"RAUFFET"},{"$f":"'Poule 8'!$E22","v":"HELIE"},{"$f":"'Poule 8'!$G22","v":"75-4-LRPA"}]
["3ème",{"$f":"'Poule 5'!$C23","v":"BOUSQUET GRIJALVO"},{"$f":"'Poule 5'!$E23","v":"ARTHUR"},{"$f":"'Poule 5'!$G23","v":"75-4-ELIP"},"3ème",{"$f":"'Poule 6'!$C23","v":"BERGERAULT"},{"$f":"'Poule 6'!$E23","v":"SACHA"},{"$f":"'Poule 6'!$G23","v":"94-4-SMSM"},"3ème",{"$f":"'Poule 7'!$C23","v":0},{"$f":"'Poule 7'!$E23","v":0},{"$f":"'Poule 7'!$G23","v":0},"3ème",{"$f":"'Poule 8'!$C23","v":0},{"$f":"'Poule 8'!$E23","v":0},{"$f":"'Poule 8'!$G23","v":0}]
["4ème",{"$f":"'Poule 5'!$C24","v":0},{"$f":"'Poule 5'!$E24","v":0},{"$f":"'Poule 5'!$G24","v":0},"4ème",{"$f":"'Poule 6'!$C24","v":0},{"$f":"'Poule 6'!$E24","v":0},{"$f":"'Poule 6'!$G24","v":0},"4ème",{"$f":"'Poule 7'!$C24","v":0},{"$f":"'Poule 7'!$E24","v":0},{"$f":"'Poule 7'!$G24","v":0},"4ème",{"$f":"'Poule 8'!$C24","v":0},{"$f":"'Poule 8'!$E24","v":0},{"$f":"'Poule 8'!$G24","v":0}]
{"$rows_left_out":1}
{"sheet":"Tableau","index":10,"n_rows":92,"n_cols":34,"rows_kept":92,"cut":false,"hidden":false,"merged":[[55,10,55,11],[33,4,33,5],[42,1,42,2],[59,29,59,30],[55,23,55,24],[47,29,47,30],[35,20,35,21],[42,20,42,21],[41,23,41,24],[48,26,48,27],[57,20,57,21],[30,32,30,33],[0,16,0,19],[15,29,15,30],[0,0,0,14],[31,29,31,30],[10,1,10,2],[1,4,1,5],[0,20,0,33],[16,26,16,27],[23,23,23,24],[3,20,3,21],[18,20,18,21],[29,4,29,5],[25,20,25,21],[1,10,1,11],[9,23,9,24],[8,10,8,11],[50,20,50,21],[16,10,16,11],[23,10,23,11],[33,10,33,11],[40,10,40,11],[48,10,48,11],[10,20,10,21]]}
["REPECHAGES ET MATCHS DE CLASSEMENT",null,null,null,null,null,null,null,null,null,null,null,null,null,null,null,"1er tour de tableau",null,null,null,"TABLEAU PRINCIPAL"]
[]
[]
[null,null,null,null,null,null,null,null,null,null,null,null,null,null,null,null,"1er poule 1",{"$f":"'Résultats de poule'!B2","v":"CHAROLLOIS J"},{"$f":"'Résultats de poule'!D2","v":"94-4-ADMN"},"V","1/8 de finale 1"]
[null,null,null,null,null,null,null,null,null,null,null,null,"P",{"$f":"IF(T4=\"\",\"\",IF(T4=\"p\",S4,S5))","v":0},{"$f":"IF(T4=\"\",\"\",IF(T4=\"p\",R4,R5))","v":0},null,"4ème poule 8",{"$f":"'Résultats de poule'!N10","v":0},{"$f":"'Résultats de poule'!P10","v":0},"P",{"$f":"IF(T4=\"\",\"\",IF(T4=\"v\",R4,R5))","v":"CHAROLLOIS J"},{"$f":"IF(T4=\"\",\"\",IF(T4=\"v\",S4,S5))","v":"94-4-ADMN"},"V"]
[null,null,null,null,null,null,null,null,null,"P",{"$f":"IF(M5=\"\",\"\",IF(M5=\"v\",N5,N7))","v":"SMSM"},{"$f":"IF(M5=\"\",\"\",IF(M5=\"v\",O5,O7))","v":"RATOUIS"},null,null,null,null,null,null,null,null,null,null,null,{"$f":"IF(W5=\"\",\"\",IF(W5=\"v\",U5,U7))","v":"CHAROLLOIS J"},{"$f":"IF(W5=\"\",\"\",IF(W5=\"v\",V5,V7))","v":"94-4-ADMN"},"V"]
[null,null,null,null,null,null,null,null,null,null,null,null,"V","SMSM","RATOUIS",null,"3ème poule 3",{"$f":"'Résultats de poule'!J4","v":"RATOUIS"},{"$f":"'Résultats de poule'!L4","v":"94-4-SMSM"},"P","ROBERT MENDES","75-4-BNDP","P"]
[null,null,null,null,null,null,null,null,null,null,null,null,null,null,null,null,"2ème poule 6",{"$f":"'Résultats de poule'!F8","v":"ROBERT MENDES"},{"$f":"'Résultats de poule'!H8","v":"75-4-BNDP"},"V"]
[null,null,null,null,null,null,"P",{"$f":"IF(J6=\"\",\"\",IF(J6=\"v\",K6,K13))","v":"ADMN"},{"$f":"IF(J6=\"\",\"\",IF(J6=\"v\",L6,L13))","v":"BAILLON"}]
[null,null,null,null,null,null,null,null,null,null,null,null,null,null,null,null,null,null,null,null,null,null,null,"1/4 finale 1",null,null,{"$f":"IF(Z6=\"\",\"\",IF(Z6=\"v\",X6,X13))","v":"CHAROLLOIS J"},{"$f":"IF(Z6=\"\",\"\",IF(Z6=\"v\",Y6,Y13))","v":"94-4-ADMN"},"V"]
{"$rows_left_out":83}
{"sheet":"Classement TA","index":11,"n_rows":35,"n_cols":3,"rows_kept":35,"cut":false,"hidden":false,"merged":[[1,0,1,2],[0,0,0,2]]}
[{"$f":"IF(Engagés!A1=\"\",\"\",Engagés!A1)","v":"Comité de Paris et Est-Francilien"}]
[{"$f":"IF(Engagés!E3=\"\",\"\",Engagés!E3)","v":"BG PROMO"}]
["CLASSEMENT","NOMS","Etablissement"]
["1er",{"$f":"Tableau!AG32","v":"CHAROLLOIS J"},{"$f":"Tableau!AH32","v":"94-4-ADMN"}]
["2ème",{"$f":"IF(Tableau!$AF$17=\"\",\"\",IF(Tableau!$AF$17=\"p\",Tableau!$AD$17,Tableau!$AD$49))","v":"GARDES"},{"$f":"IF(Tableau!$AF$17=\"\",\"\",IF(Tableau!$AF$17=\"p\",Tableau!$AE$17,Tableau!$AE$49))","v":"75-2-SCP"}]
["3ème",{"$f":"Tableau!AG62","v":"D'HARCOURT"},{"$f":"Tableau!AH62","v":"75-4-LRPA"}]
["4ème",{"$f":"IF(Tableau!AF61=\"\",\"\",IF(Tableau!$AF$61=\"p\",Tableau!$AD$61,Tableau!$AD$63))","v":"COULET"},{"$f":"IF(Tableau!AF61=\"\",\"\",IF(Tableau!$AF$61=\"p\",Tableau!$AE$61,Tableau!$AE$63))","v":"75-4-LRPA"}]
["5ème",{"$f":"Tableau!AG79","v":"DA VINHA"},{"$f":"Tableau!AH79","v":"75-4-ELIP"}]
["6ème",{"$f":"IF(Tableau!AF76=\"\",\"\",IF(Tableau!$AF$76=\"p\",Tableau!$AD$76,Tableau!$AD$82))","v":"BOURDON"},{"$f":"IF(Tableau!$AF$76=\"\",\"\",IF(Tableau!$AF$76=\"p\",Tableau!$AE$76,Tableau!$AE$82))","v":"75-4-LRPA"}]
["7ème",{"$f":"Tableau!AD86","v":"NEOUZE"},{"$f":"Tableau!AE86","v":"75-4-STAP"}]
{"$rows_left_out":26}
{"sheet":"Classement Général","index":12,"n_rows":31,"n_cols":11,"rows_kept":31,"cut":false,"hidden":false,"merged":[[0,4,0,5],[0,7,0,8]]}
[null,null,null,null,"VAINQUEUR DU MATCH",null,null,"PERDANT DU MATCH"]
["1er TA",{"$f":"'Classement TA'!B4","v":"CHAROLLOIS J"},{"$f":"'Classement TA'!C4","v":"94-4-ADMN"}]
["1er TB","VIVIER","STAP",null,"CHALOLLOIS J","ADMN",null,"VIVIER","STAP"]
[null,null,null,null,null,"1er",null,null,"2ème"]
["2ème TA",{"$f":"'Classement TA'!B5","v":"GARDES"},{"$f":"'Classement TA'!C5","v":"75-2-SCP"}]
["2ème TB","PERRIN","ADMN",null,"GARDES","SCP",null,"PERRIN","ADMN"]
[null,null,null,null,null,"3ème",null,null,"4ème"]
["3ème TA",{"$f":"'Classement TA'!B6","v":"D'HARCOURT"},{"$f":"'Classement TA'!C6","v":"75-4-LRPA"}]
["3ème TB","ROUQUETTE","BNDP",null,"ROUQUETTE","BNDP",null,"D'HARCOURT","LRPA"]
[null,null,null,null,null,"5ème",null,null,"6ème"]
{"$rows_left_out":21}