{"text_format":"1","workbook":"xlsx","n_sheets":9,"sheets":["Engagés","Répartition des joueurs","Poule 1","Poule 2","Poule 3","Poule 4","Résultats de poule","Tableau","Classement"],"not_rendered":{"charts":0,"images":37,"macros":1,"external_links":0,"defined_names":2,"comments":0,"pivot_tables":0},"unopened":[],"bounds":{"document_bytes":16777216,"sheet_cells":100000,"rows_first":2000,"rows_last":500,"rows_between":2000,"halvings":0,"cell_chars":16384,"cell_head_chars":4096},"cells_cut":0,"cells_raw":0,"read":"whole","date_system":"1900"}

{"sheet":"Engagés","index":0,"n_rows":21,"n_cols":6,"rows_kept":21,"cut":false,"hidden":false,"merged":[[0,0,2,2],[0,4,0,5],[1,4,1,5],[2,4,2,5]]}
["Championnat du Comité de Paris et EST Francilien",null,null,"DATE :","2023-11-29"]
[null,null,null,"LIEU :","LR"]
[null,null,null,"CATEGORIE :","CF"]
["Tête de série","ETABLISSEMENT","NOM","PRENOM","SIGLE","Cls"]
[]
[1,null,"LHUERRE","TESS","75-4-LRPA"]
[2,null,"TAILLARDAT","LOANNE","75-4-LRPA"]
[3,null,"DE PERIGNON","JULIETTE","75-4-LRPA"]
[4,null,"VAGIC","LUCIE","75-4-SMPP"]
[5,null,"DATH","AUBE","75-4-ELIP"]
[6,null,"PIC","JOSEPHINE","75-4-SMPP"]
[7,null,"MASINA","ELEA","94-4-SMSM"]
[8,null,"VINCENT","MARION","94-4-SMSM"]
[9,null,"BELLIN","CLEMENCE","75-4-LRPA"]
[10,null,"SAINTE BEUVE","PAULINE","75-4-LRPA"]
{"$rows_left_out":7}
{"sheet":"Répartition des joueurs","index":1,"n_rows":5,"n_cols":16,"rows_kept":5,"cut":false,"hidden":false,"merged":[[0,0,0,3],[0,4,0,7],[0,8,0,11],[0,12,0,15]]}
["Poule 1",null,null,null,"Poule 2",null,null,null,"Poule 3",null,null,null,"Poule 4"]
[1,{"$f":"VLOOKUP($A2,Engagés!$A$1:$E$368,3,FALSE)","v":"LHUERRE"},{"$f":"VLOOKUP($A2,Engagés!$A$1:$E$368,4,FALSE)","v":"TESS"},{"$f":"VLOOKUP($A2,Engagés!$A$1:$E$368,5,FALSE)","v":"75-4-LRPA"},2,{"$f":"VLOOKUP($E2,Engagés!$A$1:$E$368,3,FALSE)","v":"TAILLARDAT"},{"$f":"VLOOKUP($E2,Engagés!$A$1:$E$368,4,FALSE)","v":"LOANNE"},{"$f":"VLOOKUP($E2,Engagés!$A$1:$E$368,5,FALSE)","v":"75-4-LRPA"},3,{"$f":"VLOOKUP($I2,Engagés!$A$1:$E$368,3,FALSE)","v":"DE PERIGNON"},{"$f":"VLOOKUP($I2,Engagés!$A$1:$E$368,4,FALSE)","v":"JULIETTE"},{"$f":"VLOOKUP($I2,Engagés!$A$1:$E$368,5,FALSE)","v":"75-4-LRPA"},4,{"$f":"VLOOKUP($M2,Engagés!$A$1:$E$368,3,FALSE)","v":"VAGIC"},{"$f":"VLOOKUP($M2,Engagés!$A$1:$E$368,4,FALSE)","v":"LUCIE"},{"$f":"VLOOKUP($M2,Engagés!$A$1:$E$368,5,FALSE)","v":"75-4-SMPP"}]
[8,{"$f":"VLOOKUP($A3,Engagés!$A$1:$E$368,3,FALSE)","v":"VINCENT"},{"$f":"VLOOKUP($A3,Engagés!$A$1:$E$368,4,FALSE)","v":"MARION"},{"$f":"VLOOKUP($A3,Engagés!$A$1:$E$368,5,FALSE)","v":"94-4-SMSM"},7,{"$f":"VLOOKUP($E3,Engagés!$A$1:$E$368,3,FALSE)","v":"MASINA"},{"$f":"VLOOKUP($E3,Engagés!$A$1:$E$368,4,FALSE)","v":"ELEA"},{"$f":"VLOOKUP($E3,Engagés!$A$1:$E$368,5,FALSE)","v":"94-4-SMSM"},6,{"$f":"VLOOKUP($I3,Engagés!$A$1:$E$368,3,FALSE)","v":"PIC"},{"$f":"VLOOKUP($I3,Engagés!$A$1:$E$368,4,FALSE)","v":"JOSEPHINE"},{"$f":"VLOOKUP($I3,Engagés!$A$1:$E$368,5,FALSE)","v":"75-4-SMPP"},5,{"$f":"VLOOKUP($M3,Engagés!$A$1:$E$368,3,FALSE)","v":"DATH"},{"$f":"VLOOKUP($M3,Engagés!$A$1:$E$368,4,FALSE)","v":"AUBE"},{"$f":"VLOOKUP($M3,Engagés!$A$1:$E$368,5,FALSE)","v":"75-4-ELIP"}]
[9,{"$f":"VLOOKUP($A4,Engagés!$A$1:$E$368,3,FALSE)","v":"BELLIN"},{"$f":"VLOOKUP($A4,Engagés!$A$1:$E$368,4,FALSE)","v":"CLEMENCE"},{"$f":"VLOOKUP($A4,Engagés!$A$1:$E$368,5,FALSE)","v":"75-4-LRPA"},10,{"$f":"VLOOKUP($E4,Engagés!$A$1:$E$368,3,FALSE)","v":"SAINTE BEUVE"},{"$f":"VLOOKUP($E4,Engagés!$A$1:$E$368,4,FALSE)","v":"PAULINE"},{"$f":"VLOOKUP($E4,Engagés!$A$1:$E$368,5,FALSE)","v":"75-4-LRPA"},11,{"$f":"VLOOKUP($I4,Engagés!$A$1:$E$368,3,FALSE)","v":"BRESOLIN"},{"$f":"VLOOKUP($I4,Engagés!$A$1:$E$368,4,FALSE)","v":"ALIX"},{"$f":"VLOOKUP($I4,Engagés!$A$1:$E$368,5,FALSE)","v":"75-4-ELIP"},12,{"$f":"VLOOKUP($M4,Engagés!$A$1:$E$368,3,FALSE)","v":"FRANCESCHINA"},{"$f":"VLOOKUP($M4,Engagés!$A$1:$E$368,4,FALSE)","v":"EMMA"},{"$f":"VLOOKUP($M4,Engagés!$A$1:$E$368,5,FALSE)","v":"75-4-STAP"}]
[16,{"$f":"VLOOKUP($A5,Engagés!$A$1:$E$368,3,FALSE)","v":0},{"$f":"VLOOKUP($A5,Engagés!$A$1:$E$368,4,FALSE)","v":0},{"$f":"VLOOKUP($A5,Engagés!$A$1:$E$368,5,FALSE)","v":0},15,{"$f":"VLOOKUP($E5,Engagés!$A$1:$E$368,3,FALSE)","v":"RICHAUD"},{"$f":"VLOOKUP($E5,Engagés!$A$1:$E$368,4,FALSE)","v":"VICTOIRE"},{"$f":"VLOOKUP($E5,Engagés!$A$1:$E$368,5,FALSE)","v":"75-4-STAP"},14,{"$f":"VLOOKUP($I5,Engagés!$A$1:$E$368,3,FALSE)","v":"REENAERS"},{"$f":"VLOOKUP($I5,Engagés!$A$1:$E$368,4,FALSE)","v":"LINDSAY"},{"$f":"VLOOKUP($I5,Engagés!$A$1:$E$368,5,FALSE)","v":"94-4-SMSM"},13,{"$f":"VLOOKUP($M5,Engagés!$A$1:$E$368,3,FALSE)","v":"GODET"},{"$f":"VLOOKUP($M5,Engagés!$A$1:$E$368,4,FALSE)","v":"LOUISE"},{"$f":"VLOOKUP($M5,Engagés!$A$1:$E$368,5,FALSE)","v":"75-4-LRPA"}]

{"sheet":"Poule 1","index":2,"n_rows":24,"n_cols":7,"rows_kept":24,"cut":false,"hidden":false,"merged":[[23,0,23,1],[23,2,23,3],[23,4,23,5],[21,0,21,1],[21,2,21,3],[21,4,21,5],[22,0,22,1],[22,2,22,3],[22,4,22,5],[20,4,20,5],[14,0,14,2],[19,0,19,1],[19,2,19,3],[19,4,19,5],[20,0,20,1],[20,2,20,3],[14,3,14,4],[15,0,15,2],[16,0,16,2],[17,0,17,2],[18,0,18,3],[18,4,18,6],[9,0,9,2],[10,0,10,2],[11,0,11,2],[12,0,12,2],[13,0,13,6],[0,0,0,6],[1,0,1,2],[1,3,1,6],[7,0,7,6],[8,0,8,2],[8,3,8,4]]}
["               BADMINTON "]
["POULE 1",null,null,"TERRAIN N°"]
[null,"NOM","Prénom","Sigle","Vict","Def","Classement"]
[1,{"$f":"VLOOKUP($A4,Engagés!$A$1:$F$52,3,FALSE)","v":"LHUERRE"},{"$f":"VLOOKUP($A4,Engagés!$A$1:$F$52,4,FALSE)","v":"TESS"},{"$f":"VLOOKUP($A4,Engagés!$A$1:$F$52,5,FALSE)","v":"75-4-LRPA"},null,null,"1er"]
[8,{"$f":"VLOOKUP($A5,Engagés!$A$1:$F$52,3,FALSE)","v":"VINCENT"},{"$f":"VLOOKUP($A5,Engagés!$A$1:$F$52,4,FALSE)","v":"MARION"},{"$f":"VLOOKUP($A5,Engagés!$A$1:$F$52,5,FALSE)","v":"94-4-SMSM"},null,null,"2ème"]
[9,{"$f":"VLOOKUP($A6,Engagés!$A$1:$F$52,3,FALSE)","v":"BELLIN"},{"$f":"VLOOKUP($A6,Engagés!$A$1:$F$52,4,FALSE)","v":"CLEMENCE"},{"$f":"VLOOKUP($A6,Engagés!$A$1:$F$52,5,FALSE)","v":"75-4-LRPA"},null,null,"3ème"]
[16,{"$f":"VLOOKUP($A7,Engagés!$A$1:$F$52,3,FALSE)","v":0},{"$f":"VLOOKUP($A7,Engagés!$A$1:$F$52,4,FALSE)","v":0},{"$f":"VLOOKUP($A7,Engagés!$A$1:$F$52,5,FALSE)","v":0}]
["Si poule de 4 joueurs alors…"]
["Déroulement",null,null,"Joueurs A contre Joueur B",null,"Vainqueur","Score"]
["Match 1",null,null,{"$f":"B4","v":"LHUERRE"},{"$f":"B7","v":0}]
["Match 2",null,null,{"$f":"B5","v":"VINCENT"},{"$f":"B6","v":"BELLIN"}]
["Finale vainqueur Match 1 contre vainqueur Match 2",null,null,{"$f":"IF(F10=\"\",\"\",F10)","v":""},{"$f":"IF(F11=\"\",\"\",F11)","v":""}]
["Petite finale entre les deux perdants des matchs 1 et 2",null,null,{"$f":"IF(D12=\"\",\"\",IF(D12=D10,E10,D10))","v":""},{"$f":"IF(E12=\"\",\"\",IF(E12=D11,E11,D11))","v":""}]
["Si poule de 3 joueurs alors…"]
["Déroulement",null,null,"Joueurs A contre Joueur B",null,"Vainqueur","Score"]
{"$rows_left_out":10}
{"sheet":"Poule 2","index":3,"n_rows":24,"n_cols":7,"rows_kept":24,"cut":false,"hidden":false,"merged":[[23,0,23,1],[23,2,23,3],[23,4,23,5],[21,0,21,1],[21,2,21,3],[21,4,21,5],[22,0,22,1],[22,2,22,3],[22,4,22,5],[19,0,19,1],[19,2,19,3],[19,4,19,5],[13,0,13,6],[14,3,14,4],[15,0,15,2],[16,0,16,2],[17,0,17,2],[20,0,20,1],[20,2,20,3],[20,4,20,5],[0,0,0,6],[1,0,1,2],[1,3,1,6],[7,0,7,6],[8,0,8,2],[8,3,8,4],[9,0,9,2],[10,0,10,2],[11,0,11,2],[12,0,12,2],[14,0,14,2],[18,0,18,3],[18,4,18,6]]}
["               BADMINTON "]
["POULE 2",null,null,"TERRAIN N°"]
[null,"NOM","Prénom","Sigle","Vict","Def","Classement"]
[2,{"$f":"VLOOKUP($A4,Engagés!$A$1:$F$52,3,FALSE)","v":"TAILLARDAT"},{"$f":"VLOOKUP($A4,Engagés!$A$1:$F$52,4,FALSE)","v":"LOANNE"},{"$f":"VLOOKUP($A4,Engagés!$A$1:$F$52,5,FALSE)","v":"75-4-LRPA"},null,null,"1er"]
[7,{"$f":"VLOOKUP($A5,Engagés!$A$1:$F$52,3,FALSE)","v":"MASINA"},{"$f":"VLOOKUP($A5,Engagés!$A$1:$F$52,4,FALSE)","v":"ELEA"},{"$f":"VLOOKUP($A5,Engagés!$A$1:$F$52,5,FALSE)","v":"94-4-SMSM"},null,null,"3ème"]
[10,{"$f":"VLOOKUP($A6,Engagés!$A$1:$F$52,3,FALSE)","v":"SAINTE BEUVE"},{"$f":"VLOOKUP($A6,Engagés!$A$1:$F$52,4,FALSE)","v":"PAULINE"},{"$f":"VLOOKUP($A6,Engagés!$A$1:$F$52,5,FALSE)","v":"75-4-LRPA"},null,null,"4ème"]
[15,{"$f":"VLOOKUP($A7,Engagés!$A$1:$F$52,3,FALSE)","v":"RICHAUD"},{"$f":"VLOOKUP($A7,Engagés!$A$1:$F$52,4,FALSE)","v":"VICTOIRE"},{"$f":"VLOOKUP($A7,Engagés!$A$1:$F$52,5,FALSE)","v":"75-4-STAP"},null,null,"2ème"]
["Si poule de 4 joueurs alors…"]
["Déroulement",null,null,"Joueurs A contre Joueur B",null,"Vainqueur","Score"]
["Match 1",null,null,{"$f":"B4","v":"TAILLARDAT"},{"$f":"B7","v":"RICHAUD"}]
["Match 2",null,null,{"$f":"B5","v":"MASINA"},{"$f":"B6","v":"SAINTE BEUVE"}]
["Finale vainqueur Match 1 contre vainqueur Match 2",null,null,{"$f":"IF(F10=\"\",\"\",F10)","v":""},{"$f":"IF(F11=\"\",\"\",F11)","v":""}]
["Petite finale entre les deux perdants des matchs 1 et 2",null,null,{"$f":"IF(D12=\"\",\"\",IF(D12=D10,E10,D10))","v":""},{"$f":"IF(E12=\"\",\"\",IF(E12=D11,E11,D11))","v":""}]
["Si poule de 3 joueurs alors…"]
["Déroulement",null,null,"Joueurs A contre Joueur B",null,"Vainqueur","Score"]
{"$rows_left_out":10}
{"sheet":"Poule 3","index":4,"n_rows":24,"n_cols":7,"rows_kept":24,"cut":false,"hidden":false,"merged":[[23,0,23,1],[23,2,23,3],[23,4,23,5],[21,0,21,1],[21,2,21,3],[21,4,21,5],[22,0,22,1],[22,2,22,3],[22,4,22,5],[19,0,19,1],[19,2,19,3],[19,4,19,5],[13,0,13,6],[14,3,14,4],[15,0,15,2],[16,0,16,2],[17,0,17,2],[20,0,20,1],[20,2,20,3],[20,4,20,5],[0,0,0,6],[1,0,1,2],[1,3,1,6],[7,0,7,6],[8,0,8,2],[8,3,8,4],[9,0,9,2],[10,0,10,2],[11,0,11,2],[12,0,12,2],[14,0,14,2],[18,0,18,3],[18,4,18,6]]}
["               BADMINTON "]
["POULE 3",null,null,"TERRAIN N°"]
[null,"NOM","Prénom","Sigle","Vict","Def","Classement"]
[3,{"$f":"VLOOKUP($A4,Engagés!$A$1:$F$52,3,FALSE)","v":"DE PERIGNON"},{"$f":"VLOOKUP($A4,Engagés!$A$1:$F$52,4,FALSE)","v":"JULIETTE"},{"$f":"VLOOKUP($A4,Engagés!$A$1:$F$52,5,FALSE)","v":"75-4-LRPA"},null,null,"2ème"]
[6,{"$f":"VLOOKUP($A5,Engagés!$A$1:$F$52,3,FALSE)","v":"PIC"},{"$f":"VLOOKUP($A5,Engagés!$A$1:$F$52,4,FALSE)","v":"JOSEPHINE"},{"$f":"VLOOKUP($A5,Engagés!$A$1:$F$52,5,FALSE)","v":"75-4-SMPP"},null,null,"3ème"]
[11,{"$f":"VLOOKUP($A6,Engagés!$A$1:$F$52,3,FALSE)","v":"BRESOLIN"},{"$f":"VLOOKUP($A6,Engagés!$A$1:$F$52,4,FALSE)","v":"ALIX"},{"$f":"VLOOKUP($A6,Engagés!$A$1:$F$52,5,FALSE)","v":"75-4-ELIP"},null,null,"1er"]
[14,{"$f":"VLOOKUP($A7,Engagés!$A$1:$F$52,3,FALSE)","v":"REENAERS"},{"$f":"VLOOKUP($A7,Engagés!$A$1:$F$52,4,FALSE)","v":"LINDSAY"},{"$f":"VLOOKUP($A7,Engagés!$A$1:$F$52,5,FALSE)","v":"94-4-SMSM"},null,null,"4ème"]
["Si poule de 4 joueurs alors…"]
["Déroulement",null,null,"Joueurs A contre Joueur B",null,"Vainqueur","Score"]
["Match 1",null,null,{"$f":"B4","v":"DE PERIGNON"},{"$f":"B7","v":"REENAERS"}]
["Match 2",null,null,{"$f":"B5","v":"PIC"},{"$f":"B6","v":"BRESOLIN"}]
["Finale vainqueur Match 1 contre vainqueur Match 2",null,null,{"$f":"IF(F10=\"\",\"\",F10)","v":""},{"$f":"IF(F11=\"\",\"\",F11)","v":""}]
["Petite finale entre les deux perdants des matchs 1 et 2",null,null,{"$f":"IF(D12=\"\",\"\",IF(D12=D10,E10,D10))","v":""},{"$f":"IF(E12=\"\",\"\",IF(E12=D11,E11,D11))","v":""}]
["Si poule de 3 joueurs alors…"]
["Déroulement",null,null,"Joueurs A contre Joueur B",null,"Vainqueur","Score"]
{"$rows_left_out":10}
{"sheet":"Poule 4","index":5,"n_rows":24,"n_cols":7,"rows_kept":24,"cut":false,"hidden":false,"merged":[[23,0,23,1],[23,2,23,3],[23,4,23,5],[21,0,21,1],[21,2,21,3],[21,4,21,5],[22,0,22,1],[22,2,22,3],[22,4,22,5],[19,0,19,1],[19,2,19,3],[19,4,19,5],[13,0,13,6],[14,3,14,4],[15,0,15,2],[16,0,16,2],[17,0,17,2],[20,0,20,1],[20,2,20,3],[20,4,20,5],[0,0,0,6],[1,0,1,2],[1,3,1,6],[7,0,7,6],[8,0,8,2],[8,3,8,4],[9,0,9,2],[10,0,10,2],[11,0,11,2],[12,0,12,2],[14,0,14,2],[18,0,18,3],[18,4,18,6]]}
["               BADMINTON "]
["POULE 4",null,null,"TERRAIN N°"]
[null,"NOM","Prénom","Sigle","Vict","Def","Classement"]
[4,{"$f":"VLOOKUP($A4,Engagés!$A$1:$F$52,3,FALSE)","v":"VAGIC"},{"$f":"VLOOKUP($A4,Engagés!$A$1:$F$52,4,FALSE)","v":"LUCIE"},{"$f":"VLOOKUP($A4,Engagés!$A$1:$F$52,5,FALSE)","v":"75-4-SMPP"},null,null,"1er"]
[5,{"$f":"VLOOKUP($A5,Engagés!$A$1:$F$52,3,FALSE)","v":"DATH"},{"$f":"VLOOKUP($A5,Engagés!$A$1:$F$52,4,FALSE)","v":"AUBE"},{"$f":"VLOOKUP($A5,Engagés!$A$1:$F$52,5,FALSE)","v":"75-4-ELIP"},null,null,"2ème"]
[12,{"$f":"VLOOKUP($A6,Engagés!$A$1:$F$52,3,FALSE)","v":"FRANCESCHINA"},{"$f":"VLOOKUP($A6,Engagés!$A$1:$F$52,4,FALSE)","v":"EMMA"},{"$f":"VLOOKUP($A6,Engagés!$A$1:$F$52,5,FALSE)","v":"75-4-STAP"},null,null,"3ème"]
[13,{"$f":"VLOOKUP($A7,Engagés!$A$1:$F$52,3,FALSE)","v":"GODET"},{"$f":"VLOOKUP($A7,Engagés!$A$1:$F$52,4,FALSE)","v":"LOUISE"},{"$f":"VLOOKUP($A7,Engagés!$A$1:$F$52,5,FALSE)","v":"75-4-LRPA"},null,null,"4ème"]
["Si poule de 4 joueurs alors…"]
["Déroulement",null,null,"Joueurs A contre Joueur B",null,"Vainqueur","Score"]
["Match 1",null,null,{"$f":"B4","v":"VAGIC"},{"$f":"B7","v":"GODET"}]
["Match 2",null,null,{"$f":"B5","v":"DATH"},{"$f":"B6","v":"FRANCESCHINA"}]
["Finale vainqueur Match 1 contre vainqueur Match 2",null,null,{"$f":"IF(F10=\"\",\"\",F10)","v":""},{"$f":"IF(F11=\"\",\"\",F11)","v":""}]
["Petite finale entre les deux perdants des matchs 1 et 2",null,null,{"$f":"IF(D12=\"\",\"\",IF(D12=D10,E10,D10))","v":""},{"$f":"IF(E12=\"\",\"\",IF(E12=D11,E11,D11))","v":""}]
["Si poule de 3 joueurs alors…"]
["Déroulement",null,null,"Joueurs A contre Joueur B",null,"Vainqueur","Score"]
{"$rows_left_out":10}
{"sheet":"Résultats de poule","index":6,"n_rows":5,"n_cols":16,"rows_kept":5,"cut":false,"hidden":false,"merged":[[0,0,0,3],[0,4,0,7],[0,8,0,11],[0,12,0,15]]}
["Poule 1",null,null,null,"Poule 2",null,null,null,"Poule 3",null,null,null,"Poule 4"]
["1er",{"$f":"'Poule 1'!$C21","v":"LHUERRE"},{"$f":"'Poule 1'!$E21","v":"TESS"},{"$f":"'Poule 1'!$G21","v":"75-4-LRPA"},"1er",{"$f":"'Poule 2'!$C21","v":"TAILLARDAT"},{"$f":"'Poule 2'!$E21","v":"LOANNE"},{"$f":"'Poule 2'!$G21","v":"75-4-LRPA"},"1er",{"$f":"'Poule 3'!$C21","v":"BRESOLIN"},{"$f":"'Poule 3'!$E21","v":"ALIX"},{"$f":"'Poule 3'!$G21","v":"75-4-ELIP"},"1er",{"$f":"'Poule 4'!$C21","v":"VAGIC"},{"$f":"'Poule 4'!$E21","v":"LUCIE"},{"$f":"'Poule 4'!$G21","v":"75-4-SMPP"}]
["2ème",{"$f":"'Poule 1'!$C22","v":"VINCENT"},{"$f":"'Poule 1'!$E22","v":"MARION"},{"$f":"'Poule 1'!$G22","v":"94-4-SMSM"},"2ème",{"$f":"'Poule 2'!$C22","v":"RICHAUD"},{"$f":"'Poule 2'!$E22","v":"VICTOIRE"},{"$f":"'Poule 2'!$G22","v":"75-4-STAP"},"2ème",{"$f":"'Poule 3'!$C22","v":"DE PERIGNON"},{"$f":"'Poule 3'!$E22","v":"JULIETTE"},{"$f":"'Poule 3'!$G22","v":"75-4-LRPA"},"2ème",{"$f":"'Poule 4'!$C22","v":"DATH"},{"$f":"'Poule 4'!$E22","v":"AUBE"},{"$f":"'Poule 4'!$G22","v":"75-4-ELIP"}]
["3ème",{"$f":"'Poule 1'!$C23","v":"BELLIN"},{"$f":"'Poule 1'!$E23","v":"CLEMENCE"},{"$f":"'Poule 1'!$G23","v":"75-4-LRPA"},"3ème",{"$f":"'Poule 2'!$C23","v":"MASINA"},{"$f":"'Poule 2'!$E23","v":"ELEA"},{"$f":"'Poule 2'!$G23","v":"94-4-SMSM"},"3ème",{"$f":"'Poule 3'!$C23","v":"PIC"},{"$f":"'Poule 3'!$E23","v":"JOSEPHINE"},{"$f":"'Poule 3'!$G23","v":"75-4-SMPP"},"3ème",{"$f":"'Poule 4'!$C23","v":"FRANCESCHINA"},{"$f":"'Poule 4'!$E23","v":"EMMA"},{"$f":"'Poule 4'!$G23","v":"75-4-STAP"}]
["4ème",{"$f":"'Poule 1'!$C24","v":""},{"$f":"'Poule 1'!$E24","v":""},{"$f":"'Poule 1'!$G24","v":""},"4ème",{"$f":"'Poule 2'!$C24","v":"SAINTE BEUVE"},{"$f":"'Poule 2'!$E24","v":"PAULINE"},{"$f":"'Poule 2'!$G24","v":"75-4-LRPA"},"4ème",{"$f":"'Poule 3'!$C24","v":"REENAERS"},{"$f":"'Poule 3'!$E24","v":"LINDSAY"},{"$f":"'Poule 3'!$G24","v":"94-4-SMSM"},"4ème",{"$f":"'Poule 4'!$C24","v":"GODET"},{"$f":"'Poule 4'!$E24","v":"LOUISE"},{"$f":"'Poule 4'!$G24","v":"75-4-LRPA"}]

{"sheet":"Tableau","index":7,"n_rows":57,"n_cols":33,"rows_kept":57,"cut":false,"hidden":false,"merged":[[29,6,29,7],[1,6,1,7],[25,22,25,23],[30,28,30,29],[39,0,47,8],[23,25,23,26],[16,28,16,29],[16,12,16,13],[23,12,23,13],[18,22,18,23],[0,18,0,21],[0,22,0,32],[15,31,15,32],[0,0,0,16],[9,25,9,26],[12,3,12,4],[8,12,8,13],[1,12,1,13],[10,22,10,23],[3,22,3,23]]}
["Tableaux des perdants et matchs de repêchage",null,null,null,null,null,null,null,null,null,null,null,null,null,null,null,null,null,"1er tour de tableau",null,null,null,"Tableau des gagnants"]
[null,null,null,null,null,null,null,null,null,null,null,null,"Perdant 1/4 de finale 4"]
[null,null,null,null,null,null,null,null,null,null,null,"V",{"$f":"IF(Y27=\"\",\"\",IF(Y27=\"p\",X27,X29))","v":"75-4-LRPA"},{"$f":"IF(Y27=\"\",\"\",IF(Y27=\"p\",W27,W29))","v":"TAILLARDAT"}]
[null,null,null,null,null,null,null,null,null,null,null,null,null,null,null,null,null,null,"1er poule 1",{"$f":"'Résultats de poule'!B2","v":"LHUERRE"},{"$f":"'Résultats de poule'!D2","v":"75-4-LRPA"},"V","1/4 de finale 1"]
[null,null,null,null,null,null,null,null,"V",{"$f":"IF(L3=\"\",\"\",IF(L3=\"v\",M3,M6))","v":"75-4-LRPA"},{"$f":"IF(L3=\"\",\"\",IF(L3=\"v\",N3,N6))","v":"TAILLARDAT"},null,null,null,"P",{"$f":"IF(V4=\"\",\"\",IF(V4=\"p\",U4,U5))","v":"75-4-LRPA"},{"$f":"IF(V4=\"\",\"\",IF(V4=\"p\",T4,T5))","v":"GODET"},null,"4ème poule 4",{"$f":"'Résultats de poule'!N5","v":"GODET"},{"$f":"'Résultats de poule'!P5","v":"75-4-LRPA"},"P",{"$f":"IF(V4=\"\",\"\",IF(V4=\"v\",T4,T5))","v":"LHUERRE"},{"$f":"IF(V4=\"\",\"\",IF(V4=\"v\",U4,U5))","v":"75-4-LRPA"},"V"]
[null,null,null,null,null,null,null,null,null,null,null,"P",{"$f":"IF(O5=\"\",\"\",IF(O5=\"v\",P5,P7))","v":"94-4-SMSM"},{"$f":"IF(O5=\"\",\"\",IF(O5=\"v\",Q5,Q7))","v":"MASINA"},null,null,null,null,null,null,null,null,null,null,null,{"$f":"IF(Y5=\"\",\"\",IF(Y5=\"v\",W5,W7))","v":"LHUERRE"},{"$f":"IF(Y5=\"\",\"\",IF(Y5=\"v\",X5,X7))","v":"75-4-LRPA"},"V"]
[null,null,null,null,null,null,null,null,null,null,null,null,null,null,"V",{"$f":"IF(V7=\"\",\"\",IF(V7=\"p\",U7,U8))","v":"94-4-SMSM"},{"$f":"IF(V7=\"\",\"\",IF(V7=\"p\",T7,T8))","v":"MASINA"},null,"3ème poule 2",{"$f":"'Résultats de poule'!F4","v":"MASINA"},{"$f":"'Résultats de poule'!H4","v":"94-4-SMSM"},"P",{"$f":"IF(V7=\"\",\"\",IF(V7=\"v\",T7,T8))","v":"DE PERIGNON"},{"$f":"IF(V7=\"\",\"\",IF(V7=\"v\",U7,U8))","v":"75-4-LRPA"},"P"]
[null,null,null,null,null,"V",{"$f":"IF(I5=\"\",\"\",IF(I5=\"v\",J5,J12))","v":"75-4-LRPA"},{"$f":"IF(I5=\"\",\"\",IF(I5=\"v\",K5,K12))","v":"TAILLARDAT"},null,null,null,null,null,null,null,null,null,null,"2ème poule 3",{"$f":"'Résultats de poule'!J3","v":"DE PERIGNON"},{"$f":"'Résultats de poule'!L3","v":"75-4-LRPA"},"V"]
[null,null,null,null,null,null,null,null,null,null,null,null,"Perdant 1/4 de finale 3"]
[null,null,null,null,null,null,null,null,null,null,null,"V",{"$f":"IF(Y20=\"\",\"\",IF(Y20=\"p\",X20,X22))","v":"75-4-ELIP"},{"$f":"IF(Y20=\"\",\"\",IF(Y20=\"p\",W20,W22))","v":"BRESOLIN"},null,null,null,null,null,null,null,null,null,null,null,"1/2 finale A",null,null,{"$f":"IF(AB6=\"\",\"\",IF(AB6=\"v\",Z6,Z13))","v":"LHUERRE"},{"$f":"IF(AB6=\"\",\"\",IF(AB6=\"v\",AA6,AA13))","v":"75-4-LRPA"},"V"]
[null,null,null,null,null,null,null,null,null,null,null,null,null,null,null,null,null,null,"2ème poule 2",{"$f":"'Résultats de poule'!F3","v":"RICHAUD"},{"$f":"'Résultats de poule'!H3","v":"75-4-STAP"},"V","1/4 de finale 2"]
[null,null,null,null,null,null,null,null,"P",{"$f":"IF(L10=\"\",\"\",IF(L10=\"v\",M10,M13))","v":"75-4-ELIP"},{"$f":"IF(L10=\"\",\"\",IF(L10=\"v\",N10,N13))","v":"BRESOLIN"},null,null,null,"V",{"$f":"IF(V11=\"\",\"\",IF(V11=\"p\",U11,U12))","v":"75-4-SMPP"},{"$f":"IF(V11=\"\",\"\",IF(V11=\"p\",T11,T12))","v":"PIC"},null,"3ème poule 3",{"$f":"'Résultats de poule'!J4","v":"PIC"},{"$f":"'Résultats de poule'!L4","v":"75-4-SMPP"},"P",{"$f":"IF(V11=\"\",\"\",IF(V11=\"v\",T11,T12))","v":"RICHAUD"},{"$f":"IF(V11=\"\",\"\",IF(V11=\"v\",U11,U12))","v":"75-4-STAP"},"P"]
[null,null,null,null,null,null,null,null,null,null,null,"P",{"$f":"IF(O12=\"\",\"\",IF(O12=\"v\",P12,P14))","v":"75-4-SMPP"},{"$f":"IF(O12=\"\",\"\",IF(O12=\"v\",Q12,Q14))","v":"PIC"},null,null,null,null,null,null,null,null,null,null,null,{"$f":"IF(Y12=\"\",\"\",IF(Y12=\"v\",W12,W14))","v":"VAGIC"},{"$f":"IF(Y12=\"\",\"\",IF(Y12=\"v\",X12,X14))","v":"75-4-SMPP"},"P"]
[null,null,null,"5ème",null,null,null,null,null,null,null,null,null,null,"P",{"$f":"IF(V14=\"\",\"\",IF(V14=\"p\",U14,U15))","v":""},{"$f":"IF(V14=\"\",\"\",IF(V14=\"p\",T14,T15))","v":""},null,"4ème poule 1",{"$f":"'Résultats de poule'!B5","v":""},{"$f":"'Résultats de poule'!D5","v":""},"P",{"$f":"IF(V14=\"\",\"\",IF(V14=\"v\",T14,T15))","v":"VAGIC"},{"$f":"IF(V14=\"\",\"\",IF(V14=\"v\",U14,U15))","v":"75-4-SMPP"},"V"]
[null,null,null,{"$f":"IF(F8=\"\",\"\",IF(F8=\"v\",G8,G22))","v":"75-4-LRPA"},{"$f":"IF(F8=\"\",\"\",IF(F8=\"v\",H8,H22))","v":"TAILLARDAT"},null,null,null,null,null,null,null,null,null,null,null,null,null,"1er poule 4",{"$f":"'Résultats de poule'!N2","v":"VAGIC"},{"$f":"'Résultats de poule'!P2","v":"75-4-SMPP"},"V"]
{"$rows_left_out":43}
{"sheet":"Classement","index":8,"n_rows":19,"n_cols":3,"rows_kept":19,"cut":false,"hidden":false,"merged":[[0,0,0,2],[1,0,1,2]]}
[{"$f":"IF(Engagés!A1=\"\",\"\",Engagés!A1)","v":"Championnat du Comité de Paris et EST Francilien"}]
[{"$f":"IF(Engagés!E3=\"\",\"\",Engagés!E3)","v":"CF"}]
["Classement","NOM","Etablissement"]
["1er",{"$f":"Tableau!AF17","v":"LHUERRE"},{"$f":"Tableau!AG17","v":"75-4-LRPA"}]
["2ème",{"$f":"IF(Tableau!$AE$10=\"\",\"\",IF(Tableau!$AE$10=\"p\",Tableau!$AC$10,Tableau!$AC$24))","v":"VINCENT"},{"$f":"IF(Tableau!$AE$10=\"\",\"\",IF(Tableau!$AE$10=\"p\",Tableau!$AD$10,Tableau!$AD$24))","v":"94-4-SMSM"}]
["3ème",{"$f":"Tableau!AF31","v":"BELLIN"},{"$f":"Tableau!AG31","v":"94-4-SMSM"}]
["4ème",{"$f":"IF(Tableau!AE30=\"\",\"\",IF(Tableau!$AE$30=\"p\",Tableau!$AC$30,Tableau!$AC$32))","v":"VAGIC"},{"$f":"IF(Tableau!AE30=\"\",\"\",IF(Tableau!$AE$30=\"p\",Tableau!$AD$30,Tableau!$AD$32))","v":"75-4-SMPP"}]
["5ème",{"$f":"Tableau!E15","v":"TAILLARDAT"},{"$f":"Tableau!D15","v":"75-4-LRPA"}]
["6ème",{"$f":"IF(Tableau!F8=\"\",\"\",IF(Tableau!$F$8=\"p\",Tableau!$H$8,Tableau!$H$22))","v":"DE PERIGNON"},{"$f":"IF(Tableau!F8=\"\",\"\",IF(Tableau!$F$8=\"p\",Tableau!$G$8,Tableau!$G$22))","v":"75-4-LRPA"}]
["7ème",{"$f":"Tableau!B29","v":"BRESOLIN"},{"$f":"Tableau!A29","v":"75-4-STAP"}]
["8ème",{"$f":"IF(Tableau!C27=\"\",\"\",IF(Tableau!$C$27=\"p\",Tableau!$E$27,Tableau!$E$31))","v":"RICHAUD"},{"$f":"IF(Tableau!C27=\"\",\"\",IF(Tableau!$C$27=\"p\",Tableau!$D$27,Tableau!$D$31))","v":"75-4-STAP"}]
["9ème",{"$f":"Tableau!K50","v":""},{"$f":"Tableau!J50","v":""}]
["10ème",{"$f":"IF(Tableau!L48=\"\",\"\",IF(Tableau!$L$48=\"p\",Tableau!$N$48,Tableau!$N$52))","v":""},{"$f":"IF(Tableau!L48=\"\",\"\",IF(Tableau!$L$48=\"p\",Tableau!$M$48,Tableau!$M$52))","v":""}]
["11ème",{"$f":"Tableau!N56","v":""},{"$f":"Tableau!M56","v":""}]
["12ème",{"$f":"IF(Tableau!O55=\"\",\"\",IF(Tableau!$O$55=\"p\",Tableau!$Q$55,Tableau!$Q$57))","v":""},{"$f":"IF(Tableau!O55=\"\",\"\",IF(Tableau!$O$55=\"p\",Tableau!$P$55,Tableau!$P$57))","v":""}]
{"$rows_left_out":4}