{"text_format":"1","workbook":"xlsx","n_sheets":9,"sheets":["Engagés","Répartition des joueurs","Poule 1","Poule 2","Poule 3","Poule 4","Résultats de poule","Tableau","Classement"],"not_rendered":{"charts":0,"images":37,"macros":1,"external_links":0,"defined_names":2,"comments":0,"pivot_tables":0},"unopened":[],"bounds":{"document_bytes":16777216,"sheet_cells":100000,"rows_first":2000,"rows_last":500,"rows_between":2000,"halvings":0,"cell_chars":16384,"cell_head_chars":4096},"cells_cut":0,"cells_raw":0,"read":"whole","date_system":"1900"}

{"sheet":"Engagés","index":0,"n_rows":21,"n_cols":6,"rows_kept":21,"cut":false,"hidden":false,"merged":[[0,0,2,2],[0,4,0,5],[1,4,1,5],[2,4,2,5]]}
["Championnat du Comité de Paris et EST Francilien",null,null,"DATE :","2023-11-29"]
[null,null,null,"LIEU :","LR"]
[null,null,null,"CATEGORIE :","CF"]
["Tête de série","ETABLISSEMENT","NOM","PRENOM","SIGLE","Cls"]
[]
[1,null,"LHUERRE","TESS","75-4-LRPA"]
[2,null,"TAILLARDAT","LOANNE","75-4-LRPA"]
[3,null,"DE PERIGNON","JULIETTE","75-4-LRPA"]
[4,null,"VAGIC","LUCIE","75-4-SMPP"]
[5,null,"DATH","AUBE","75-4-ELIP"]
[6,null,"PIC","JOSEPHINE","75-4-SMPP"]
[7,null,"MASINA","ELEA","94-4-SMSM"]
[8,null,"VINCENT","MARION","94-4-SMSM"]
[9,null,"BELLIN","CLEMENCE","75-4-LRPA"]
[10,null,"SAINTE BEUVE","PAULINE","75-4-LRPA"]
[12,null,"FRANCESCHINA","EMMA","75-4-STAP"]
[11,null,"BRESOLIN","ALIX","75-4-ELIP"]
[13,null,"GODET","LOUISE","75-4-LRPA"]
[15,null,"RICHAUD","VICTOIRE","75-4-STAP"]
[14,null,"REENAERS","LINDSAY","94-4-SMSM"]
[16]

{"sheet":"Répartition des joueurs","index":1,"n_rows":5,"n_cols":16,"rows_kept":5,"cut":false,"hidden":false,"merged":[[0,0,0,3],[0,4,0,7],[0,8,0,11],[0,12,0,15]]}
["Poule 1",null,null,null,"Poule 2",null,null,null,"Poule 3",null,null,null,"Poule 4"]
[1,{"$f":"VLOOKUP($A2,Engagés!$A$1:$E$368,3,FALSE)","v":"LHUERRE"},{"$f":"VLOOKUP($A2,Engagés!$A$1:$E$368,4,FALSE)","v":"TESS"},{"$f":"VLOOKUP($A2,Engagés!$A$1:$E$368,5,FALSE)","v":"75-4-LRPA"},2,{"$f":"VLOOKUP($E2,Engagés!$A$1:$E$368,3,FALSE)","v":"TAILLARDAT"},{"$f":"VLOOKUP($E2,Engagés!$A$1:$E$368,4,FALSE)","v":"LOANNE"},{"$f":"VLOOKUP($E2,Engagés!$A$1:$E$368,5,FALSE)","v":"75-4-LRPA"},3,{"$f":"VLOOKUP($I2,Engagés!$A$1:$E$368,3,FALSE)","v":"DE PERIGNON"},{"$f":"VLOOKUP($I2,Engagés!$A$1:$E$368,4,FALSE)","v":"JULIETTE"},{"$f":"VLOOKUP($I2,Engagés!$A$1:$E$368,5,FALSE)","v":"75-4-LRPA"},4,{"$f":"VLOOKUP($M2,Engagés!$A$1:$E$368,3,FALSE)","v":"VAGIC"},{"$f":"VLOOKUP($M2,Engagés!$A$1:$E$368,4,FALSE)","v":"LUCIE"},{"$f":"VLOOKUP($M2,Engagés!$A$1:$E$368,5,FALSE)","v":"75-4-SMPP"}]
[8,{"$f":"VLOOKUP($A3,Engagés!$A$1:$E$368,3,FALSE)","v":"VINCENT"},{"$f":"VLOOKUP($A3,Engagés!$A$1:$E$368,4,FALSE)","v":"MARION"},{"$f":"VLOOKUP($A3,Engagés!$A$1:$E$368,5,FALSE)","v":"94-4-SMSM"},7,{"$f":"VLOOKUP($E3,Engagés!$A$1:$E$368,3,FALSE)","v":"MASINA"},{"$f":"VLOOKUP($E3,Engagés!$A$1:$E$368,4,FALSE)","v":"ELEA"},{"$f":"VLOOKUP($E3,Engagés!$A$1:$E$368,5,FALSE)","v":"94-4-SMSM"},6,{"$f":"VLOOKUP($I3,Engagés!$A$1:$E$368,3,FALSE)","v":"PIC"},{"$f":"VLOOKUP($I3,Engagés!$A$1:$E$368,4,FALSE)","v":"JOSEPHINE"},{"$f":"VLOOKUP($I3,Engagés!$A$1:$E$368,5,FALSE)","v":"75-4-SMPP"},5,{"$f":"VLOOKUP($M3,Engagés!$A$1:$E$368,3,FALSE)","v":"DATH"},{"$f":"VLOOKUP($M3,Engagés!$A$1:$E$368,4,FALSE)","v":"AUBE"},{"$f":"VLOOKUP($M3,Engagés!$A$1:$E$368,5,FALSE)","v":"75-4-ELIP"}]
[9,{"$f":"VLOOKUP($A4,Engagés!$A$1:$E$368,3,FALSE)","v":"BELLIN"},{"$f":"VLOOKUP($A4,Engagés!$A$1:$E$368,4,FALSE)","v":"CLEMENCE"},{"$f":"VLOOKUP($A4,Engagés!$A$1:$E$368,5,FALSE)","v":"75-4-LRPA"},10,{"$f":"VLOOKUP($E4,Engagés!$A$1:$E$368,3,FALSE)","v":"SAINTE BEUVE"},{"$f":"VLOOKUP($E4,Engagés!$A$1:$E$368,4,FALSE)","v":"PAULINE"},{"$f":"VLOOKUP($E4,Engagés!$A$1:$E$368,5,FALSE)","v":"75-4-LRPA"},11,{"$f":"VLOOKUP($I4,Engagés!$A$1:$E$368,3,FALSE)","v":"BRESOLIN"},{"$f":"VLOOKUP($I4,Engagés!$A$1:$E$368,4,FALSE)","v":"ALIX"},{"$f":"VLOOKUP($I4,Engagés!$A$1:$E$368,5,FALSE)","v":"75-4-ELIP"},12,{"$f":"VLOOKUP($M4,Engagés!$A$1:$E$368,3,FALSE)","v":"FRANCESCHINA"},{"$f":"VLOOKUP($M4,Engagés!$A$1:$E$368,4,FALSE)","v":"EMMA"},{"$f":"VLOOKUP($M4,Engagés!$A$1:$E$368,5,FALSE)","v":"75-4-STAP"}]
[16,{"$f":"VLOOKUP($A5,Engagés!$A$1:$E$368,3,FALSE)","v":0},{"$f":"VLOOKUP($A5,Engagés!$A$1:$E$368,4,FALSE)","v":0},{"$f":"VLOOKUP($A5,Engagés!$A$1:$E$368,5,FALSE)","v":0},15,{"$f":"VLOOKUP($E5,Engagés!$A$1:$E$368,3,FALSE)","v":"RICHAUD"},{"$f":"VLOOKUP($E5,Engagés!$A$1:$E$368,4,FALSE)","v":"VICTOIRE"},{"$f":"VLOOKUP($E5,Engagés!$A$1:$E$368,5,FALSE)","v":"75-4-STAP"},14,{"$f":"VLOOKUP($I5,Engagés!$A$1:$E$368,3,FALSE)","v":"REENAERS"},{"$f":"VLOOKUP($I5,Engagés!$A$1:$E$368,4,FALSE)","v":"LINDSAY"},{"$f":"VLOOKUP($I5,Engagés!$A$1:$E$368,5,FALSE)","v":"94-4-SMSM"},13,{"$f":"VLOOKUP($M5,Engagés!$A$1:$E$368,3,FALSE)","v":"GODET"},{"$f":"VLOOKUP($M5,Engagés!$A$1:$E$368,4,FALSE)","v":"LOUISE"},{"$f":"VLOOKUP($M5,Engagés!$A$1:$E$368,5,FALSE)","v":"75-4-LRPA"}]

{"sheet":"Poule 1","index":2,"n_rows":24,"n_cols":7,"rows_kept":24,"cut":false,"hidden":false,"merged":[[23,0,23,1],[23,2,23,3],[23,4,23,5],[21,0,21,1],[21,2,21,3],[21,4,21,5],[22,0,22,1],[22,2,22,3],[22,4,22,5],[20,4,20,5],[14,0,14,2],[19,0,19,1],[19,2,19,3],[19,4,19,5],[20,0,20,1],[20,2,20,3],[14,3,14,4],[15,0,15,2],[16,0,16,2],[17,0,17,2],[18,0,18,3],[18,4,18,6],[9,0,9,2],[10,0,10,2],[11,0,11,2],[12,0,12,2],[13,0,13,6],[0,0,0,6],[1,0,1,2],[1,3,1,6],[7,0,7,6],[8,0,8,2],[8,3,8,4]]}
["               BADMINTON "]
["POULE 1",null,null,"TERRAIN N°"]
[null,"NOM","Prénom","Sigle","Vict","Def","Classement"]
[1,{"$f":"VLOOKUP($A4,Engagés!$A$1:$F$52,3,FALSE)","v":"LHUERRE"},{"$f":"VLOOKUP($A4,Engagés!$A$1:$F$52,4,FALSE)","v":"TESS"},{"$f":"VLOOKUP($A4,Engagés!$A$1:$F$52,5,FALSE)","v":"75-4-LRPA"},null,null,"1er"]
[8,{"$f":"VLOOKUP($A5,Engagés!$A$1:$F$52,3,FALSE)","v":"VINCENT"},{"$f":"VLOOKUP($A5,Engagés!$A$1:$F$52,4,FALSE)","v":"MARION"},{"$f":"VLOOKUP($A5,Engagés!$A$1:$F$52,5,FALSE)","v":"94-4-SMSM"},null,null,"2ème"]
[9,{"$f":"VLOOKUP($A6,Engagés!$A$1:$F$52,3,FALSE)","v":"BELLIN"},{"$f":"VLOOKUP($A6,Engagés!$A$1:$F$52,4,FALSE)","v":"CLEMENCE"},{"$f":"VLOOKUP($A6,Engagés!$A$1:$F$52,5,FALSE)","v":"75-4-LRPA"},null,null,"3ème"]
[16,{"$f":"VLOOKUP($A7,Engagés!$A$1:$F$52,3,FALSE)","v":0},{"$f":"VLOOKUP($A7,Engagés!$A$1:$F$52,4,FALSE)","v":0},{"$f":"VLOOKUP($A7,Engagés!$A$1:$F$52,5,FALSE)","v":0}]
["Si poule de 4 joueurs alors…"]
["Déroulement",null,null,"Joueurs A contre Joueur B",null,"Vainqueur","Score"]
["Match 1",null,null,{"$f":"B4","v":"LHUERRE"},{"$f":"B7","v":0}]
["Match 2",null,null,{"$f":"B5","v":"VINCENT"},{"$f":"B6","v":"BELLIN"}]
["Finale vainqueur Match 1 contre vainqueur Match 2",null,null,{"$f":"IF(F10=\"\",\"\",F10)","v":""},{"$f":"IF(F11=\"\",\"\",F11)","v":""}]
["Petite finale entre les deux perdants des matchs 1 et 2",null,null,{"$f":"IF(D12=\"\",\"\",IF(D12=D10,E10,D10))","v":""},{"$f":"IF(E12=\"\",\"\",IF(E12=D11,E11,D11))","v":""}]
["Si poule de 3 joueurs alors…"]
["Déroulement",null,null,"Joueurs A contre Joueur B",null,"Vainqueur","Score"]
["Match 1",null,null,{"$f":"B4","v":"LHUERRE"},{"$f":"B6","v":"BELLIN"}]
["Match 2",null,null,{"$f":"B5","v":"VINCENT"},{"$f":"B6","v":"BELLIN"}]
["Match 3",null,null,{"$f":"B4","v":"LHUERRE"},{"$f":"B5","v":"VINCENT"}]
["CLASSEMENT",null,null,null,{"$f":"A2","v":"POULE 1"}]
[null,null,"NOM",null,"PRENOM",null,"SIGLE"]
["1er",null,{"$f":"IF($G$4=\"1er\", $B$4,IF($G$5=\"1er\",$B$5,IF($G$6=\"1er\",$B$6,IF($G$7=\"1er\",$B$7,\"\"))))","v":"LHUERRE"},null,{"$f":"IF($G$4=\"1er\", $C$4,IF($G$5=\"1er\",$C$5,IF($G$6=\"1er\",$C$6,IF($G$7=\"1er\",$C$7,\"\"))))","v":"TESS"},null,{"$f":"IF($G$4=\"1er\", $D$4,IF($G$5=\"1er\",$D$5,IF($G$6=\"1er\",$D$6,IF($G$7=\"1er\",$D$7,\"\"))))","v":"75-4-LRPA"}]
["2ème",null,{"$f":"IF($G$4=\"2ème\", $B$4,IF($G$5=\"2ème\",$B$5,IF($G$6=\"2ème\",$B$6,IF($G$7=\"2ème\",$B$7,\"\"))))","v":"VINCENT"},null,{"$f":"IF($G$4=\"2ème\", $C$4,IF($G$5=\"2ème\",$C$5,IF($G$6=\"2ème\",$C$6,IF($G$7=\"2ème\",$C$7,\"\"))))","v":"MARION"},null,{"$f":"IF($G$4=\"2ème\", $D$4,IF($G$5=\"2ème\",$D$5,IF($G$6=\"2ème\",$D$6,IF($G$7=\"2ème\",$D$7,\"\"))))","v":"94-4-SMSM"}]
["3ème",null,{"$f":"IF($G$4=\"3ème\", $B$4,IF($G$5=\"3ème\",$B$5,IF($G$6=\"3ème\",$B$6,IF($G$7=\"3ème\",$B$7,\"\"))))","v":"BELLIN"},null,{"$f":"IF($G$4=\"3ème\", $C$4,IF($G$5=\"3ème\",$C$5,IF($G$6=\"3ème\",$C$6,IF($G$7=\"3ème\",$C$7,\"\"))))","v":"CLEMENCE"},null,{"$f":"IF($G$4=\"3ème\", $D$4,IF($G$5=\"3ème\",$D$5,IF($G$6=\"3ème\",$D$6,IF($G$7=\"3ème\",$D$7,\"\"))))","v":"75-4-LRPA"}]
["4ème",null,{"$f":"IF($G$4=\"4ème\", $B$4,IF($G$5=\"4ème\",$B$5,IF($G$6=\"4ème\",$B$6,IF($G$7=\"4ème\",$B$7,\"\"))))","v":""},null,{"$f":"IF($G$4=\"4ème\", $C$4,IF($G$5=\"4ème\",$C$5,IF($G$6=\"4ème\",$C$6,IF($G$7=\"4ème\",$C$7,\"\"))))","v":""},null,{"$f":"IF($G$4=\"4ème\", $D$4,IF($G$5=\"4ème\",$D$5,IF($G$6=\"4ème\",$D$6,IF($G$7=\"4ème\",$D$7,\"\"))))","v":""}]

{"sheet":"Poule 2","index":3,"n_rows":24,"n_cols":7,"rows_kept":24,"cut":false,"hidden":false,"merged":[[23,0,23,1],[23,2,23,3],[23,4,23,5],[21,0,21,1],[21,2,21,3],[21,4,21,5],[22,0,22,1],[22,2,22,3],[22,4,22,5],[19,0,19,1],[19,2,19,3],[19,4,19,5],[13,0,13,6],[14,3,14,4],[15,0,15,2],[16,0,16,2],[17,0,17,2],[20,0,20,1],[20,2,20,3],[20,4,20,5],[0,0,0,6],[1,0,1,2],[1,3,1,6],[7,0,7,6],[8,0,8,2],[8,3,8,4],[9,0,9,2],[10,0,10,2],[11,0,11,2],[12,0,12,2],[14,0,14,2],[18,0,18,3],[18,4,18,6]]}
["               BADMINTON "]
["POULE 2",null,null,"TERRAIN N°"]
[null,"NOM","Prénom","Sigle","Vict","Def","Classement"]
[2,{"$f":"VLOOKUP($A4,Engagés!$A$1:$F$52,3,FALSE)","v":"TAILLARDAT"},{"$f":"VLOOKUP($A4,Engagés!$A$1:$F$52,4,FALSE)","v":"LOANNE"},{"$f":"VLOOKUP($A4,Engagés!$A$1:$F$52,5,FALSE)","v":"75-4-LRPA"},null,null,"1er"]
[7,{"$f":"VLOOKUP($A5,Engagés!$A$1:$F$52,3,FALSE)","v":"MASINA"},{"$f":"VLOOKUP($A5,Engagés!$A$1:$F$52,4,FALSE)","v":"ELEA"},{"$f":"VLOOKUP($A5,Engagés!$A$1:$F$52,5,FALSE)","v":"94-4-SMSM"},null,null,"3ème"]
[10,{"$f":"VLOOKUP($A6,Engagés!$A$1:$F$52,3,FALSE)","v":"SAINTE BEUVE"},{"$f":"VLOOKUP($A6,Engagés!$A$1:$F$52,4,FALSE)","v":"PAULINE"},{"$f":"VLOOKUP($A6,Engagés!$A$1:$F$52,5,FALSE)","v":"75-4-LRPA"},null,null,"4ème"]
[15,{"$f":"VLOOKUP($A7,Engagés!$A$1:$F$52,3,FALSE)","v":"RICHAUD"},{"$f":"VLOOKUP($A7,Engagés!$A$1:$F$52,4,FALSE)","v":"VICTOIRE"},{"$f":"VLOOKUP($A7,Engagés!$A$1:$F$52,5,FALSE)","v":"75-4-STAP"},null,null,"2ème"]
["Si poule de 4 joueurs alors…"]
["Déroulement",null,null,"Joueurs A contre Joueur B",null,"Vainqueur","Score"]
["Match 1",null,null,{"$f":"B4","v":"TAILLARDAT"},{"$f":"B7","v":"RICHAUD"}]
["Match 2",null,null,{"$f":"B5","v":"MASINA"},{"$f":"B6","v":"SAINTE BEUVE"}]
["Finale vainqueur Match 1 contre vainqueur Match 2",null,null,{"$f":"IF(F10=\"\",\"\",F10)","v":""},{"$f":"IF(F11=\"\",\"\",F11)","v":""}]
["Petite finale entre les deux perdants des matchs 1 et 2",null,null,{"$f":"IF(D12=\"\",\"\",IF(D12=D10,E10,D10))","v":""},{"$f":"IF(E12=\"\",\"\",IF(E12=D11,E11,D11))","v":""}]
["Si poule de 3 joueurs alors…"]
["Déroulement",null,null,"Joueurs A contre Joueur B",null,"Vainqueur","Score"]
["Match 1",null,null,{"$f":"B4","v":"TAILLARDAT"},{"$f":"B6","v":"SAINTE BEUVE"}]
["Match 2",null,null,{"$f":"B5","v":"MASINA"},{"$f":"B6","v":"SAINTE BEUVE"}]
["Match 3",null,null,{"$f":"B4","v":"TAILLARDAT"},{"$f":"B5","v":"MASINA"}]
["CLASSEMENT",null,null,null,{"$f":"A2","v":"POULE 2"}]
[null,null,"NOM",null,"PRENOM",null,"SIGLE"]
["1er",null,{"$f":"IF($G$4=\"1er\", $B$4,IF($G$5=\"1er\",$B$5,IF($G$6=\"1er\",$B$6,IF($G$7=\"1er\",$B$7,\"\"))))","v":"TAILLARDAT"},null,{"$f":"IF($G$4=\"1er\", $C$4,IF($G$5=\"1er\",$C$5,IF($G$6=\"1er\",$C$6,IF($G$7=\"1er\",$C$7,\"\"))))","v":"LOANNE"},null,{"$f":"IF($G$4=\"1er\", $D$4,IF($G$5=\"1er\",$D$5,IF($G$6=\"1er\",$D$6,IF($G$7=\"1er\",$D$7,\"\"))))","v":"75-4-LRPA"}]
["2ème",null,{"$f":"IF($G$4=\"2ème\", $B$4,IF($G$5=\"2ème\",$B$5,IF($G$6=\"2ème\",$B$6,IF($G$7=\"2ème\",$B$7,\"\"))))","v":"RICHAUD"},null,{"$f":"IF($G$4=\"2ème\", $C$4,IF($G$5=\"2ème\",$C$5,IF($G$6=\"2ème\",$C$6,IF($G$7=\"2ème\",$C$7,\"\"))))","v":"VICTOIRE"},null,{"$f":"IF($G$4=\"2ème\", $D$4,IF($G$5=\"2ème\",$D$5,IF($G$6=\"2ème\",$D$6,IF($G$7=\"2ème\",$D$7,\"\"))))","v":"75-4-STAP"}]
["3ème",null,{"$f":"IF($G$4=\"3ème\", $B$4,IF($G$5=\"3ème\",$B$5,IF($G$6=\"3ème\",$B$6,IF($G$7=\"3ème\",$B$7,\"\"))))","v":"MASINA"},null,{"$f":"IF($G$4=\"3ème\", $C$4,IF($G$5=\"3ème\",$C$5,IF($G$6=\"3ème\",$C$6,IF($G$7=\"3ème\",$C$7,\"\"))))","v":"ELEA"},null,{"$f":"IF($G$4=\"3ème\", $D$4,IF($G$5=\"3ème\",$D$5,IF($G$6=\"3ème\",$D$6,IF($G$7=\"3ème\",$D$7,\"\"))))","v":"94-4-SMSM"}]
["4ème",null,{"$f":"IF($G$4=\"4ème\", $B$4,IF($G$5=\"4ème\",$B$5,IF($G$6=\"4ème\",$B$6,IF($G$7=\"4ème\",$B$7,\"\"))))","v":"SAINTE BEUVE"},null,{"$f":"IF($G$4=\"4ème\", $C$4,IF($G$5=\"4ème\",$C$5,IF($G$6=\"4ème\",$C$6,IF($G$7=\"4ème\",$C$7,\"\"))))","v":"PAULINE"},null,{"$f":"IF($G$4=\"4ème\", $D$4,IF($G$5=\"4ème\",$D$5,IF($G$6=\"4ème\",$D$6,IF($G$7=\"4ème\",$D$7,\"\"))))","v":"75-4-LRPA"}]

{"sheet":"Poule 3","index":4,"n_rows":24,"n_cols":7,"rows_kept":24,"cut":false,"hidden":false,"merged":[[23,0,23,1],[23,2,23,3],[23,4,23,5],[21,0,21,1],[21,2,21,3],[21,4,21,5],[22,0,22,1],[22,2,22,3],[22,4,22,5],[19,0,19,1],[19,2,19,3],[19,4,19,5],[13,0,13,6],[14,3,14,4],[15,0,15,2],[16,0,16,2],[17,0,17,2],[20,0,20,1],[20,2,20,3],[20,4,20,5],[0,0,0,6],[1,0,1,2],[1,3,1,6],[7,0,7,6],[8,0,8,2],[8,3,8,4],[9,0,9,2],[10,0,10,2],[11,0,11,2],[12,0,12,2],[14,0,14,2],[18,0,18,3],[18,4,18,6]]}
["               BADMINTON "]
["POULE 3",null,null,"TERRAIN N°"]
[null,"NOM","Prénom","Sigle","Vict","Def","Classement"]
[3,{"$f":"VLOOKUP($A4,Engagés!$A$1:$F$52,3,FALSE)","v":"DE PERIGNON"},{"$f":"VLOOKUP($A4,Engagés!$A$1:$F$52,4,FALSE)","v":"JULIETTE"},{"$f":"VLOOKUP($A4,Engagés!$A$1:$F$52,5,FALSE)","v":"75-4-LRPA"},null,null,"2ème"]
[6,{"$f":"VLOOKUP($A5,Engagés!$A$1:$F$52,3,FALSE)","v":"PIC"},{"$f":"VLOOKUP($A5,Engagés!$A$1:$F$52,4,FALSE)","v":"JOSEPHINE"},{"$f":"VLOOKUP($A5,Engagés!$A$1:$F$52,5,FALSE)","v":"75-4-SMPP"},null,null,"3ème"]
[11,{"$f":"VLOOKUP($A6,Engagés!$A$1:$F$52,3,FALSE)","v":"BRESOLIN"},{"$f":"VLOOKUP($A6,Engagés!$A$1:$F$52,4,FALSE)","v":"ALIX"},{"$f":"VLOOKUP($A6,Engagés!$A$1:$F$52,5,FALSE)","v":"75-4-ELIP"},null,null,"1er"]
[14,{"$f":"VLOOKUP($A7,Engagés!$A$1:$F$52,3,FALSE)","v":"REENAERS"},{"$f":"VLOOKUP($A7,Engagés!$A$1:$F$52,4,FALSE)","v":"LINDSAY"},{"$f":"VLOOKUP($A7,Engagés!$A$1:$F$52,5,FALSE)","v":"94-4-SMSM"},null,null,"4ème"]
["Si poule de 4 joueurs alors…"]
["Déroulement",null,null,"Joueurs A contre Joueur B",null,"Vainqueur","Score"]
["Match 1",null,null,{"$f":"B4","v":"DE PERIGNON"},{"$f":"B7","v":"REENAERS"}]
["Match 2",null,null,{"$f":"B5","v":"PIC"},{"$f":"B6","v":"BRESOLIN"}]
["Finale vainqueur Match 1 contre vainqueur Match 2",null,null,{"$f":"IF(F10=\"\",\"\",F10)","v":""},{"$f":"IF(F11=\"\",\"\",F11)","v":""}]
["Petite finale entre les deux perdants des matchs 1 et 2",null,null,{"$f":"IF(D12=\"\",\"\",IF(D12=D10,E10,D10))","v":""},{"$f":"IF(E12=\"\",\"\",IF(E12=D11,E11,D11))","v":""}]
["Si poule de 3 joueurs alors…"]
["Déroulement",null,null,"Joueurs A contre Joueur B",null,"Vainqueur","Score"]
["Match 1",null,null,{"$f":"B4","v":"DE PERIGNON"},{"$f":"B6","v":"BRESOLIN"}]
["Match 2",null,null,{"$f":"B5","v":"PIC"},{"$f":"B6","v":"BRESOLIN"}]
["Match 3",null,null,{"$f":"B4","v":"DE PERIGNON"},{"$f":"B5","v":"PIC"}]
["CLASSEMENT",null,null,null,{"$f":"A2","v":"POULE 3"}]
[null,null,"NOM",null,"PRENOM",null,"SIGLE"]
["1er",null,{"$f":"IF($G$4=\"1er\", $B$4,IF($G$5=\"1er\",$B$5,IF($G$6=\"1er\",$B$6,IF($G$7=\"1er\",$B$7,\"\"))))","v":"BRESOLIN"},null,{"$f":"IF($G$4=\"1er\", $C$4,IF($G$5=\"1er\",$C$5,IF($G$6=\"1er\",$C$6,IF($G$7=\"1er\",$C$7,\"\"))))","v":"ALIX"},null,{"$f":"IF($G$4=\"1er\", $D$4,IF($G$5=\"1er\",$D$5,IF($G$6=\"1er\",$D$6,IF($G$7=\"1er\",$D$7,\"\"))))","v":"75-4-ELIP"}]
["2ème",null,{"$f":"IF($G$4=\"2ème\", $B$4,IF($G$5=\"2ème\",$B$5,IF($G$6=\"2ème\",$B$6,IF($G$7=\"2ème\",$B$7,\"\"))))","v":"DE PERIGNON"},null,{"$f":"IF($G$4=\"2ème\", $C$4,IF($G$5=\"2ème\",$C$5,IF($G$6=\"2ème\",$C$6,IF($G$7=\"2ème\",$C$7,\"\"))))","v":"JULIETTE"},null,{"$f":"IF($G$4=\"2ème\", $D$4,IF($G$5=\"2ème\",$D$5,IF($G$6=\"2ème\",$D$6,IF($G$7=\"2ème\",$D$7,\"\"))))","v":"75-4-LRPA"}]
["3ème",null,{"$f":"IF($G$4=\"3ème\", $B$4,IF($G$5=\"3ème\",$B$5,IF($G$6=\"3ème\",$B$6,IF($G$7=\"3ème\",$B$7,\"\"))))","v":"PIC"},null,{"$f":"IF($G$4=\"3ème\", $C$4,IF($G$5=\"3ème\",$C$5,IF($G$6=\"3ème\",$C$6,IF($G$7=\"3ème\",$C$7,\"\"))))","v":"JOSEPHINE"},null,{"$f":"IF($G$4=\"3ème\", $D$4,IF($G$5=\"3ème\",$D$5,IF($G$6=\"3ème\",$D$6,IF($G$7=\"3ème\",$D$7,\"\"))))","v":"75-4-SMPP"}]
["4ème",null,{"$f":"IF($G$4=\"4ème\", $B$4,IF($G$5=\"4ème\",$B$5,IF($G$6=\"4ème\",$B$6,IF($G$7=\"4ème\",$B$7,\"\"))))","v":"REENAERS"},null,{"$f":"IF($G$4=\"4ème\", $C$4,IF($G$5=\"4ème\",$C$5,IF($G$6=\"4ème\",$C$6,IF($G$7=\"4ème\",$C$7,\"\"))))","v":"LINDSAY"},null,{"$f":"IF($G$4=\"4ème\", $D$4,IF($G$5=\"4ème\",$D$5,IF($G$6=\"4ème\",$D$6,IF($G$7=\"4ème\",$D$7,\"\"))))","v":"94-4-SMSM"}]

{"sheet":"Poule 4","index":5,"n_rows":24,"n_cols":7,"rows_kept":24,"cut":false,"hidden":false,"merged":[[23,0,23,1],[23,2,23,3],[23,4,23,5],[21,0,21,1],[21,2,21,3],[21,4,21,5],[22,0,22,1],[22,2,22,3],[22,4,22,5],[19,0,19,1],[19,2,19,3],[19,4,19,5],[13,0,13,6],[14,3,14,4],[15,0,15,2],[16,0,16,2],[17,0,17,2],[20,0,20,1],[20,2,20,3],[20,4,20,5],[0,0,0,6],[1,0,1,2],[1,3,1,6],[7,0,7,6],[8,0,8,2],[8,3,8,4],[9,0,9,2],[10,0,10,2],[11,0,11,2],[12,0,12,2],[14,0,14,2],[18,0,18,3],[18,4,18,6]]}
["               BADMINTON "]
["POULE 4",null,null,"TERRAIN N°"]
[null,"NOM","Prénom","Sigle","Vict","Def","Classement"]
[4,{"$f":"VLOOKUP($A4,Engagés!$A$1:$F$52,3,FALSE)","v":"VAGIC"},{"$f":"VLOOKUP($A4,Engagés!$A$1:$F$52,4,FALSE)","v":"LUCIE"},{"$f":"VLOOKUP($A4,Engagés!$A$1:$F$52,5,FALSE)","v":"75-4-SMPP"},null,null,"1er"]
[5,{"$f":"VLOOKUP($A5,Engagés!$A$1:$F$52,3,FALSE)","v":"DATH"},{"$f":"VLOOKUP($A5,Engagés!$A$1:$F$52,4,FALSE)","v":"AUBE"},{"$f":"VLOOKUP($A5,Engagés!$A$1:$F$52,5,FALSE)","v":"75-4-ELIP"},null,null,"2ème"]
[12,{"$f":"VLOOKUP($A6,Engagés!$A$1:$F$52,3,FALSE)","v":"FRANCESCHINA"},{"$f":"VLOOKUP($A6,Engagés!$A$1:$F$52,4,FALSE)","v":"EMMA"},{"$f":"VLOOKUP($A6,Engagés!$A$1:$F$52,5,FALSE)","v":"75-4-STAP"},null,null,"3ème"]
[13,{"$f":"VLOOKUP($A7,Engagés!$A$1:$F$52,3,FALSE)","v":"GODET"},{"$f":"VLOOKUP($A7,Engagés!$A$1:$F$52,4,FALSE)","v":"LOUISE"},{"$f":"VLOOKUP($A7,Engagés!$A$1:$F$52,5,FALSE)","v":"75-4-LRPA"},null,null,"4ème"]
["Si poule de 4 joueurs alors…"]
["Déroulement",null,null,"Joueurs A contre Joueur B",null,"Vainqueur","Score"]
["Match 1",null,null,{"$f":"B4","v":"VAGIC"},{"$f":"B7","v":"GODET"}]
["Match 2",null,null,{"$f":"B5","v":"DATH"},{"$f":"B6","v":"FRANCESCHINA"}]
["Finale vainqueur Match 1 contre vainqueur Match 2",null,null,{"$f":"IF(F10=\"\",\"\",F10)","v":""},{"$f":"IF(F11=\"\",\"\",F11)","v":""}]
["Petite finale entre les deux perdants des matchs 1 et 2",null,null,{"$f":"IF(D12=\"\",\"\",IF(D12=D10,E10,D10))","v":""},{"$f":"IF(E12=\"\",\"\",IF(E12=D11,E11,D11))","v":""}]
["Si poule de 3 joueurs alors…"]
["Déroulement",null,null,"Joueurs A contre Joueur B",null,"Vainqueur","Score"]
["Match 1",null,null,{"$f":"B4","v":"VAGIC"},{"$f":"B6","v":"FRANCESCHINA"}]
["Match 2",null,null,{"$f":"B5","v":"DATH"},{"$f":"B6","v":"FRANCESCHINA"}]
["Match 3",null,null,{"$f":"B4","v":"VAGIC"},{"$f":"B5","v":"DATH"}]
["CLASSEMENT",null,null,null,{"$f":"A2","v":"POULE 4"}]
[null,null,"NOM",null,"PRENOM",null,"SIGLE"]
["1er",null,{"$f":"IF($G$4=\"1er\", $B$4,IF($G$5=\"1er\",$B$5,IF($G$6=\"1er\",$B$6,IF($G$7=\"1er\",$B$7,\"\"))))","v":"VAGIC"},null,{"$f":"IF($G$4=\"1er\", $C$4,IF($G$5=\"1er\",$C$5,IF($G$6=\"1er\",$C$6,IF($G$7=\"1er\",$C$7,\"\"))))","v":"LUCIE"},null,{"$f":"IF($G$4=\"1er\", $D$4,IF($G$5=\"1er\",$D$5,IF($G$6=\"1er\",$D$6,IF($G$7=\"1er\",$D$7,\"\"))))","v":"75-4-SMPP"}]
["2ème",null,{"$f":"IF($G$4=\"2ème\", $B$4,IF($G$5=\"2ème\",$B$5,IF($G$6=\"2ème\",$B$6,IF($G$7=\"2ème\",$B$7,\"\"))))","v":"DATH"},null,{"$f":"IF($G$4=\"2ème\", $C$4,IF($G$5=\"2ème\",$C$5,IF($G$6=\"2ème\",$C$6,IF($G$7=\"2ème\",$C$7,\"\"))))","v":"AUBE"},null,{"$f":"IF($G$4=\"2ème\", $D$4,IF($G$5=\"2ème\",$D$5,IF($G$6=\"2ème\",$D$6,IF($G$7=\"2ème\",$D$7,\"\"))))","v":"75-4-ELIP"}]
["3ème",null,{"$f":"IF($G$4=\"3ème\", $B$4,IF($G$5=\"3ème\",$B$5,IF($G$6=\"3ème\",$B$6,IF($G$7=\"3ème\",$B$7,\"\"))))","v":"FRANCESCHINA"},null,{"$f":"IF($G$4=\"3ème\", $C$4,IF($G$5=\"3ème\",$C$5,IF($G$6=\"3ème\",$C$6,IF($G$7=\"3ème\",$C$7,\"\"))))","v":"EMMA"},null,{"$f":"IF($G$4=\"3ème\", $D$4,IF($G$5=\"3ème\",$D$5,IF($G$6=\"3ème\",$D$6,IF($G$7=\"3ème\",$D$7,\"\"))))","v":"75-4-STAP"}]
["4ème",null,{"$f":"IF($G$4=\"4ème\", $B$4,IF($G$5=\"4ème\",$B$5,IF($G$6=\"4ème\",$B$6,IF($G$7=\"4ème\",$B$7,\"\"))))","v":"GODET"},null,{"$f":"IF($G$4=\"4ème\", $C$4,IF($G$5=\"4ème\",$C$5,IF($G$6=\"4ème\",$C$6,IF($G$7=\"4ème\",$C$7,\"\"))))","v":"LOUISE"},null,{"$f":"IF($G$4=\"4ème\", $D$4,IF($G$5=\"4ème\",$D$5,IF($G$6=\"4ème\",$D$6,IF($G$7=\"4ème\",$D$7,\"\"))))","v":"75-4-LRPA"}]

{"sheet":"Résultats de poule","index":6,"n_rows":5,"n_cols":16,"rows_kept":5,"cut":false,"hidden":false,"merged":[[0,0,0,3],[0,4,0,7],[0,8,0,11],[0,12,0,15]]}
["Poule 1",null,null,null,"Poule 2",null,null,null,"Poule 3",null,null,null,"Poule 4"]
["1er",{"$f":"'Poule 1'!$C21","v":"LHUERRE"},{"$f":"'Poule 1'!$E21","v":"TESS"},{"$f":"'Poule 1'!$G21","v":"75-4-LRPA"},"1er",{"$f":"'Poule 2'!$C21","v":"TAILLARDAT"},{"$f":"'Poule 2'!$E21","v":"LOANNE"},{"$f":"'Poule 2'!$G21","v":"75-4-LRPA"},"1er",{"$f":"'Poule 3'!$C21","v":"BRESOLIN"},{"$f":"'Poule 3'!$E21","v":"ALIX"},{"$f":"'Poule 3'!$G21","v":"75-4-ELIP"},"1er",{"$f":"'Poule 4'!$C21","v":"VAGIC"},{"$f":"'Poule 4'!$E21","v":"LUCIE"},{"$f":"'Poule 4'!$G21","v":"75-4-SMPP"}]
["2ème",{"$f":"'Poule 1'!$C22","v":"VINCENT"},{"$f":"'Poule 1'!$E22","v":"MARION"},{"$f":"'Poule 1'!$G22","v":"94-4-SMSM"},"2ème",{"$f":"'Poule 2'!$C22","v":"RICHAUD"},{"$f":"'Poule 2'!$E22","v":"VICTOIRE"},{"$f":"'Poule 2'!$G22","v":"75-4-STAP"},"2ème",{"$f":"'Poule 3'!$C22","v":"DE PERIGNON"},{"$f":"'Poule 3'!$E22","v":"JULIETTE"},{"$f":"'Poule 3'!$G22","v":"75-4-LRPA"},"2ème",{"$f":"'Poule 4'!$C22","v":"DATH"},{"$f":"'Poule 4'!$E22","v":"AUBE"},{"$f":"'Poule 4'!$G22","v":"75-4-ELIP"}]
["3ème",{"$f":"'Poule 1'!$C23","v":"BELLIN"},{"$f":"'Poule 1'!$E23","v":"CLEMENCE"},{"$f":"'Poule 1'!$G23","v":"75-4-LRPA"},"3ème",{"$f":"'Poule 2'!$C23","v":"MASINA"},{"$f":"'Poule 2'!$E23","v":"ELEA"},{"$f":"'Poule 2'!$G23","v":"94-4-SMSM"},"3ème",{"$f":"'Poule 3'!$C23","v":"PIC"},{"$f":"'Poule 3'!$E23","v":"JOSEPHINE"},{"$f":"'Poule 3'!$G23","v":"75-4-SMPP"},"3ème",{"$f":"'Poule 4'!$C23","v":"FRANCESCHINA"},{"$f":"'Poule 4'!$E23","v":"EMMA"},{"$f":"'Poule 4'!$G23","v":"75-4-STAP"}]
["4ème",{"$f":"'Poule 1'!$C24","v":""},{"$f":"'Poule 1'!$E24","v":""},{"$f":"'Poule 1'!$G24","v":""},"4ème",{"$f":"'Poule 2'!$C24","v":"SAINTE BEUVE"},{"$f":"'Poule 2'!$E24","v":"PAULINE"},{"$f":"'Poule 2'!$G24","v":"75-4-LRPA"},"4ème",{"$f":"'Poule 3'!$C24","v":"REENAERS"},{"$f":"'Poule 3'!$E24","v":"LINDSAY"},{"$f":"'Poule 3'!$G24","v":"94-4-SMSM"},"4ème",{"$f":"'Poule 4'!$C24","v":"GODET"},{"$f":"'Poule 4'!$E24","v":"LOUISE"},{"$f":"'Poule 4'!$G24","v":"75-4-LRPA"}]

{"sheet":"Tableau","index":7,"n_rows":57,"n_cols":33,"rows_kept":57,"cut":false,"hidden":false,"merged":[[29,6,29,7],[1,6,1,7],[25,22,25,23],[30,28,30,29],[39,0,47,8],[23,25,23,26],[16,28,16,29],[16,12,16,13],[23,12,23,13],[18,22,18,23],[0,18,0,21],[0,22,0,32],[15,31,15,32],[0,0,0,16],[9,25,9,26],[12,3,12,4],[8,12,8,13],[1,12,1,13],[10,22,10,23],[3,22,3,23]]}
["Tableaux des perdants et matchs de repêchage",null,null,null,null,null,null,null,null,null,null,null,null,null,null,null,null,null,"1er tour de tableau",null,null,null,"Tableau des gagnants"]
[null,null,null,null,null,null,null,null,null,null,null,null,"Perdant 1/4 de finale 4"]
[null,null,null,null,null,null,null,null,null,null,null,"V",{"$f":"IF(Y27=\"\",\"\",IF(Y27=\"p\",X27,X29))","v":"75-4-LRPA"},{"$f":"IF(Y27=\"\",\"\",IF(Y27=\"p\",W27,W29))","v":"TAILLARDAT"}]
[null,null,null,null,null,null,null,null,null,null,null,null,null,null,null,null,null,null,"1er poule 1",{"$f":"'Résultats de poule'!B2","v":"LHUERRE"},{"$f":"'Résultats de poule'!D2","v":"75-4-LRPA"},"V","1/4 de finale 1"]
[null,null,null,null,null,null,null,null,"V",{"$f":"IF(L3=\"\",\"\",IF(L3=\"v\",M3,M6))","v":"75-4-LRPA"},{"$f":"IF(L3=\"\",\"\",IF(L3=\"v\",N3,N6))","v":"TAILLARDAT"},null,null,null,"P",{"$f":"IF(V4=\"\",\"\",IF(V4=\"p\",U4,U5))","v":"75-4-LRPA"},{"$f":"IF(V4=\"\",\"\",IF(V4=\"p\",T4,T5))","v":"GODET"},null,"4ème poule 4",{"$f":"'Résultats de poule'!N5","v":"GODET"},{"$f":"'Résultats de poule'!P5","v":"75-4-LRPA"},"P",{"$f":"IF(V4=\"\",\"\",IF(V4=\"v\",T4,T5))","v":"LHUERRE"},{"$f":"IF(V4=\"\",\"\",IF(V4=\"v\",U4,U5))","v":"75-4-LRPA"},"V"]
[null,null,null,null,null,null,null,null,null,null,null,"P",{"$f":"IF(O5=\"\",\"\",IF(O5=\"v\",P5,P7))","v":"94-4-SMSM"},{"$f":"IF(O5=\"\",\"\",IF(O5=\"v\",Q5,Q7))","v":"MASINA"},null,null,null,null,null,null,null,null,null,null,null,{"$f":"IF(Y5=\"\",\"\",IF(Y5=\"v\",W5,W7))","v":"LHUERRE"},{"$f":"IF(Y5=\"\",\"\",IF(Y5=\"v\",X5,X7))","v":"75-4-LRPA"},"V"]
[null,null,null,null,null,null,null,null,null,null,null,null,null,null,"V",{"$f":"IF(V7=\"\",\"\",IF(V7=\"p\",U7,U8))","v":"94-4-SMSM"},{"$f":"IF(V7=\"\",\"\",IF(V7=\"p\",T7,T8))","v":"MASINA"},null,"3ème poule 2",{"$f":"'Résultats de poule'!F4","v":"MASINA"},{"$f":"'Résultats de poule'!H4","v":"94-4-SMSM"},"P",{"$f":"IF(V7=\"\",\"\",IF(V7=\"v\",T7,T8))","v":"DE PERIGNON"},{"$f":"IF(V7=\"\",\"\",IF(V7=\"v\",U7,U8))","v":"75-4-LRPA"},"P"]
[null,null,null,null,null,"V",{"$f":"IF(I5=\"\",\"\",IF(I5=\"v\",J5,J12))","v":"75-4-LRPA"},{"$f":"IF(I5=\"\",\"\",IF(I5=\"v\",K5,K12))","v":"TAILLARDAT"},null,null,null,null,null,null,null,null,null,null,"2ème poule 3",{"$f":"'Résultats de poule'!J3","v":"DE PERIGNON"},{"$f":"'Résultats de poule'!L3","v":"75-4-LRPA"},"V"]
[null,null,null,null,null,null,null,null,null,null,null,null,"Perdant 1/4 de finale 3"]
[null,null,null,null,null,null,null,null,null,null,null,"V",{"$f":"IF(Y20=\"\",\"\",IF(Y20=\"p\",X20,X22))","v":"75-4-ELIP"},{"$f":"IF(Y20=\"\",\"\",IF(Y20=\"p\",W20,W22))","v":"BRESOLIN"},null,null,null,null,null,null,null,null,null,null,null,"1/2 finale A",null,null,{"$f":"IF(AB6=\"\",\"\",IF(AB6=\"v\",Z6,Z13))","v":"LHUERRE"},{"$f":"IF(AB6=\"\",\"\",IF(AB6=\"v\",AA6,AA13))","v":"75-4-LRPA"},"V"]
[null,null,null,null,null,null,null,null,null,null,null,null,null,null,null,null,null,null,"2ème poule 2",{"$f":"'Résultats de poule'!F3","v":"RICHAUD"},{"$f":"'Résultats de poule'!H3","v":"75-4-STAP"},"V","1/4 de finale 2"]
[null,null,null,null,null,null,null,null,"P",{"$f":"IF(L10=\"\",\"\",IF(L10=\"v\",M10,M13))","v":"75-4-ELIP"},{"$f":"IF(L10=\"\",\"\",IF(L10=\"v\",N10,N13))","v":"BRESOLIN"},null,null,null,"V",{"$f":"IF(V11=\"\",\"\",IF(V11=\"p\",U11,U12))","v":"75-4-SMPP"},{"$f":"IF(V11=\"\",\"\",IF(V11=\"p\",T11,T12))","v":"PIC"},null,"3ème poule 3",{"$f":"'Résultats de poule'!J4","v":"PIC"},{"$f":"'Résultats de poule'!L4","v":"75-4-SMPP"},"P",{"$f":"IF(V11=\"\",\"\",IF(V11=\"v\",T11,T12))","v":"RICHAUD"},{"$f":"IF(V11=\"\",\"\",IF(V11=\"v\",U11,U12))","v":"75-4-STAP"},"P"]
[null,null,null,null,null,null,null,null,null,null,null,"P",{"$f":"IF(O12=\"\",\"\",IF(O12=\"v\",P12,P14))","v":"75-4-SMPP"},{"$f":"IF(O12=\"\",\"\",IF(O12=\"v\",Q12,Q14))","v":"PIC"},null,null,null,null,null,null,null,null,null,null,null,{"$f":"IF(Y12=\"\",\"\",IF(Y12=\"v\",W12,W14))","v":"VAGIC"},{"$f":"IF(Y12=\"\",\"\",IF(Y12=\"v\",X12,X14))","v":"75-4-SMPP"},"P"]
[null,null,null,"5ème",null,null,null,null,null,null,null,null,null,null,"P",{"$f":"IF(V14=\"\",\"\",IF(V14=\"p\",U14,U15))","v":""},{"$f":"IF(V14=\"\",\"\",IF(V14=\"p\",T14,T15))","v":""},null,"4ème poule 1",{"$f":"'Résultats de poule'!B5","v":""},{"$f":"'Résultats de poule'!D5","v":""},"P",{"$f":"IF(V14=\"\",\"\",IF(V14=\"v\",T14,T15))","v":"VAGIC"},{"$f":"IF(V14=\"\",\"\",IF(V14=\"v\",U14,U15))","v":"75-4-SMPP"},"V"]
[null,null,null,{"$f":"IF(F8=\"\",\"\",IF(F8=\"v\",G8,G22))","v":"75-4-LRPA"},{"$f":"IF(F8=\"\",\"\",IF(F8=\"v\",H8,H22))","v":"TAILLARDAT"},null,null,null,null,null,null,null,null,null,null,null,null,null,"1er poule 4",{"$f":"'Résultats de poule'!N2","v":"VAGIC"},{"$f":"'Résultats de poule'!P2","v":"75-4-SMPP"},"V"]
[null,null,null,null,null,null,null,null,null,null,null,null,null,null,null,null,null,null,null,null,null,null,null,null,null,null,null,null,null,null,null,"Vainqueur"]
[null,null,null,null,null,null,null,null,null,null,null,null,"Perdant 1/4 de finale 2",null,null,null,null,null,null,null,null,null,null,null,null,null,null,null,"FINALE",null,null,{"$f":"IF(AE10=\"\",\"\",IF(AE10=\"v\",AC10,AC24))","v":"LHUERRE"},{"$f":"IF(AE10=\"\",\"\",IF(AE10=\"v\",AD10,AD24))","v":"75-4-LRPA"}]
[null,null,null,null,null,null,null,null,null,null,null,"V",{"$f":"IF(Y12=\"\",\"\",IF(Y12=\"p\",X12,X14))","v":"75-4-STAP"},{"$f":"IF(Y12=\"\",\"\",IF(Y12=\"p\",W12,W14))","v":"RICHAUD"}]
[null,null,null,null,null,null,null,null,null,null,null,null,null,null,null,null,null,null,"1er poule 3",{"$f":"'Résultats de poule'!J2","v":"BRESOLIN"},{"$f":"'Résultats de poule'!L2","v":"75-4-ELIP"},"V","1/4 de finale 3"]
[null,null,null,null,null,null,null,null,"P",{"$f":"IF(L18=\"\",\"\",IF(L18=\"v\",M18,M21))","v":"75-4-STAP"},{"$f":"IF(L18=\"\",\"\",IF(L18=\"v\",N18,N21))","v":"RICHAUD"},null,null,null,"P",{"$f":"IF(V19=\"\",\"\",IF(V19=\"p\",U19,U20))","v":"75-4-LRPA"},{"$f":"IF(V19=\"\",\"\",IF(V19=\"p\",T19,T20))","v":"SAINTE BEUVE"},null,"4ème poule 2",{"$f":"'Résultats de poule'!F5","v":"SAINTE BEUVE"},{"$f":"'Résultats de poule'!H5","v":"75-4-LRPA"},"P",{"$f":"IF(V19=\"\",\"\",IF(V19=\"v\",T19,T20))","v":"BRESOLIN"},{"$f":"IF(V19=\"\",\"\",IF(V19=\"v\",U19,U20))","v":"75-4-ELIP"},"P"]
[null,null,null,null,null,null,null,null,null,null,null,"P",{"$f":"IF(O20=\"\",\"\",IF(O20=\"v\",P20,P22))","v":"75-4-STAP"},{"$f":"IF(O20=\"\",\"\",IF(O20=\"v\",Q20,Q22))","v":"FRANCESCHINA"},null,null,null,null,null,null,null,null,null,null,null,{"$f":"IF(Y20=\"\",\"\",IF(Y20=\"v\",W20,W22))","v":"VINCENT"},{"$f":"IF(Y20=\"\",\"\",IF(Y20=\"v\",X20,X22))","v":"94-4-SMSM"},"V"]
[null,null,null,null,null,"P",{"$f":"IF(I20=\"\",\"\",IF(I20=\"v\",J20,J27))","v":"75-4-LRPA"},{"$f":"IF(I20=\"\",\"\",IF(I20=\"v\",K20,K27))","v":"DE PERIGNON"},null,null,null,null,null,null,"V",{"$f":"IF(V22=\"\",\"\",IF(V22=\"p\",U22,U23))","v":"75-4-STAP"},{"$f":"IF(V22=\"\",\"\",IF(V22=\"p\",T22,T23))","v":"FRANCESCHINA"},null,"3ème poule 4",{"$f":"'Résultats de poule'!N4","v":"FRANCESCHINA"},{"$f":"'Résultats de poule'!P4","v":"75-4-STAP"},"P",{"$f":"IF(V22=\"\",\"\",IF(V22=\"v\",T22,T23))","v":"VINCENT"},{"$f":"IF(V22=\"\",\"\",IF(V22=\"v\",U22,U23))","v":"94-4-SMSM"},"V"]
[null,null,null,null,null,null,null,null,null,null,null,null,null,null,null,null,null,null,"2ème poule 1",{"$f":"'Résultats de poule'!B3","v":"VINCENT"},{"$f":"'Résultats de poule'!D3","v":"94-4-SMSM"},"V"]
[null,null,null,null,null,null,null,null,null,null,null,null,"Perdant 1/4 de finale 1",null,null,null,null,null,null,null,null,null,null,null,null,"1/2 finale B",null,null,{"$f":"IF(AB21=\"\",\"\",IF(AB21=\"v\",Z21,Z28))","v":"VINCENT"},{"$f":"IF(AB21=\"\",\"\",IF(AB21=\"v\",AA21,AA28))","v":"94-4-SMSM"},"P"]
[null,null,null,null,null,null,null,null,null,null,null,"V",{"$f":"IF(Y5=\"\",\"\",IF(Y5=\"p\",X5,X7))","v":"75-4-LRPA"},{"$f":"IF(Y5=\"\",\"\",IF(Y5=\"p\",W5,W7))","v":"DE PERIGNON"}]
[null,null,null,null,null,null,null,null,null,null,null,null,null,null,null,null,null,null,"2ème poule 4",{"$f":"'Résultats de poule'!N3","v":"DATH"},{"$f":"'Résultats de poule'!P3","v":"75-4-ELIP"},"P","1/4 de finale 4"]
[null,null,"P",{"$f":"IF(I20=\"\",\"\",IF(I20=\"p\",J20,J27))","v":"75-4-STAP"},{"$f":"IF(I20=\"\",\"\",IF(I20=\"p\",K20,K27))","v":"RICHAUD"},null,null,null,"V",{"$f":"IF(L25=\"\",\"\",IF(L25=\"v\",M25,M28))","v":"75-4-LRPA"},{"$f":"IF(L25=\"\",\"\",IF(L25=\"v\",N25,N28))","v":"DE PERIGNON"},null,null,null,"V",{"$f":"IF(V26=\"\",\"\",IF(V26=\"p\",U26,U27))","v":"75-4-ELIP"},{"$f":"IF(V26=\"\",\"\",IF(V26=\"p\",T26,T27))","v":"DATH"},null,"3ème poule 1",{"$f":"'Résultats de poule'!B4","v":"BELLIN"},{"$f":"'Résultats de poule'!D4","v":"75-4-LRPA"},"V",{"$f":"IF(V26=\"\",\"\",IF(V26=\"v\",T26,T27))","v":"BELLIN"},{"$f":"IF(V26=\"\",\"\",IF(V26=\"v\",U26,U27))","v":"75-4-LRPA"},"V"]
["7ème",null,null,null,null,null,null,null,null,null,null,"P",{"$f":"IF(O27=\"\",\"\",IF(O27=\"v\",P27,P29))","v":"75-4-ELIP"},{"$f":"IF(O27=\"\",\"\",IF(O27=\"v\",Q27,Q29))","v":"DATH"},null,null,null,null,null,null,null,null,null,null,null,{"$f":"IF(Y27=\"\",\"\",IF(Y27=\"v\",W27,W29))","v":"BELLIN"},{"$f":"IF(Y27=\"\",\"\",IF(Y27=\"v\",X27,X29))","v":"75-4-LRPA"},"P"]
[{"$f":"IF(C27=\"\",\"\",IF(C27=\"v\",D27,D31))","v":"75-4-STAP"},{"$f":"IF(C27=\"\",\"\",IF(C27=\"v\",E27,E31))","v":"BRESOLIN"},null,null,null,null,null,null,null,null,null,null,null,null,"P",{"$f":"IF(V29=\"\",\"\",IF(V29=\"p\",U29,U30))","v":"94-4-SMSM"},{"$f":"IF(V29=\"\",\"\",IF(V29=\"p\",T29,T30))","v":"REENAERS"},null,"4ème poule 3",{"$f":"'Résultats de poule'!J5","v":"REENAERS"},{"$f":"'Résultats de poule'!L5","v":"94-4-SMSM"},"P",{"$f":"IF(V29=\"\",\"\",IF(V29=\"v\",T29,T30))","v":"TAILLARDAT"},{"$f":"IF(V29=\"\",\"\",IF(V29=\"v\",U29,U30))","v":"75-4-LRPA"},"P"]
[null,null,null,null,null,null,null,null,null,null,null,null,null,null,null,null,null,null,"1er poule 2",{"$f":"'Résultats de poule'!F2","v":"TAILLARDAT"},{"$f":"'Résultats de poule'!H2","v":"75-4-LRPA"},"V",null,null,null,null,null,null,{"$f":"IF(AB6=\"\",\"\",IF(AB6=\"p\",Z6,Z13))","v":"VAGIC"},{"$f":"IF(AB6=\"\",\"\",IF(AB6=\"p\",AA6,AA13))","v":"75-4-SMPP"},"P",null,"3ème"]
[null,null,"V",{"$f":"IF(I27=\"\",\"\",IF(I27=\"p\",J27,J20))","v":"75-4-STAP"},{"$f":"IF(I5=\"\",\"\",IF(I5=\"p\",K5,K12))","v":"BRESOLIN"},null,null,null,null,null,null,null,null,null,null,null,null,null,null,null,null,null,null,null,null,null,null,null,"Place de 3ème/4ème",null,null,{"$f":"IF(AE30=\"\",\"\",IF(AE30=\"v\",AC30,AC32))","v":"BELLIN"},{"$f":"IF(AE30=\"\",\"\",IF(AE30=\"v\",AD30,AD32))","v":"94-4-SMSM"}]
[null,null,null,null,null,null,null,null,null,null,null,null,null,null,null,null,null,null,null,null,null,null,null,null,null,null,null,null,{"$f":"IF(AB21=\"\",\"\",IF(AB21=\"p\",Z21,Z28))","v":"BELLIN"},{"$f":"IF(AB21=\"\",\"\",IF(AB21=\"v\",AA21,AA28))","v":"94-4-SMSM"},"V"]
[]
[]
[null,null,null,null,null,null,null,null,null,null,null,null,null,null,null,{"$f":"IF(O5=\"\",\"\",IF(O5=\"p\",P5,P7))","v":"75-4-LRPA"},{"$f":"IF(O5=\"\",\"\",IF(O5=\"p\",Q5,Q7))","v":"GODET"}]
[null,null,null,null,null,null,null,null,null,null,null,null,{"$f":"IF(O35=\"\",\"\",IF(O35=\"v\",P35,P37))","v":""},{"$f":"IF(O35=\"\",\"\",IF(O35=\"v\",Q35,Q37))","v":""}]
[null,null,null,null,null,null,null,null,null,"13ème",null,null,null,null,null,{"$f":"IF(O12=\"\",\"\",IF(O12=\"p\",P12,P14))","v":""},{"$f":"IF(O12=\"\",\"\",IF(O12=\"p\",Q12,Q14))","v":""}]
[null,null,null,null,null,null,null,null,null,{"$f":"IF(L36=\"\",\"\",IF(L36=\"v\",M36,M40))","v":""},{"$f":"IF(L36=\"\",\"\",IF(L36=\"v\",N36,N40))","v":""}]
[null,null,null,null,null,null,null,null,null,null,null,null,null,null,null,{"$f":"IF(O20=\"\",\"\",IF(O20=\"p\",P20,P22))","v":"75-4-LRPA"},{"$f":"IF(O20=\"\",\"\",IF(O20=\"p\",Q20,Q22))","v":"SAINTE BEUVE"}]
["MATCHS DE CLASSEMENT",null,null,null,null,null,null,null,null,null,null,null,{"$f":"IF(O39=\"\",\"\",IF(O39=\"v\",P39,P41))","v":""},{"$f":"IF(O39=\"\",\"\",IF(O39=\"v\",Q39,Q41))","v":""}]
[null,null,null,null,null,null,null,null,null,null,null,null,null,null,null,{"$f":"IF(O27=\"\",\"\",IF(O27=\"p\",P27,P29))","v":"94-4-SMSM"},{"$f":"IF(O27=\"\",\"\",IF(O27=\"p\",Q27,Q29))","v":"REENAERS"}]
[]
[null,null,null,null,null,null,null,null,null,null,null,null,"15ème",null,null,{"$f":"IF(O35=\"\",\"\",IF(O35=\"p\",P35,P37))","v":""},{"$f":"IF(O35=\"\",\"\",IF(O35=\"p\",Q35,Q37))","v":""}]
[null,null,null,null,null,null,null,null,null,null,null,null,{"$f":"IF(O43=\"\",\"\",IF(O43=\"v\",P43,P45))","v":""},{"$f":"IF(O43=\"\",\"\",IF(O43=\"v\",Q43,Q45))","v":""}]
[null,null,null,null,null,null,null,null,null,null,null,null,null,null,null,{"$f":"IF(O39=\"\",\"\",IF(O39=\"p\",P39,P41))","v":""},{"$f":"IF(O39=\"\",\"\",IF(O39=\"p\",Q39,Q41))","v":""}]
[]
[null,null,null,null,null,null,null,null,null,null,null,null,null,null,null,{"$f":"IF(L3=\"\",\"\",IF(L3=\"p\",M3,M6))","v":"94-4-SMSM"},{"$f":"IF(L3=\"\",\"\",IF(L3=\"p\",N3,N6))","v":"MASINA"}]
[null,null,null,null,null,null,null,null,null,null,null,null,{"$f":"IF(O47=\"\",\"\",IF(O47=\"v\",P47,P49))","v":""},{"$f":"IF(O47=\"\",\"\",IF(O47=\"v\",Q47,Q49))","v":""}]
[null,null,null,null,null,null,null,null,null,"9ème",null,null,null,null,null,{"$f":"IF(L10=\"\",\"\",IF(L10=\"p\",M10,M13))","v":"75-4-SMPP"},{"$f":"IF(L10=\"\",\"\",IF(L10=\"p\",N10,N13))","v":"PIC"}]
[null,null,null,null,null,null,null,null,null,{"$f":"IF(L48=\"\",\"\",IF(L48=\"v\",M48,M52))","v":""},{"$f":"IF(L48=\"\",\"\",IF(L48=\"v\",N48,N52))","v":""}]
[null,null,null,null,null,null,null,null,null,null,null,null,null,null,null,{"$f":"IF(L18=\"\",\"\",IF(L18=\"p\",M18,M21))","v":"75-4-STAP"},{"$f":"IF(L18=\"\",\"\",IF(L18=\"p\",N18,N21))","v":"FRANCESCHINA"}]
[null,null,null,null,null,null,null,null,null,null,null,null,{"$f":"IF(O51=\"\",\"\",IF(O51=\"v\",P51,P53))","v":""},{"$f":"IF(O51=\"\",\"\",IF(O51=\"v\",Q51,Q53))","v":""}]
[null,null,null,null,null,null,null,null,null,null,null,null,null,null,null,{"$f":"IF(L25=\"\",\"\",IF(L25=\"p\",M25,M28))","v":"75-4-ELIP"},{"$f":"IF(L25=\"\",\"\",IF(L25=\"p\",N25,N28))","v":"DATH"}]
[]
[null,null,null,null,null,null,null,null,null,null,null,null,"11ème",null,null,{"$f":"IF(O47=\"\",\"\",IF(O47=\"p\",P47,P49))","v":""},{"$f":"IF(O47=\"\",\"\",IF(O47=\"p\",Q47,Q49))","v":""}]
[null,null,null,null,null,null,null,null,null,null,null,null,{"$f":"IF(O55=\"\",\"\",IF(O55=\"v\",P55,P57))","v":""},{"$f":"IF(O55=\"\",\"\",IF(O55=\"v\",Q55,Q57))","v":""}]
[null,null,null,null,null,null,null,null,null,null,null,null,null,null,null,{"$f":"IF(O51=\"\",\"\",IF(O51=\"p\",P51,P53))","v":""},{"$f":"IF(O51=\"\",\"\",IF(O51=\"p\",Q51,Q53))","v":""}]

{"sheet":"Classement","index":8,"n_rows":19,"n_cols":3,"rows_kept":19,"cut":false,"hidden":false,"merged":[[0,0,0,2],[1,0,1,2]]}
[{"$f":"IF(Engagés!A1=\"\",\"\",Engagés!A1)","v":"Championnat du Comité de Paris et EST Francilien"}]
[{"$f":"IF(Engagés!E3=\"\",\"\",Engagés!E3)","v":"CF"}]
["Classement","NOM","Etablissement"]
["1er",{"$f":"Tableau!AF17","v":"LHUERRE"},{"$f":"Tableau!AG17","v":"75-4-LRPA"}]
["2ème",{"$f":"IF(Tableau!$AE$10=\"\",\"\",IF(Tableau!$AE$10=\"p\",Tableau!$AC$10,Tableau!$AC$24))","v":"VINCENT"},{"$f":"IF(Tableau!$AE$10=\"\",\"\",IF(Tableau!$AE$10=\"p\",Tableau!$AD$10,Tableau!$AD$24))","v":"94-4-SMSM"}]
["3ème",{"$f":"Tableau!AF31","v":"BELLIN"},{"$f":"Tableau!AG31","v":"94-4-SMSM"}]
["4ème",{"$f":"IF(Tableau!AE30=\"\",\"\",IF(Tableau!$AE$30=\"p\",Tableau!$AC$30,Tableau!$AC$32))","v":"VAGIC"},{"$f":"IF(Tableau!AE30=\"\",\"\",IF(Tableau!$AE$30=\"p\",Tableau!$AD$30,Tableau!$AD$32))","v":"75-4-SMPP"}]
["5ème",{"$f":"Tableau!E15","v":"TAILLARDAT"},{"$f":"Tableau!D15","v":"75-4-LRPA"}]
["6ème",{"$f":"IF(Tableau!F8=\"\",\"\",IF(Tableau!$F$8=\"p\",Tableau!$H$8,Tableau!$H$22))","v":"DE PERIGNON"},{"$f":"IF(Tableau!F8=\"\",\"\",IF(Tableau!$F$8=\"p\",Tableau!$G$8,Tableau!$G$22))","v":"75-4-LRPA"}]
["7ème",{"$f":"Tableau!B29","v":"BRESOLIN"},{"$f":"Tableau!A29","v":"75-4-STAP"}]
["8ème",{"$f":"IF(Tableau!C27=\"\",\"\",IF(Tableau!$C$27=\"p\",Tableau!$E$27,Tableau!$E$31))","v":"RICHAUD"},{"$f":"IF(Tableau!C27=\"\",\"\",IF(Tableau!$C$27=\"p\",Tableau!$D$27,Tableau!$D$31))","v":"75-4-STAP"}]
["9ème",{"$f":"Tableau!K50","v":""},{"$f":"Tableau!J50","v":""}]
["10ème",{"$f":"IF(Tableau!L48=\"\",\"\",IF(Tableau!$L$48=\"p\",Tableau!$N$48,Tableau!$N$52))","v":""},{"$f":"IF(Tableau!L48=\"\",\"\",IF(Tableau!$L$48=\"p\",Tableau!$M$48,Tableau!$M$52))","v":""}]
["11ème",{"$f":"Tableau!N56","v":""},{"$f":"Tableau!M56","v":""}]
["12ème",{"$f":"IF(Tableau!O55=\"\",\"\",IF(Tableau!$O$55=\"p\",Tableau!$Q$55,Tableau!$Q$57))","v":""},{"$f":"IF(Tableau!O55=\"\",\"\",IF(Tableau!$O$55=\"p\",Tableau!$P$55,Tableau!$P$57))","v":""}]
["13ème",{"$f":"Tableau!K38","v":""},{"$f":"Tableau!J38","v":""}]
["14ème",{"$f":"IF(Tableau!L36=\"\",\"\",IF(Tableau!$L$36=\"p\",Tableau!$N$36,Tableau!$N$40))","v":""},{"$f":"IF(Tableau!L36=\"\",\"\",IF(Tableau!$L$36=\"p\",Tableau!$M$36,Tableau!$M$40))","v":""}]
["15ème",{"$f":"Tableau!N44","v":""},{"$f":"Tableau!M44","v":""}]
["16ème",{"$f":"IF(Tableau!O43=\"\",\"\",IF(Tableau!$O$43=\"p\",Tableau!$Q$43,Tableau!$Q$45))","v":""},{"$f":"IF(Tableau!O43=\"\",\"\",IF(Tableau!$O$43=\"p\",Tableau!$P$43,Tableau!$P$45))","v":""}]