{"text_format":"1","workbook":"xlsx","n_sheets":12,"sheets":["Engagés","Poule 1","Poule 2","Poule 3","Poule 4","Poule 5","Poule 6","Poule 7","Poule 8","Résultats de poule","Tableau","Classement"],"not_rendered":{"charts":0,"images":81,"macros":1,"external_links":0,"defined_names":1,"comments":0,"pivot_tables":0},"unopened":[],"bounds":{"document_bytes":16777216,"sheet_cells":100000,"rows_first":2000,"rows_last":500,"rows_between":2000,"halvings":0,"cell_chars":16384,"cell_head_chars":4096},"cells_cut":0,"cells_raw":0,"read":"whole","date_system":"1900"}

{"sheet":"Engagés","index":0,"n_rows":37,"n_cols":14,"rows_kept":37,"cut":false,"hidden":false,"merged":[[17,6,17,9],[17,10,17,13],[23,6,23,9],[23,10,23,13],[0,0,2,1],[5,10,5,13],[5,6,5,9],[11,6,11,9],[11,10,11,13],[0,2,2,2]]}
["QUALIFICATIONS Comité de Paris et Est-Francilien",null,"BADMINTON","DATE :","13 dec"]
[null,null,null,"LIEU :","LR"]
[null,null,null,"CATEGORIE :","BF DIV 1"]
["Tête de série","ETABLISSEMENT","NOM","PRENOM","SIGLE"]
[]
[1,"ETOILE SP. LA ROCHEFOUCAULD","SMEETS","MARTA","75-4-LRPA",null,"Poule 1",null,null,null,"Poule 2"]
[2,"ALBERT DE MUN","SUN CHEN","CHARLOTTE","94-4-ADMN",null,1,{"$f":"VLOOKUP($G7,$A$1:$E$37,3,FALSE)","v":"SMEETS"},{"$f":"VLOOKUP($G7,$A$1:$E$37,4,FALSE)","v":"MARTA"},{"$f":"VLOOKUP($G7,$A$1:$E$37,5,FALSE)","v":"75-4-LRPA"},2,{"$f":"VLOOKUP($K7,$A$1:$E$37,3,FALSE)","v":"SUN CHEN"},{"$f":"VLOOKUP($K7,$A$1:$E$37,4,FALSE)","v":"CHARLOTTE"},{"$f":"VLOOKUP($K7,$A$1:$E$37,5,FALSE)","v":"94-4-ADMN"}]
[3,"ALBERT DE MUN","KRZEWSKI","AMBRE","94-4-ADMN",null,16,{"$f":"VLOOKUP($G8,$A$1:$E$37,3,FALSE)","v":"COLLIN"},{"$f":"VLOOKUP($G8,$A$1:$E$37,4,FALSE)","v":"CHLOE"},{"$f":"VLOOKUP($G8,$A$1:$E$37,5,FALSE)","v":"94-4-PROV"},15,{"$f":"VLOOKUP($K8,$A$1:$E$37,3,FALSE)","v":"COFFINIER"},{"$f":"VLOOKUP($K8,$A$1:$E$37,4,FALSE)","v":"NOUR"},{"$f":"VLOOKUP($K8,$A$1:$E$37,5,FALSE)","v":"75-4-LRPA"}]
[4,"ETOILE SP. LA ROCHEFOUCAULD","PAUGAM","AMBRE","75-4-LRPA",null,17,{"$f":"VLOOKUP($G9,$A$1:$E$37,3,FALSE)","v":"D'ALENCON"},{"$f":"VLOOKUP($G9,$A$1:$E$37,4,FALSE)","v":"EVANNA"},{"$f":"VLOOKUP($G9,$A$1:$E$37,5,FALSE)","v":"75-4-STAP"},18,{"$f":"VLOOKUP($K9,$A$1:$E$37,3,FALSE)","v":"GAGNEUX-BISSON"},{"$f":"VLOOKUP($K9,$A$1:$E$37,4,FALSE)","v":"MAY-ANN"},{"$f":"VLOOKUP($K9,$A$1:$E$37,5,FALSE)","v":"75-4-STAP"}]
[5,"ETOILE SP. LA ROCHEFOUCAULD","MONNIER","MARGUERITE","75-4-LRPA",null,32,{"$f":"VLOOKUP($G10,$A$1:$E$37,3,FALSE)","v":0},{"$f":"VLOOKUP($G10,$A$1:$E$37,4,FALSE)","v":0},{"$f":"VLOOKUP($G10,$A$1:$E$37,5,FALSE)","v":0},31,{"$f":"VLOOKUP($K10,$A$1:$E$37,3,FALSE)","v":0},{"$f":"VLOOKUP($K10,$A$1:$E$37,4,FALSE)","v":0},{"$f":"VLOOKUP($K10,$A$1:$E$37,5,FALSE)","v":0}]
[6,"ETOILE SP. LA ROCHEFOUCAULD","DE ROMANCE","SIXTINE","75-4-LRPA"]
[7,"COL-LYC BOSSUET NOTRE DAME","CHRISTEN","NEVA","75-4-BNDP",null,"Poule 3",null,null,null,"Poule 4"]
[8,"PROVIDENCE","COURTIAL","ADELE","94-4-PROV",null,3,{"$f":"VLOOKUP($G13,$A$1:$E$37,3,FALSE)","v":"KRZEWSKI"},{"$f":"VLOOKUP($G13,$A$1:$E$37,4,FALSE)","v":"AMBRE"},{"$f":"VLOOKUP($G13,$A$1:$E$37,5,FALSE)","v":"94-4-ADMN"},4,{"$f":"VLOOKUP($K13,$A$1:$E$37,3,FALSE)","v":"PAUGAM"},{"$f":"VLOOKUP($K13,$A$1:$E$37,4,FALSE)","v":"AMBRE"},{"$f":"VLOOKUP($K13,$A$1:$E$37,5,FALSE)","v":"75-4-LRPA"}]
[9,"STANISLAS","AUGUSTE","ELOA","75-4-STAP",null,14,{"$f":"VLOOKUP($G14,$A$1:$E$37,3,FALSE)","v":"ZHANG"},{"$f":"VLOOKUP($G14,$A$1:$E$37,4,FALSE)","v":"WENDY"},{"$f":"VLOOKUP($G14,$A$1:$E$37,5,FALSE)","v":"75-4-SMPP"},13,{"$f":"VLOOKUP($K14,$A$1:$E$37,3,FALSE)","v":"MADAR"},{"$f":"VLOOKUP($K14,$A$1:$E$37,4,FALSE)","v":"GLORIA"},{"$f":"VLOOKUP($K14,$A$1:$E$37,5,FALSE)","v":"94-4-SMSM"}]
[10,"ETOILE SP. LA ROCHEFOUCAULD","CETTI","AMELIE","75-4-LRPA",null,19,{"$f":"VLOOKUP($G15,$A$1:$E$37,3,FALSE)","v":"BENOIT J"},{"$f":"VLOOKUP($G15,$A$1:$E$37,4,FALSE)","v":"JADE"},{"$f":"VLOOKUP($G15,$A$1:$E$37,5,FALSE)","v":"75-4-STAP"},20,{"$f":"VLOOKUP($K15,$A$1:$E$37,3,FALSE)","v":"CASSIM"},{"$f":"VLOOKUP($K15,$A$1:$E$37,4,FALSE)","v":"CHARLIE"},{"$f":"VLOOKUP($K15,$A$1:$E$37,5,FALSE)","v":"94-4-PROV"}]
[11,"SAINT MICHEL","LI","SOPHIA","94-4-SMSM",null,30,{"$f":"VLOOKUP($G16,$A$1:$E$37,3,FALSE)","v":0},{"$f":"VLOOKUP($G16,$A$1:$E$37,4,FALSE)","v":0},{"$f":"VLOOKUP($G16,$A$1:$E$37,5,FALSE)","v":0},29,{"$f":"VLOOKUP($K16,$A$1:$E$37,3,FALSE)","v":0},{"$f":"VLOOKUP($K16,$A$1:$E$37,4,FALSE)","v":0},{"$f":"VLOOKUP($K16,$A$1:$E$37,5,FALSE)","v":0}]
[12,"STANISLAS","BENOIT L","LILA","75-4-STAP"]
[13,"SAINT MICHEL","MADAR","GLORIA","94-4-SMSM",null,"Poule 5",null,null,null,"Poule 6"]
[14,"ST MICHEL DE PICPUS","ZHANG","WENDY","75-4-SMPP",null,5,{"$f":"VLOOKUP($G19,$A$1:$E$37,3,FALSE)","v":"MONNIER"},{"$f":"VLOOKUP($G19,$A$1:$E$37,4,FALSE)","v":"MARGUERITE"},{"$f":"VLOOKUP($G19,$A$1:$E$37,5,FALSE)","v":"75-4-LRPA"},6,{"$f":"VLOOKUP($K19,$A$1:$E$37,3,FALSE)","v":"DE ROMANCE"},{"$f":"VLOOKUP($K19,$A$1:$E$37,4,FALSE)","v":"SIXTINE"},{"$f":"VLOOKUP($K19,$A$1:$E$37,5,FALSE)","v":"75-4-LRPA"}]
[15,"ETOILE SP. LA ROCHEFOUCAULD","COFFINIER","NOUR","75-4-LRPA",null,12,{"$f":"VLOOKUP($G20,$A$1:$E$37,3,FALSE)","v":"BENOIT L"},{"$f":"VLOOKUP($G20,$A$1:$E$37,4,FALSE)","v":"LILA"},{"$f":"VLOOKUP($G20,$A$1:$E$37,5,FALSE)","v":"75-4-STAP"},11,{"$f":"VLOOKUP($K20,$A$1:$E$37,3,FALSE)","v":"LI"},{"$f":"VLOOKUP($K20,$A$1:$E$37,4,FALSE)","v":"SOPHIA"},{"$f":"VLOOKUP($K20,$A$1:$E$37,5,FALSE)","v":"94-4-SMSM"}]
[16,"PROVIDENCE","COLLIN","CHLOE","94-4-PROV",null,21,{"$f":"VLOOKUP($G21,$A$1:$E$37,3,FALSE)","v":"DELANNOY"},{"$f":"VLOOKUP($G21,$A$1:$E$37,4,FALSE)","v":"JEANNE"},{"$f":"VLOOKUP($G21,$A$1:$E$37,5,FALSE)","v":"94-4-SMSM"},22,{"$f":"VLOOKUP($K21,$A$1:$E$37,3,FALSE)","v":"DROGAT"},{"$f":"VLOOKUP($K21,$A$1:$E$37,4,FALSE)","v":"ORIANE"},{"$f":"VLOOKUP($K21,$A$1:$E$37,5,FALSE)","v":"94-4-PROV"}]
[17,"STANISLAS","D'ALENCON","EVANNA","75-4-STAP",null,28,{"$f":"VLOOKUP($G22,$A$1:$E$37,3,FALSE)","v":0},{"$f":"VLOOKUP($G22,$A$1:$E$37,4,FALSE)","v":0},{"$f":"VLOOKUP($G22,$A$1:$E$37,5,FALSE)","v":0},27,{"$f":"VLOOKUP($K22,$A$1:$E$37,3,FALSE)","v":0},{"$f":"VLOOKUP($K22,$A$1:$E$37,4,FALSE)","v":0},{"$f":"VLOOKUP($K22,$A$1:$E$37,5,FALSE)","v":0}]
[18,"stanislas","GAGNEUX-BISSON","MAY-ANN","75-4-STAP"]
[19,"STANISLAS","BENOIT J","JADE","75-4-STAP",null,"Poule 7",null,null,null,"Poule 8"]
[20,"PROVIDENCE","CASSIM","CHARLIE","94-4-PROV",null,7,{"$f":"VLOOKUP($G25,$A$1:$E$37,3,FALSE)","v":"CHRISTEN"},{"$f":"VLOOKUP($G25,$A$1:$E$37,4,FALSE)","v":"NEVA"},{"$f":"VLOOKUP($G25,$A$1:$E$37,5,FALSE)","v":"75-4-BNDP"},8,{"$f":"VLOOKUP($K25,$A$1:$E$37,3,FALSE)","v":"COURTIAL"},{"$f":"VLOOKUP($K25,$A$1:$E$37,4,FALSE)","v":"ADELE"},{"$f":"VLOOKUP($K25,$A$1:$E$37,5,FALSE)","v":"94-4-PROV"}]
[21,"SAINT MICHEL","DELANNOY","JEANNE","94-4-SMSM",null,10,{"$f":"VLOOKUP($G26,$A$1:$E$37,3,FALSE)","v":"CETTI"},{"$f":"VLOOKUP($G26,$A$1:$E$37,4,FALSE)","v":"AMELIE"},{"$f":"VLOOKUP($G26,$A$1:$E$37,5,FALSE)","v":"75-4-LRPA"},9,{"$f":"VLOOKUP($K26,$A$1:$E$37,3,FALSE)","v":"AUGUSTE"},{"$f":"VLOOKUP($K26,$A$1:$E$37,4,FALSE)","v":"ELOA"},{"$f":"VLOOKUP($K26,$A$1:$E$37,5,FALSE)","v":"75-4-STAP"}]
[22,"PROVIDENCE","DROGAT","ORIANE","94-4-PROV",null,23,{"$f":"VLOOKUP($G27,$A$1:$E$37,3,FALSE)","v":"WEYER"},{"$f":"VLOOKUP($G27,$A$1:$E$37,4,FALSE)","v":"MAXINE"},{"$f":"VLOOKUP($G27,$A$1:$E$37,5,FALSE)","v":"94-4-SMSM"},24,{"$f":"VLOOKUP($K27,$A$1:$E$37,3,FALSE)","v":"DE MARCK "},{"$f":"VLOOKUP($K27,$A$1:$E$37,4,FALSE)","v":"CLEMENCE"},{"$f":"VLOOKUP($K27,$A$1:$E$37,5,FALSE)","v":"94-4-SMSM"}]
[23,"SAINT MICHEL","WEYER","MAXINE","94-4-SMSM",null,26,{"$f":"VLOOKUP($G28,$A$1:$E$37,3,FALSE)","v":0},{"$f":"VLOOKUP($G28,$A$1:$E$37,4,FALSE)","v":0},{"$f":"VLOOKUP($G28,$A$1:$E$37,5,FALSE)","v":0},25,{"$f":"VLOOKUP($K28,$A$1:$E$37,3,FALSE)","v":0},{"$f":"VLOOKUP($K28,$A$1:$E$37,4,FALSE)","v":0},{"$f":"VLOOKUP($K28,$A$1:$E$37,5,FALSE)","v":0}]
[24,"SAINT MICHEL","DE MARCK ","CLEMENCE","94-4-SMSM"]
[25]
[26]
[27]
[28]
[29]
[30]
[31]
[32]

{"sheet":"Poule 1","index":1,"n_rows":24,"n_cols":7,"rows_kept":24,"cut":false,"hidden":false,"merged":[[0,0,0,2],[0,3,0,4],[22,0,22,1],[20,2,20,3],[23,4,23,5],[22,4,22,5],[13,0,13,6],[14,3,14,4],[23,2,23,3],[21,0,21,1],[23,0,23,1],[21,2,21,3],[19,4,19,5],[20,4,20,5],[7,0,7,6],[8,3,8,4],[8,0,8,2],[9,0,9,2],[10,0,10,2],[1,0,1,2],[1,3,1,6],[22,2,22,3],[20,0,20,1],[18,4,18,6],[11,0,11,2],[12,0,12,2],[14,0,14,2],[17,0,17,2],[18,0,18,3],[21,4,21,5],[19,0,19,1],[15,0,15,2],[16,0,16,2],[19,2,19,3]]}
[{"$f":"Engagés!C1","v":"BADMINTON"},null,null,{"$f":"Engagés!C3","v":0}]
["POULE 1"]
[null,"NOM","Prénom","Sigle","Vict","Def","Classement"]
[1,{"$f":"VLOOKUP($A4,Engagés!$A$1:$E$374,3,FALSE)","v":"SMEETS"},{"$f":"VLOOKUP($A4,Engagés!$A$1:$E$374,4,FALSE)","v":"MARTA"},{"$f":"VLOOKUP($A4,Engagés!$A$1:$E$374,5,FALSE)","v":"75-4-LRPA"},null,null,"1er"]
[16,{"$f":"VLOOKUP($A5,Engagés!$A$1:$E$374,3,FALSE)","v":"COLLIN"},{"$f":"VLOOKUP($A5,Engagés!$A$1:$E$374,4,FALSE)","v":"CHLOE"},{"$f":"VLOOKUP($A5,Engagés!$A$1:$E$374,5,FALSE)","v":"94-4-PROV"},null,null,"3ème"]
[17,{"$f":"VLOOKUP($A6,Engagés!$A$1:$E$374,3,FALSE)","v":"D'ALENCON"},{"$f":"VLOOKUP($A6,Engagés!$A$1:$E$374,4,FALSE)","v":"EVANNA"},{"$f":"VLOOKUP($A6,Engagés!$A$1:$E$374,5,FALSE)","v":"75-4-STAP"},null,null,"2ème"]
[32,{"$f":"VLOOKUP($A7,Engagés!$A$1:$E$374,3,FALSE)","v":0},{"$f":"VLOOKUP($A7,Engagés!$A$1:$E$374,4,FALSE)","v":0},{"$f":"VLOOKUP($A7,Engagés!$A$1:$E$374,5,FALSE)","v":0},null,null,"4ème"]
["Si poule de 4 joueurs alors…"]
["Déroulement",null,null,"Joueurs A contre Joueur B",null,"Vainqueur","Score"]
["Match 1",null,null,{"$f":"B4","v":"SMEETS"},{"$f":"B7","v":0}]
["Match 2",null,null,{"$f":"B5","v":"COLLIN"},{"$f":"B6","v":"D'ALENCON"}]
["Finale vainqueur Match 1 contre vainqueur Match 2",null,null,{"$f":"IF(F10=\"\",\"\",F10)","v":""},{"$f":"IF(F11=\"\",\"\",F11)","v":""}]
["Petite finale entre les deux perdants des matchs 1 et 2",null,null,{"$f":"IF(D12=\"\",\"\",IF(D12=D10,E10,D10))","v":""},{"$f":"IF(E12=\"\",\"\",IF(E12=D11,E11,D11))","v":""}]
["Si poule de 3 joueurs alors…"]
["Déroulement",null,null,"Joueurs A contre Joueur B",null,"Vainqueur","Score"]
["Match 1",null,null,{"$f":"B4","v":"SMEETS"},{"$f":"B6","v":"D'ALENCON"},"SMEETS"]
["Match 2",null,null,{"$f":"B5","v":"COLLIN"},{"$f":"B6","v":"D'ALENCON"},"D'ALENCON"]
["Match 3",null,null,{"$f":"B4","v":"SMEETS"},{"$f":"B5","v":"COLLIN"},"SMEETS"]
["CLASSEMENT",null,null,null,{"$f":"A2","v":"POULE 1"}]
[null,null,"NOM",null,"PRENOM",null,"SIGLE"]
["1er",null,{"$f":"IF($G$4=\"1er\", $B$4,IF($G$5=\"1er\",$B$5,IF($G$6=\"1er\",$B$6,IF($G$7=\"1er\",$B$7,\"\"))))","v":"SMEETS"},null,{"$f":"IF($G$4=\"1er\", $C$4,IF($G$5=\"1er\",$C$5,IF($G$6=\"1er\",$C$6,IF($G$7=\"1er\",$C$7,\"\"))))","v":"MARTA"},null,{"$f":"IF($G$4=\"1er\", $D$4,IF($G$5=\"1er\",$D$5,IF($G$6=\"1er\",$D$6,IF($G$7=\"1er\",$D$7,\"\"))))","v":"75-4-LRPA"}]
["2ème",null,{"$f":"IF($G$4=\"2ème\", $B$4,IF($G$5=\"2ème\",$B$5,IF($G$6=\"2ème\",$B$6,IF($G$7=\"2ème\",$B$7,\"\"))))","v":"D'ALENCON"},null,{"$f":"IF($G$4=\"2ème\", $C$4,IF($G$5=\"2ème\",$C$5,IF($G$6=\"2ème\",$C$6,IF($G$7=\"2ème\",$C$7,\"\"))))","v":"EVANNA"},null,{"$f":"IF($G$4=\"2ème\", $D$4,IF($G$5=\"2ème\",$D$5,IF($G$6=\"2ème\",$D$6,IF($G$7=\"2ème\",$D$7,\"\"))))","v":"75-4-STAP"}]
["3ème",null,{"$f":"IF($G$4=\"3ème\", $B$4,IF($G$5=\"3ème\",$B$5,IF($G$6=\"3ème\",$B$6,IF($G$7=\"3ème\",$B$7,\"\"))))","v":"COLLIN"},null,{"$f":"IF($G$4=\"3ème\", $C$4,IF($G$5=\"3ème\",$C$5,IF($G$6=\"3ème\",$C$6,IF($G$7=\"3ème\",$C$7,\"\"))))","v":"CHLOE"},null,{"$f":"IF($G$4=\"3ème\", $D$4,IF($G$5=\"3ème\",$D$5,IF($G$6=\"3ème\",$D$6,IF($G$7=\"3ème\",$D$7,\"\"))))","v":"94-4-PROV"}]
["4ème",null,{"$f":"IF($G$4=\"4ème\", $B$4,IF($G$5=\"4ème\",$B$5,IF($G$6=\"4ème\",$B$6,IF($G$7=\"4ème\",$B$7,\"\"))))","v":0},null,{"$f":"IF($G$4=\"4ème\", $C$4,IF($G$5=\"4ème\",$C$5,IF($G$6=\"4ème\",$C$6,IF($G$7=\"4ème\",$C$7,\"\"))))","v":0},null,{"$f":"IF($G$4=\"4ème\", $D$4,IF($G$5=\"4ème\",$D$5,IF($G$6=\"4ème\",$D$6,IF($G$7=\"4ème\",$D$7,\"\"))))","v":0}]

{"sheet":"Poule 2","index":2,"n_rows":24,"n_cols":7,"rows_kept":24,"cut":false,"hidden":false,"merged":[[0,3,0,4],[15,0,15,2],[16,0,16,2],[1,0,1,2],[1,3,1,6],[7,0,7,6],[8,0,8,2],[8,3,8,4],[9,0,9,2],[10,0,10,2],[11,0,11,2],[12,0,12,2],[13,0,13,6],[14,0,14,2],[14,3,14,4],[0,0,0,2],[17,0,17,2],[18,0,18,3],[18,4,18,6],[20,0,20,1],[20,2,20,3],[20,4,20,5],[19,0,19,1],[19,2,19,3],[19,4,19,5],[23,0,23,1],[23,2,23,3],[23,4,23,5],[21,0,21,1],[21,2,21,3],[21,4,21,5],[22,0,22,1],[22,2,22,3],[22,4,22,5]]}
[{"$f":"Engagés!C1","v":"BADMINTON"},null,null,{"$f":"Engagés!C3","v":0}]
["POULE 2"]
[null,"NOM","Prénom","Sigle","Vict","Def","Classement"]
[2,{"$f":"VLOOKUP($A4,Engagés!$A$1:$E$374,3,FALSE)","v":"SUN CHEN"},{"$f":"VLOOKUP($A4,Engagés!$A$1:$E$374,4,FALSE)","v":"CHARLOTTE"},{"$f":"VLOOKUP($A4,Engagés!$A$1:$E$374,5,FALSE)","v":"94-4-ADMN"},null,null,"3ème"]
[15,{"$f":"VLOOKUP($A5,Engagés!$A$1:$E$374,3,FALSE)","v":"COFFINIER"},{"$f":"VLOOKUP($A5,Engagés!$A$1:$E$374,4,FALSE)","v":"NOUR"},{"$f":"VLOOKUP($A5,Engagés!$A$1:$E$374,5,FALSE)","v":"75-4-LRPA"},null,null,"1er"]
[18,{"$f":"VLOOKUP($A6,Engagés!$A$1:$E$374,3,FALSE)","v":"GAGNEUX-BISSON"},{"$f":"VLOOKUP($A6,Engagés!$A$1:$E$374,4,FALSE)","v":"MAY-ANN"},{"$f":"VLOOKUP($A6,Engagés!$A$1:$E$374,5,FALSE)","v":"75-4-STAP"},null,null,"2ème"]
[31,{"$f":"VLOOKUP($A7,Engagés!$A$1:$E$374,3,FALSE)","v":0},{"$f":"VLOOKUP($A7,Engagés!$A$1:$E$374,4,FALSE)","v":0},{"$f":"VLOOKUP($A7,Engagés!$A$1:$E$374,5,FALSE)","v":0},null,null,"4ème"]
["Si poule de 4 joueurs alors…"]
["Déroulement",null,null,"Joueurs A contre Joueur B",null,"Vainqueur","Score"]
["Match 1",null,null,{"$f":"B4","v":"SUN CHEN"},{"$f":"B7","v":0}]
["Match 2",null,null,{"$f":"B5","v":"COFFINIER"},{"$f":"B6","v":"GAGNEUX-BISSON"}]
["Finale vainqueur Match 1 contre vainqueur Match 2",null,null,{"$f":"IF(F10=\"\",\"\",F10)","v":""},{"$f":"IF(F11=\"\",\"\",F11)","v":""}]
["Petite finale entre les deux perdants des matchs 1 et 2",null,null,{"$f":"IF(D12=\"\",\"\",IF(D12=D10,E10,D10))","v":""},{"$f":"IF(E12=\"\",\"\",IF(E12=D11,E11,D11))","v":""}]
["Si poule de 3 joueurs alors…"]
["Déroulement",null,null,"Joueurs A contre Joueur B",null,"Vainqueur","Score"]
["Match 1",null,null,{"$f":"B4","v":"SUN CHEN"},{"$f":"B6","v":"GAGNEUX-BISSON"},"GAGNEUX-BISSON"]
["Match 2",null,null,{"$f":"B5","v":"COFFINIER"},{"$f":"B6","v":"GAGNEUX-BISSON"},"COFFINIER"]
["Match 3",null,null,{"$f":"B4","v":"SUN CHEN"},{"$f":"B5","v":"COFFINIER"},"COFFINIER"]
["CLASSEMENT",null,null,null,{"$f":"A2","v":"POULE 2"}]
[null,null,"NOM",null,"PRENOM",null,"SIGLE"]
["1er",null,{"$f":"IF($G$4=\"1er\", $B$4,IF($G$5=\"1er\",$B$5,IF($G$6=\"1er\",$B$6,IF($G$7=\"1er\",$B$7,\"\"))))","v":"COFFINIER"},null,{"$f":"IF($G$4=\"1er\", $C$4,IF($G$5=\"1er\",$C$5,IF($G$6=\"1er\",$C$6,IF($G$7=\"1er\",$C$7,\"\"))))","v":"NOUR"},null,{"$f":"IF($G$4=\"1er\", $D$4,IF($G$5=\"1er\",$D$5,IF($G$6=\"1er\",$D$6,IF($G$7=\"1er\",$D$7,\"\"))))","v":"75-4-LRPA"}]
["2ème",null,{"$f":"IF($G$4=\"2ème\", $B$4,IF($G$5=\"2ème\",$B$5,IF($G$6=\"2ème\",$B$6,IF($G$7=\"2ème\",$B$7,\"\"))))","v":"GAGNEUX-BISSON"},null,{"$f":"IF($G$4=\"2ème\", $C$4,IF($G$5=\"2ème\",$C$5,IF($G$6=\"2ème\",$C$6,IF($G$7=\"2ème\",$C$7,\"\"))))","v":"MAY-ANN"},null,{"$f":"IF($G$4=\"2ème\", $D$4,IF($G$5=\"2ème\",$D$5,IF($G$6=\"2ème\",$D$6,IF($G$7=\"2ème\",$D$7,\"\"))))","v":"75-4-STAP"}]
["3ème",null,{"$f":"IF($G$4=\"3ème\", $B$4,IF($G$5=\"3ème\",$B$5,IF($G$6=\"3ème\",$B$6,IF($G$7=\"3ème\",$B$7,\"\"))))","v":"SUN CHEN"},null,{"$f":"IF($G$4=\"3ème\", $C$4,IF($G$5=\"3ème\",$C$5,IF($G$6=\"3ème\",$C$6,IF($G$7=\"3ème\",$C$7,\"\"))))","v":"CHARLOTTE"},null,{"$f":"IF($G$4=\"3ème\", $D$4,IF($G$5=\"3ème\",$D$5,IF($G$6=\"3ème\",$D$6,IF($G$7=\"3ème\",$D$7,\"\"))))","v":"94-4-ADMN"}]
["4ème",null,{"$f":"IF($G$4=\"4ème\", $B$4,IF($G$5=\"4ème\",$B$5,IF($G$6=\"4ème\",$B$6,IF($G$7=\"4ème\",$B$7,\"\"))))","v":0},null,{"$f":"IF($G$4=\"4ème\", $C$4,IF($G$5=\"4ème\",$C$5,IF($G$6=\"4ème\",$C$6,IF($G$7=\"4ème\",$C$7,\"\"))))","v":0},null,{"$f":"IF($G$4=\"4ème\", $D$4,IF($G$5=\"4ème\",$D$5,IF($G$6=\"4ème\",$D$6,IF($G$7=\"4ème\",$D$7,\"\"))))","v":0}]

{"sheet":"Poule 3","index":3,"n_rows":24,"n_cols":7,"rows_kept":24,"cut":false,"hidden":false,"merged":[[0,3,0,4],[15,0,15,2],[16,0,16,2],[1,0,1,2],[1,3,1,6],[7,0,7,6],[8,0,8,2],[8,3,8,4],[9,0,9,2],[10,0,10,2],[11,0,11,2],[12,0,12,2],[13,0,13,6],[14,0,14,2],[14,3,14,4],[0,0,0,2],[17,0,17,2],[18,0,18,3],[18,4,18,6],[20,0,20,1],[20,2,20,3],[20,4,20,5],[19,0,19,1],[19,2,19,3],[19,4,19,5],[23,0,23,1],[23,2,23,3],[23,4,23,5],[21,0,21,1],[21,2,21,3],[21,4,21,5],[22,0,22,1],[22,2,22,3],[22,4,22,5]]}
[{"$f":"Engagés!C1","v":"BADMINTON"},null,null,{"$f":"Engagés!C3","v":0}]
["POULE 3"]
[null,"NOM","Prénom","Sigle","Vict","Def","Classement"]
[3,{"$f":"VLOOKUP($A4,Engagés!$A$1:$E$374,3,FALSE)","v":"KRZEWSKI"},{"$f":"VLOOKUP($A4,Engagés!$A$1:$E$374,4,FALSE)","v":"AMBRE"},{"$f":"VLOOKUP($A4,Engagés!$A$1:$E$374,5,FALSE)","v":"94-4-ADMN"},null,null,"1er"]
[14,{"$f":"VLOOKUP($A5,Engagés!$A$1:$E$374,3,FALSE)","v":"ZHANG"},{"$f":"VLOOKUP($A5,Engagés!$A$1:$E$374,4,FALSE)","v":"WENDY"},{"$f":"VLOOKUP($A5,Engagés!$A$1:$E$374,5,FALSE)","v":"75-4-SMPP"},null,null,"2ème"]
[19,{"$f":"VLOOKUP($A6,Engagés!$A$1:$E$374,3,FALSE)","v":"BENOIT J"},{"$f":"VLOOKUP($A6,Engagés!$A$1:$E$374,4,FALSE)","v":"JADE"},{"$f":"VLOOKUP($A6,Engagés!$A$1:$E$374,5,FALSE)","v":"75-4-STAP"},null,null,"3ème"]
[30,{"$f":"VLOOKUP($A7,Engagés!$A$1:$E$374,3,FALSE)","v":0},{"$f":"VLOOKUP($A7,Engagés!$A$1:$E$374,4,FALSE)","v":0},{"$f":"VLOOKUP($A7,Engagés!$A$1:$E$374,5,FALSE)","v":0},null,null,"4ème"]
["Si poule de 4 joueurs alors…"]
["Déroulement",null,null,"Joueurs A contre Joueur B",null,"Vainqueur","Score"]
["Match 1",null,null,{"$f":"B4","v":"KRZEWSKI"},{"$f":"B7","v":0}]
["Match 2",null,null,{"$f":"B5","v":"ZHANG"},{"$f":"B6","v":"BENOIT J"}]
["Finale vainqueur Match 1 contre vainqueur Match 2",null,null,{"$f":"IF(F10=\"\",\"\",F10)","v":""},{"$f":"IF(F11=\"\",\"\",F11)","v":""}]
["Petite finale entre les deux perdants des matchs 1 et 2",null,null,{"$f":"IF(D12=\"\",\"\",IF(D12=D10,E10,D10))","v":""},{"$f":"IF(E12=\"\",\"\",IF(E12=D11,E11,D11))","v":""}]
["Si poule de 3 joueurs alors…"]
["Déroulement",null,null,"Joueurs A contre Joueur B",null,"Vainqueur","Score"]
["Match 1",null,null,{"$f":"B4","v":"KRZEWSKI"},{"$f":"B6","v":"BENOIT J"},"KRZEWSKI"]
["Match 2",null,null,{"$f":"B5","v":"ZHANG"},{"$f":"B6","v":"BENOIT J"},"ZHANG"]
["Match 3",null,null,{"$f":"B4","v":"KRZEWSKI"},{"$f":"B5","v":"ZHANG"},"KRZEWSKI"]
["CLASSEMENT",null,null,null,{"$f":"A2","v":"POULE 3"}]
[null,null,"NOM",null,"PRENOM",null,"SIGLE"]
["1er",null,{"$f":"IF($G$4=\"1er\", $B$4,IF($G$5=\"1er\",$B$5,IF($G$6=\"1er\",$B$6,IF($G$7=\"1er\",$B$7,\"\"))))","v":"KRZEWSKI"},null,{"$f":"IF($G$4=\"1er\", $C$4,IF($G$5=\"1er\",$C$5,IF($G$6=\"1er\",$C$6,IF($G$7=\"1er\",$C$7,\"\"))))","v":"AMBRE"},null,{"$f":"IF($G$4=\"1er\", $D$4,IF($G$5=\"1er\",$D$5,IF($G$6=\"1er\",$D$6,IF($G$7=\"1er\",$D$7,\"\"))))","v":"94-4-ADMN"}]
["2ème",null,{"$f":"IF($G$4=\"2ème\", $B$4,IF($G$5=\"2ème\",$B$5,IF($G$6=\"2ème\",$B$6,IF($G$7=\"2ème\",$B$7,\"\"))))","v":"ZHANG"},null,{"$f":"IF($G$4=\"2ème\", $C$4,IF($G$5=\"2ème\",$C$5,IF($G$6=\"2ème\",$C$6,IF($G$7=\"2ème\",$C$7,\"\"))))","v":"WENDY"},null,{"$f":"IF($G$4=\"2ème\", $D$4,IF($G$5=\"2ème\",$D$5,IF($G$6=\"2ème\",$D$6,IF($G$7=\"2ème\",$D$7,\"\"))))","v":"75-4-SMPP"}]
["3ème",null,{"$f":"IF($G$4=\"3ème\", $B$4,IF($G$5=\"3ème\",$B$5,IF($G$6=\"3ème\",$B$6,IF($G$7=\"3ème\",$B$7,\"\"))))","v":"BENOIT J"},null,{"$f":"IF($G$4=\"3ème\", $C$4,IF($G$5=\"3ème\",$C$5,IF($G$6=\"3ème\",$C$6,IF($G$7=\"3ème\",$C$7,\"\"))))","v":"JADE"},null,{"$f":"IF($G$4=\"3ème\", $D$4,IF($G$5=\"3ème\",$D$5,IF($G$6=\"3ème\",$D$6,IF($G$7=\"3ème\",$D$7,\"\"))))","v":"75-4-STAP"}]
["4ème",null,{"$f":"IF($G$4=\"4ème\", $B$4,IF($G$5=\"4ème\",$B$5,IF($G$6=\"4ème\",$B$6,IF($G$7=\"4ème\",$B$7,\"\"))))","v":0},null,{"$f":"IF($G$4=\"4ème\", $C$4,IF($G$5=\"4ème\",$C$5,IF($G$6=\"4ème\",$C$6,IF($G$7=\"4ème\",$C$7,\"\"))))","v":0},null,{"$f":"IF($G$4=\"4ème\", $D$4,IF($G$5=\"4ème\",$D$5,IF($G$6=\"4ème\",$D$6,IF($G$7=\"4ème\",$D$7,\"\"))))","v":0}]

{"sheet":"Poule 4","index":4,"n_rows":24,"n_cols":7,"rows_kept":24,"cut":false,"hidden":false,"merged":[[0,3,0,4],[15,0,15,2],[16,0,16,2],[1,0,1,2],[1,3,1,6],[7,0,7,6],[8,0,8,2],[8,3,8,4],[9,0,9,2],[10,0,10,2],[11,0,11,2],[12,0,12,2],[13,0,13,6],[14,0,14,2],[14,3,14,4],[0,0,0,2],[17,0,17,2],[18,0,18,3],[18,4,18,6],[20,0,20,1],[20,2,20,3],[20,4,20,5],[19,0,19,1],[19,2,19,3],[19,4,19,5],[23,0,23,1],[23,2,23,3],[23,4,23,5],[21,0,21,1],[21,2,21,3],[21,4,21,5],[22,0,22,1],[22,2,22,3],[22,4,22,5]]}
[{"$f":"Engagés!C1","v":"BADMINTON"},null,null,{"$f":"Engagés!C3","v":0}]
["POULE 4"]
[null,"NOM","Prénom","Sigle","Vict","Def","Classement"]
[4,{"$f":"VLOOKUP($A4,Engagés!$A$1:$E$374,3,FALSE)","v":"PAUGAM"},{"$f":"VLOOKUP($A4,Engagés!$A$1:$E$374,4,FALSE)","v":"AMBRE"},{"$f":"VLOOKUP($A4,Engagés!$A$1:$E$374,5,FALSE)","v":"75-4-LRPA"},null,null,"1er"]
[13,{"$f":"VLOOKUP($A5,Engagés!$A$1:$E$374,3,FALSE)","v":"MADAR"},{"$f":"VLOOKUP($A5,Engagés!$A$1:$E$374,4,FALSE)","v":"GLORIA"},{"$f":"VLOOKUP($A5,Engagés!$A$1:$E$374,5,FALSE)","v":"94-4-SMSM"},null,null,"2ème"]
[20,{"$f":"VLOOKUP($A6,Engagés!$A$1:$E$374,3,FALSE)","v":"CASSIM"},{"$f":"VLOOKUP($A6,Engagés!$A$1:$E$374,4,FALSE)","v":"CHARLIE"},{"$f":"VLOOKUP($A6,Engagés!$A$1:$E$374,5,FALSE)","v":"94-4-PROV"},null,null,"3ème"]
[29,{"$f":"VLOOKUP($A7,Engagés!$A$1:$E$374,3,FALSE)","v":0},{"$f":"VLOOKUP($A7,Engagés!$A$1:$E$374,4,FALSE)","v":0},{"$f":"VLOOKUP($A7,Engagés!$A$1:$E$374,5,FALSE)","v":0},null,null,"4ème"]
["Si poule de 4 joueurs alors…"]
["Déroulement",null,null,"Joueurs A contre Joueur B",null,"Vainqueur","Score"]
["Match 1",null,null,{"$f":"B4","v":"PAUGAM"},{"$f":"B7","v":0},0]
["Match 2",null,null,{"$f":"B5","v":"MADAR"},{"$f":"B6","v":"CASSIM"},0]
["Finale vainqueur Match 1 contre vainqueur Match 2",null,null,{"$f":"IF(F10=\"\",\"\",F10)","v":0},{"$f":"IF(F11=\"\",\"\",F11)","v":0},0]
["Petite finale entre les deux perdants des matchs 1 et 2",null,null,null,null,0]
["Si poule de 3 joueurs alors…"]
["Déroulement",null,null,"Joueurs A contre Joueur B",null,"Vainqueur","Score"]
["Match 1",null,null,{"$f":"B4","v":"PAUGAM"},{"$f":"B6","v":"CASSIM"},"PAUGAM"]
["Match 2",null,null,{"$f":"B5","v":"MADAR"},{"$f":"B6","v":"CASSIM"},"MADAR"]
["Match 3",null,null,{"$f":"B4","v":"PAUGAM"},{"$f":"B5","v":"MADAR"},"PAUGAM"]
["CLASSEMENT",null,null,null,{"$f":"A2","v":"POULE 4"}]
[null,null,"NOM",null,"PRENOM",null,"SIGLE"]
["1er",null,{"$f":"IF($G$4=\"1er\", $B$4,IF($G$5=\"1er\",$B$5,IF($G$6=\"1er\",$B$6,IF($G$7=\"1er\",$B$7,\"\"))))","v":"PAUGAM"},null,{"$f":"IF($G$4=\"1er\", $C$4,IF($G$5=\"1er\",$C$5,IF($G$6=\"1er\",$C$6,IF($G$7=\"1er\",$C$7,\"\"))))","v":"AMBRE"},null,{"$f":"IF($G$4=\"1er\", $D$4,IF($G$5=\"1er\",$D$5,IF($G$6=\"1er\",$D$6,IF($G$7=\"1er\",$D$7,\"\"))))","v":"75-4-LRPA"}]
["2ème",null,{"$f":"IF($G$4=\"2ème\", $B$4,IF($G$5=\"2ème\",$B$5,IF($G$6=\"2ème\",$B$6,IF($G$7=\"2ème\",$B$7,\"\"))))","v":"MADAR"},null,{"$f":"IF($G$4=\"2ème\", $C$4,IF($G$5=\"2ème\",$C$5,IF($G$6=\"2ème\",$C$6,IF($G$7=\"2ème\",$C$7,\"\"))))","v":"GLORIA"},null,{"$f":"IF($G$4=\"2ème\", $D$4,IF($G$5=\"2ème\",$D$5,IF($G$6=\"2ème\",$D$6,IF($G$7=\"2ème\",$D$7,\"\"))))","v":"94-4-SMSM"}]
["3ème",null,{"$f":"IF($G$4=\"3ème\", $B$4,IF($G$5=\"3ème\",$B$5,IF($G$6=\"3ème\",$B$6,IF($G$7=\"3ème\",$B$7,\"\"))))","v":"CASSIM"},null,{"$f":"IF($G$4=\"3ème\", $C$4,IF($G$5=\"3ème\",$C$5,IF($G$6=\"3ème\",$C$6,IF($G$7=\"3ème\",$C$7,\"\"))))","v":"CHARLIE"},null,{"$f":"IF($G$4=\"3ème\", $D$4,IF($G$5=\"3ème\",$D$5,IF($G$6=\"3ème\",$D$6,IF($G$7=\"3ème\",$D$7,\"\"))))","v":"94-4-PROV"}]
["4ème",null,{"$f":"IF($G$4=\"4ème\", $B$4,IF($G$5=\"4ème\",$B$5,IF($G$6=\"4ème\",$B$6,IF($G$7=\"4ème\",$B$7,\"\"))))","v":0},null,{"$f":"IF($G$4=\"4ème\", $C$4,IF($G$5=\"4ème\",$C$5,IF($G$6=\"4ème\",$C$6,IF($G$7=\"4ème\",$C$7,\"\"))))","v":0},null,{"$f":"IF($G$4=\"4ème\", $D$4,IF($G$5=\"4ème\",$D$5,IF($G$6=\"4ème\",$D$6,IF($G$7=\"4ème\",$D$7,\"\"))))","v":0}]

{"sheet":"Poule 5","index":5,"n_rows":24,"n_cols":7,"rows_kept":24,"cut":false,"hidden":false,"merged":[[12,0,12,2],[13,0,13,6],[0,0,0,2],[0,3,0,4],[10,0,10,2],[11,0,11,2],[1,0,1,2],[1,3,1,6],[7,0,7,6],[8,0,8,2],[8,3,8,4],[9,0,9,2],[20,0,20,1],[20,2,20,3],[20,4,20,5],[14,0,14,2],[14,3,14,4],[15,0,15,2],[18,4,18,6],[19,0,19,1],[19,2,19,3],[19,4,19,5],[16,0,16,2],[17,0,17,2],[18,0,18,3],[23,0,23,1],[23,2,23,3],[23,4,23,5],[21,0,21,1],[21,2,21,3],[21,4,21,5],[22,0,22,1],[22,2,22,3],[22,4,22,5]]}
[{"$f":"Engagés!C1","v":"BADMINTON"},null,null,{"$f":"Engagés!C3","v":0}]
["POULE 5"]
[null,"NOM","Prénom","Sigle","Vict","Def","Classement"]
[5,{"$f":"VLOOKUP($A4,Engagés!$A$1:$E$374,3,FALSE)","v":"MONNIER"},{"$f":"VLOOKUP($A4,Engagés!$A$1:$E$374,4,FALSE)","v":"MARGUERITE"},{"$f":"VLOOKUP($A4,Engagés!$A$1:$E$374,5,FALSE)","v":"75-4-LRPA"},null,null,"2ème"]
[12,{"$f":"VLOOKUP($A5,Engagés!$A$1:$E$374,3,FALSE)","v":"BENOIT L"},{"$f":"VLOOKUP($A5,Engagés!$A$1:$E$374,4,FALSE)","v":"LILA"},{"$f":"VLOOKUP($A5,Engagés!$A$1:$E$374,5,FALSE)","v":"75-4-STAP"},null,null,"3ème"]
[21,{"$f":"VLOOKUP($A6,Engagés!$A$1:$E$374,3,FALSE)","v":"DELANNOY"},{"$f":"VLOOKUP($A6,Engagés!$A$1:$E$374,4,FALSE)","v":"JEANNE"},{"$f":"VLOOKUP($A6,Engagés!$A$1:$E$374,5,FALSE)","v":"94-4-SMSM"},null,null,"1er"]
[28,{"$f":"VLOOKUP($A7,Engagés!$A$1:$E$374,3,FALSE)","v":0},{"$f":"VLOOKUP($A7,Engagés!$A$1:$E$374,4,FALSE)","v":0},{"$f":"VLOOKUP($A7,Engagés!$A$1:$E$374,5,FALSE)","v":0},null,null,"4ème"]
["Si poule de 4 joueurs alors…"]
["Déroulement",null,null,"Joueurs A contre Joueur B",null,"Vainqueur","Score"]
["Match 1",null,null,{"$f":"B4","v":"MONNIER"},{"$f":"B7","v":0},0]
["Match 2",null,null,{"$f":"B5","v":"BENOIT L"},{"$f":"B6","v":"DELANNOY"},0]
["Finale vainqueur Match 1 contre vainqueur Match 2",null,null,{"$f":"IF(F10=\"\",\"\",F10)","v":0},{"$f":"IF(F11=\"\",\"\",F11)","v":0},0]
["Petite finale entre les deux perdants des matchs 1 et 2",null,null,null,null,0]
["Si poule de 3 joueurs alors…"]
["Déroulement",null,null,"Joueurs A contre Joueur B",null,"Vainqueur","Score"]
["Match 1",null,null,{"$f":"B4","v":"MONNIER"},{"$f":"B6","v":"DELANNOY"},"DELANNOY"]
["Match 2",null,null,{"$f":"B5","v":"BENOIT L"},{"$f":"B6","v":"DELANNOY"},"DELANNOY"]
["Match 3",null,null,{"$f":"B4","v":"MONNIER"},{"$f":"B5","v":"BENOIT L"},"MONNIER"]
["CLASSEMENT",null,null,null,{"$f":"A2","v":"POULE 5"}]
[null,null,"NOM",null,"PRENOM",null,"SIGLE"]
["1er",null,{"$f":"IF($G$4=\"1er\", $B$4,IF($G$5=\"1er\",$B$5,IF($G$6=\"1er\",$B$6,IF($G$7=\"1er\",$B$7,\"\"))))","v":"DELANNOY"},null,{"$f":"IF($G$4=\"1er\", $C$4,IF($G$5=\"1er\",$C$5,IF($G$6=\"1er\",$C$6,IF($G$7=\"1er\",$C$7,\"\"))))","v":"JEANNE"},null,{"$f":"IF($G$4=\"1er\", $D$4,IF($G$5=\"1er\",$D$5,IF($G$6=\"1er\",$D$6,IF($G$7=\"1er\",$D$7,\"\"))))","v":"94-4-SMSM"}]
["2ème",null,{"$f":"IF($G$4=\"2ème\", $B$4,IF($G$5=\"2ème\",$B$5,IF($G$6=\"2ème\",$B$6,IF($G$7=\"2ème\",$B$7,\"\"))))","v":"MONNIER"},null,{"$f":"IF($G$4=\"2ème\", $C$4,IF($G$5=\"2ème\",$C$5,IF($G$6=\"2ème\",$C$6,IF($G$7=\"2ème\",$C$7,\"\"))))","v":"MARGUERITE"},null,{"$f":"IF($G$4=\"2ème\", $D$4,IF($G$5=\"2ème\",$D$5,IF($G$6=\"2ème\",$D$6,IF($G$7=\"2ème\",$D$7,\"\"))))","v":"75-4-LRPA"}]
["3ème",null,{"$f":"IF($G$4=\"3ème\", $B$4,IF($G$5=\"3ème\",$B$5,IF($G$6=\"3ème\",$B$6,IF($G$7=\"3ème\",$B$7,\"\"))))","v":"BENOIT L"},null,{"$f":"IF($G$4=\"3ème\", $C$4,IF($G$5=\"3ème\",$C$5,IF($G$6=\"3ème\",$C$6,IF($G$7=\"3ème\",$C$7,\"\"))))","v":"LILA"},null,{"$f":"IF($G$4=\"3ème\", $D$4,IF($G$5=\"3ème\",$D$5,IF($G$6=\"3ème\",$D$6,IF($G$7=\"3ème\",$D$7,\"\"))))","v":"75-4-STAP"}]
["4ème",null,{"$f":"IF($G$4=\"4ème\", $B$4,IF($G$5=\"4ème\",$B$5,IF($G$6=\"4ème\",$B$6,IF($G$7=\"4ème\",$B$7,\"\"))))","v":0},null,{"$f":"IF($G$4=\"4ème\", $C$4,IF($G$5=\"4ème\",$C$5,IF($G$6=\"4ème\",$C$6,IF($G$7=\"4ème\",$C$7,\"\"))))","v":0},null,{"$f":"IF($G$4=\"4ème\", $D$4,IF($G$5=\"4ème\",$D$5,IF($G$6=\"4ème\",$D$6,IF($G$7=\"4ème\",$D$7,\"\"))))","v":0}]

{"sheet":"Poule 6","index":6,"n_rows":24,"n_cols":7,"rows_kept":24,"cut":false,"hidden":false,"merged":[[12,0,12,2],[13,0,13,6],[0,0,0,2],[0,3,0,4],[10,0,10,2],[11,0,11,2],[1,0,1,2],[1,3,1,6],[7,0,7,6],[8,0,8,2],[8,3,8,4],[9,0,9,2],[20,0,20,1],[20,2,20,3],[20,4,20,5],[14,0,14,2],[14,3,14,4],[15,0,15,2],[18,4,18,6],[19,0,19,1],[19,2,19,3],[19,4,19,5],[16,0,16,2],[17,0,17,2],[18,0,18,3],[23,0,23,1],[23,2,23,3],[23,4,23,5],[21,0,21,1],[21,2,21,3],[21,4,21,5],[22,0,22,1],[22,2,22,3],[22,4,22,5]]}
[{"$f":"Engagés!C1","v":"BADMINTON"},null,null,{"$f":"Engagés!C3","v":0}]
["POULE 6"]
[null,"NOM","Prénom","Sigle","Vict","Def","Classement"]
[6,{"$f":"VLOOKUP($A4,Engagés!$A$1:$E$374,3,FALSE)","v":"DE ROMANCE"},{"$f":"VLOOKUP($A4,Engagés!$A$1:$E$374,4,FALSE)","v":"SIXTINE"},{"$f":"VLOOKUP($A4,Engagés!$A$1:$E$374,5,FALSE)","v":"75-4-LRPA"},null,null,"2ème"]
[11,{"$f":"VLOOKUP($A5,Engagés!$A$1:$E$374,3,FALSE)","v":"LI"},{"$f":"VLOOKUP($A5,Engagés!$A$1:$E$374,4,FALSE)","v":"SOPHIA"},{"$f":"VLOOKUP($A5,Engagés!$A$1:$E$374,5,FALSE)","v":"94-4-SMSM"},null,null,"1er"]
[22,{"$f":"VLOOKUP($A6,Engagés!$A$1:$E$374,3,FALSE)","v":"DROGAT"},{"$f":"VLOOKUP($A6,Engagés!$A$1:$E$374,4,FALSE)","v":"ORIANE"},{"$f":"VLOOKUP($A6,Engagés!$A$1:$E$374,5,FALSE)","v":"94-4-PROV"},null,null,"3ème"]
[27,{"$f":"VLOOKUP($A7,Engagés!$A$1:$E$374,3,FALSE)","v":0},{"$f":"VLOOKUP($A7,Engagés!$A$1:$E$374,4,FALSE)","v":0},{"$f":"VLOOKUP($A7,Engagés!$A$1:$E$374,5,FALSE)","v":0},null,null,"4ème"]
["Si poule de 4 joueurs alors…"]
["Déroulement",null,null,"Joueurs A contre Joueur B",null,"Vainqueur","Score"]
["Match 1",null,null,{"$f":"B4","v":"DE ROMANCE"},{"$f":"B7","v":0},0]
["Match 2",null,null,{"$f":"B5","v":"LI"},{"$f":"B6","v":"DROGAT"},0]
["Finale vainqueur Match 1 contre vainqueur Match 2",null,null,{"$f":"IF(F10=\"\",\"\",F10)","v":0},{"$f":"IF(F11=\"\",\"\",F11)","v":0},0]
["Petite finale entre les deux perdants des matchs 1 et 2",null,null,null,null,0]
["Si poule de 3 joueurs alors…"]
["Déroulement",null,null,"Joueurs A contre Joueur B",null,"Vainqueur","Score"]
["Match 1",null,null,{"$f":"B4","v":"DE ROMANCE"},{"$f":"B6","v":"DROGAT"},"DE ROMANCE"]
["Match 2",null,null,{"$f":"B5","v":"LI"},{"$f":"B6","v":"DROGAT"},"LI"]
["Match 3",null,null,{"$f":"B4","v":"DE ROMANCE"},{"$f":"B5","v":"LI"},"LI"]
["CLASSEMENT",null,null,null,{"$f":"A2","v":"POULE 6"}]
[null,null,"NOM",null,"PRENOM",null,"SIGLE"]
["1er",null,{"$f":"IF($G$4=\"1er\", $B$4,IF($G$5=\"1er\",$B$5,IF($G$6=\"1er\",$B$6,IF($G$7=\"1er\",$B$7,\"\"))))","v":"LI"},null,{"$f":"IF($G$4=\"1er\", $C$4,IF($G$5=\"1er\",$C$5,IF($G$6=\"1er\",$C$6,IF($G$7=\"1er\",$C$7,\"\"))))","v":"SOPHIA"},null,{"$f":"IF($G$4=\"1er\", $D$4,IF($G$5=\"1er\",$D$5,IF($G$6=\"1er\",$D$6,IF($G$7=\"1er\",$D$7,\"\"))))","v":"94-4-SMSM"}]
["2ème",null,{"$f":"IF($G$4=\"2ème\", $B$4,IF($G$5=\"2ème\",$B$5,IF($G$6=\"2ème\",$B$6,IF($G$7=\"2ème\",$B$7,\"\"))))","v":"DE ROMANCE"},null,{"$f":"IF($G$4=\"2ème\", $C$4,IF($G$5=\"2ème\",$C$5,IF($G$6=\"2ème\",$C$6,IF($G$7=\"2ème\",$C$7,\"\"))))","v":"SIXTINE"},null,{"$f":"IF($G$4=\"2ème\", $D$4,IF($G$5=\"2ème\",$D$5,IF($G$6=\"2ème\",$D$6,IF($G$7=\"2ème\",$D$7,\"\"))))","v":"75-4-LRPA"}]
["3ème",null,{"$f":"IF($G$4=\"3ème\", $B$4,IF($G$5=\"3ème\",$B$5,IF($G$6=\"3ème\",$B$6,IF($G$7=\"3ème\",$B$7,\"\"))))","v":"DROGAT"},null,{"$f":"IF($G$4=\"3ème\", $C$4,IF($G$5=\"3ème\",$C$5,IF($G$6=\"3ème\",$C$6,IF($G$7=\"3ème\",$C$7,\"\"))))","v":"ORIANE"},null,{"$f":"IF($G$4=\"3ème\", $D$4,IF($G$5=\"3ème\",$D$5,IF($G$6=\"3ème\",$D$6,IF($G$7=\"3ème\",$D$7,\"\"))))","v":"94-4-PROV"}]
["4ème",null,{"$f":"IF($G$4=\"4ème\", $B$4,IF($G$5=\"4ème\",$B$5,IF($G$6=\"4ème\",$B$6,IF($G$7=\"4ème\",$B$7,\"\"))))","v":0},null,{"$f":"IF($G$4=\"4ème\", $C$4,IF($G$5=\"4ème\",$C$5,IF($G$6=\"4ème\",$C$6,IF($G$7=\"4ème\",$C$7,\"\"))))","v":0},null,{"$f":"IF($G$4=\"4ème\", $D$4,IF($G$5=\"4ème\",$D$5,IF($G$6=\"4ème\",$D$6,IF($G$7=\"4ème\",$D$7,\"\"))))","v":0}]

{"sheet":"Poule 7","index":7,"n_rows":24,"n_cols":9,"rows_kept":24,"cut":false,"hidden":false,"merged":[[12,0,12,2],[13,0,13,6],[0,0,0,2],[0,3,0,4],[10,0,10,2],[11,0,11,2],[1,0,1,2],[1,3,1,6],[7,0,7,6],[8,0,8,2],[8,3,8,4],[9,0,9,2],[20,0,20,1],[20,2,20,3],[20,4,20,5],[14,0,14,2],[14,3,14,4],[15,0,15,2],[18,4,18,6],[19,0,19,1],[19,2,19,3],[19,4,19,5],[16,0,16,2],[17,0,17,2],[18,0,18,3],[23,0,23,1],[23,2,23,3],[23,4,23,5],[21,0,21,1],[21,2,21,3],[21,4,21,5],[22,0,22,1],[22,2,22,3],[22,4,22,5]]}
[{"$f":"Engagés!C1","v":"BADMINTON"},null,null,{"$f":"Engagés!C3","v":0}]
["POULE 7"]
[null,"NOM","Prénom","Sigle","Vict","Def","Classement"]
[7,{"$f":"VLOOKUP($A4,Engagés!$A$1:$E$374,3,FALSE)","v":"CHRISTEN"},{"$f":"VLOOKUP($A4,Engagés!$A$1:$E$374,4,FALSE)","v":"NEVA"},{"$f":"VLOOKUP($A4,Engagés!$A$1:$E$374,5,FALSE)","v":"75-4-BNDP"},null,null,"1er"]
[10,{"$f":"VLOOKUP($A5,Engagés!$A$1:$E$374,3,FALSE)","v":"CETTI"},{"$f":"VLOOKUP($A5,Engagés!$A$1:$E$374,4,FALSE)","v":"AMELIE"},{"$f":"VLOOKUP($A5,Engagés!$A$1:$E$374,5,FALSE)","v":"75-4-LRPA"},null,null,"3ème"]
[23,{"$f":"VLOOKUP($A6,Engagés!$A$1:$E$374,3,FALSE)","v":"WEYER"},{"$f":"VLOOKUP($A6,Engagés!$A$1:$E$374,4,FALSE)","v":"MAXINE"},{"$f":"VLOOKUP($A6,Engagés!$A$1:$E$374,5,FALSE)","v":"94-4-SMSM"},null,null,"2ème"]
[26,{"$f":"VLOOKUP($A7,Engagés!$A$1:$E$374,3,FALSE)","v":0},{"$f":"VLOOKUP($A7,Engagés!$A$1:$E$374,4,FALSE)","v":0},{"$f":"VLOOKUP($A7,Engagés!$A$1:$E$374,5,FALSE)","v":0},null,null,"4ème"]
["Si poule de 4 joueurs alors…"]
["Déroulement",null,null,"Joueurs A contre Joueur B",null,"Vainqueur","Score"]
["Match 1",null,null,{"$f":"B4","v":"CHRISTEN"},{"$f":"B7","v":0},0]
["Match 2",null,null,{"$f":"B5","v":"CETTI"},{"$f":"B6","v":"WEYER"},0]
["Finale vainqueur Match 1 contre vainqueur Match 2",null,null,{"$f":"IF(F10=\"\",\"\",F10)","v":0},{"$f":"IF(F11=\"\",\"\",F11)","v":0},0]
["Petite finale entre les deux perdants des matchs 1 et 2",null,null,null,null,0]
["Si poule de 3 joueurs alors…"]
["Déroulement",null,null,"Joueurs A contre Joueur B",null,"Vainqueur","Score"]
["Match 1",null,null,{"$f":"B4","v":"CHRISTEN"},{"$f":"B6","v":"WEYER"},"CHRISTEN",null,"2023-05-11","christen 21 points"]
["Match 2",null,null,{"$f":"B5","v":"CETTI"},{"$f":"B6","v":"WEYER"},"WEYER",null,"2023-11-01","cetti 12 points"]
["Match 3",null,null,{"$f":"B4","v":"CHRISTEN"},{"$f":"B5","v":"CETTI"},"CETTI",null,"2023-11-10","weyer 16 points"]
["CLASSEMENT",null,null,null,{"$f":"A2","v":"POULE 7"}]
[null,null,"NOM",null,"PRENOM",null,"SIGLE"]
["1er",null,{"$f":"IF($G$4=\"1er\", $B$4,IF($G$5=\"1er\",$B$5,IF($G$6=\"1er\",$B$6,IF($G$7=\"1er\",$B$7,\"\"))))","v":"CHRISTEN"},null,{"$f":"IF($G$4=\"1er\", $C$4,IF($G$5=\"1er\",$C$5,IF($G$6=\"1er\",$C$6,IF($G$7=\"1er\",$C$7,\"\"))))","v":"NEVA"},null,{"$f":"IF($G$4=\"1er\", $D$4,IF($G$5=\"1er\",$D$5,IF($G$6=\"1er\",$D$6,IF($G$7=\"1er\",$D$7,\"\"))))","v":"75-4-BNDP"}]
["2ème",null,{"$f":"IF($G$4=\"2ème\", $B$4,IF($G$5=\"2ème\",$B$5,IF($G$6=\"2ème\",$B$6,IF($G$7=\"2ème\",$B$7,\"\"))))","v":"WEYER"},null,{"$f":"IF($G$4=\"2ème\", $C$4,IF($G$5=\"2ème\",$C$5,IF($G$6=\"2ème\",$C$6,IF($G$7=\"2ème\",$C$7,\"\"))))","v":"MAXINE"},null,{"$f":"IF($G$4=\"2ème\", $D$4,IF($G$5=\"2ème\",$D$5,IF($G$6=\"2ème\",$D$6,IF($G$7=\"2ème\",$D$7,\"\"))))","v":"94-4-SMSM"}]
["3ème",null,{"$f":"IF($G$4=\"3ème\", $B$4,IF($G$5=\"3ème\",$B$5,IF($G$6=\"3ème\",$B$6,IF($G$7=\"3ème\",$B$7,\"\"))))","v":"CETTI"},null,{"$f":"IF($G$4=\"3ème\", $C$4,IF($G$5=\"3ème\",$C$5,IF($G$6=\"3ème\",$C$6,IF($G$7=\"3ème\",$C$7,\"\"))))","v":"AMELIE"},null,{"$f":"IF($G$4=\"3ème\", $D$4,IF($G$5=\"3ème\",$D$5,IF($G$6=\"3ème\",$D$6,IF($G$7=\"3ème\",$D$7,\"\"))))","v":"75-4-LRPA"}]
["4ème",null,{"$f":"IF($G$4=\"4ème\", $B$4,IF($G$5=\"4ème\",$B$5,IF($G$6=\"4ème\",$B$6,IF($G$7=\"4ème\",$B$7,\"\"))))","v":0},null,{"$f":"IF($G$4=\"4ème\", $C$4,IF($G$5=\"4ème\",$C$5,IF($G$6=\"4ème\",$C$6,IF($G$7=\"4ème\",$C$7,\"\"))))","v":0},null,{"$f":"IF($G$4=\"4ème\", $D$4,IF($G$5=\"4ème\",$D$5,IF($G$6=\"4ème\",$D$6,IF($G$7=\"4ème\",$D$7,\"\"))))","v":0}]

{"sheet":"Poule 8","index":8,"n_rows":24,"n_cols":7,"rows_kept":24,"cut":false,"hidden":false,"merged":[[12,0,12,2],[13,0,13,6],[0,0,0,2],[0,3,0,4],[10,0,10,2],[11,0,11,2],[1,0,1,2],[1,3,1,6],[7,0,7,6],[8,0,8,2],[8,3,8,4],[9,0,9,2],[20,0,20,1],[20,2,20,3],[20,4,20,5],[14,0,14,2],[14,3,14,4],[15,0,15,2],[18,4,18,6],[19,0,19,1],[19,2,19,3],[19,4,19,5],[16,0,16,2],[17,0,17,2],[18,0,18,3],[23,0,23,1],[23,2,23,3],[23,4,23,5],[21,0,21,1],[21,2,21,3],[21,4,21,5],[22,0,22,1],[22,2,22,3],[22,4,22,5]]}
[{"$f":"Engagés!C1","v":"BADMINTON"},null,null,{"$f":"Engagés!C3","v":0}]
["POULE 8"]
[null,"NOM","Prénom","Sigle","Vict","Def","Classement"]
[8,{"$f":"VLOOKUP($A4,Engagés!$A$1:$E$374,3,FALSE)","v":"COURTIAL"},{"$f":"VLOOKUP($A4,Engagés!$A$1:$E$374,4,FALSE)","v":"ADELE"},{"$f":"VLOOKUP($A4,Engagés!$A$1:$E$374,5,FALSE)","v":"94-4-PROV"},null,null,"1er"]
[9,{"$f":"VLOOKUP($A5,Engagés!$A$1:$E$374,3,FALSE)","v":"AUGUSTE"},{"$f":"VLOOKUP($A5,Engagés!$A$1:$E$374,4,FALSE)","v":"ELOA"},{"$f":"VLOOKUP($A5,Engagés!$A$1:$E$374,5,FALSE)","v":"75-4-STAP"},null,null,"3ème"]
[24,{"$f":"VLOOKUP($A6,Engagés!$A$1:$E$374,3,FALSE)","v":"DE MARCK "},{"$f":"VLOOKUP($A6,Engagés!$A$1:$E$374,4,FALSE)","v":"CLEMENCE"},{"$f":"VLOOKUP($A6,Engagés!$A$1:$E$374,5,FALSE)","v":"94-4-SMSM"},null,null,"2ème"]
[25,{"$f":"VLOOKUP($A7,Engagés!$A$1:$E$374,3,FALSE)","v":0},{"$f":"VLOOKUP($A7,Engagés!$A$1:$E$374,4,FALSE)","v":0},{"$f":"VLOOKUP($A7,Engagés!$A$1:$E$374,5,FALSE)","v":0},null,null,"4ème"]
["Si poule de 4 joueurs alors…"]
["Déroulement",null,null,"Joueurs A contre Joueur B",null,"Vainqueur","Score"]
["Match 1",null,null,{"$f":"B4","v":"COURTIAL"},{"$f":"B7","v":0}]
["Match 2",null,null,{"$f":"B5","v":"AUGUSTE"},{"$f":"B6","v":"DE MARCK "}]
["Finale vainqueur Match 1 contre vainqueur Match 2",null,null,{"$f":"IF(F10=\"\",\"\",F10)","v":""},{"$f":"IF(F11=\"\",\"\",F11)","v":""}]
["Petite finale entre les deux perdants des matchs 1 et 2"]
["Si poule de 3 joueurs alors…"]
["Déroulement",null,null,"Joueurs A contre Joueur B",null,"Vainqueur","Score"]
["Match 1",null,null,{"$f":"B4","v":"COURTIAL"},{"$f":"B6","v":"DE MARCK "},"COURTIAL"]
["Match 2",null,null,{"$f":"B5","v":"AUGUSTE"},{"$f":"B6","v":"DE MARCK "},"DE MARCK "]
["Match 3",null,null,{"$f":"B4","v":"COURTIAL"},{"$f":"B5","v":"AUGUSTE"},"COURTIAL"]
["CLASSEMENT",null,null,null,{"$f":"A2","v":"POULE 8"}]
[null,null,"NOM",null,"PRENOM",null,"SIGLE"]
["1er",null,{"$f":"IF($G$4=\"1er\", $B$4,IF($G$5=\"1er\",$B$5,IF($G$6=\"1er\",$B$6,IF($G$7=\"1er\",$B$7,\"\"))))","v":"COURTIAL"},null,{"$f":"IF($G$4=\"1er\", $C$4,IF($G$5=\"1er\",$C$5,IF($G$6=\"1er\",$C$6,IF($G$7=\"1er\",$C$7,\"\"))))","v":"ADELE"},null,{"$f":"IF($G$4=\"1er\", $D$4,IF($G$5=\"1er\",$D$5,IF($G$6=\"1er\",$D$6,IF($G$7=\"1er\",$D$7,\"\"))))","v":"94-4-PROV"}]
["2ème",null,{"$f":"IF($G$4=\"2ème\", $B$4,IF($G$5=\"2ème\",$B$5,IF($G$6=\"2ème\",$B$6,IF($G$7=\"2ème\",$B$7,\"\"))))","v":"DE MARCK "},null,{"$f":"IF($G$4=\"2ème\", $C$4,IF($G$5=\"2ème\",$C$5,IF($G$6=\"2ème\",$C$6,IF($G$7=\"2ème\",$C$7,\"\"))))","v":"CLEMENCE"},null,{"$f":"IF($G$4=\"2ème\", $D$4,IF($G$5=\"2ème\",$D$5,IF($G$6=\"2ème\",$D$6,IF($G$7=\"2ème\",$D$7,\"\"))))","v":"94-4-SMSM"}]
["3ème",null,{"$f":"IF($G$4=\"3ème\", $B$4,IF($G$5=\"3ème\",$B$5,IF($G$6=\"3ème\",$B$6,IF($G$7=\"3ème\",$B$7,\"\"))))","v":"AUGUSTE"},null,{"$f":"IF($G$4=\"3ème\", $C$4,IF($G$5=\"3ème\",$C$5,IF($G$6=\"3ème\",$C$6,IF($G$7=\"3ème\",$C$7,\"\"))))","v":"ELOA"},null,{"$f":"IF($G$4=\"3ème\", $D$4,IF($G$5=\"3ème\",$D$5,IF($G$6=\"3ème\",$D$6,IF($G$7=\"3ème\",$D$7,\"\"))))","v":"75-4-STAP"}]
["4ème",null,{"$f":"IF($G$4=\"4ème\", $B$4,IF($G$5=\"4ème\",$B$5,IF($G$6=\"4ème\",$B$6,IF($G$7=\"4ème\",$B$7,\"\"))))","v":0},null,{"$f":"IF($G$4=\"4ème\", $C$4,IF($G$5=\"4ème\",$C$5,IF($G$6=\"4ème\",$C$6,IF($G$7=\"4ème\",$C$7,\"\"))))","v":0},null,{"$f":"IF($G$4=\"4ème\", $D$4,IF($G$5=\"4ème\",$D$5,IF($G$6=\"4ème\",$D$6,IF($G$7=\"4ème\",$D$7,\"\"))))","v":0}]

{"sheet":"Résultats de poule","index":9,"n_rows":10,"n_cols":16,"rows_kept":10,"cut":false,"hidden":false,"merged":[[0,0,0,3],[0,4,0,7],[0,8,0,11],[0,12,0,15],[5,0,5,3],[5,4,5,7],[5,8,5,11],[5,12,5,15]]}
["Poule 1",null,null,null,"Poule 2",null,null,null,"Poule 3",null,null,null,"Poule 4"]
["1er",{"$f":"'Poule 1'!$C21","v":"SMEETS"},{"$f":"'Poule 1'!$E21","v":"MARTA"},{"$f":"'Poule 1'!$G21","v":"75-4-LRPA"},"1er",{"$f":"'Poule 2'!$C21","v":"COFFINIER"},{"$f":"'Poule 2'!$E21","v":"NOUR"},{"$f":"'Poule 2'!$G21","v":"75-4-LRPA"},"1er",{"$f":"'Poule 3'!$C21","v":"KRZEWSKI"},{"$f":"'Poule 3'!$E21","v":"AMBRE"},{"$f":"'Poule 3'!$G21","v":"94-4-ADMN"},"1er",{"$f":"'Poule 4'!$C21","v":"PAUGAM"},{"$f":"'Poule 4'!$E21","v":"AMBRE"},{"$f":"'Poule 4'!$G21","v":"75-4-LRPA"}]
["2ème",{"$f":"'Poule 1'!$C22","v":"D'ALENCON"},{"$f":"'Poule 1'!$E22","v":"EVANNA"},{"$f":"'Poule 1'!$G22","v":"75-4-STAP"},"2ème",{"$f":"'Poule 2'!$C22","v":"GAGNEUX-BISSON"},{"$f":"'Poule 2'!$E22","v":"MAY-ANN"},{"$f":"'Poule 2'!$G22","v":"75-4-STAP"},"2ème",{"$f":"'Poule 3'!$C22","v":"ZHANG"},{"$f":"'Poule 3'!$E22","v":"WENDY"},{"$f":"'Poule 3'!$G22","v":"75-4-SMPP"},"2ème",{"$f":"'Poule 4'!$C22","v":"MADAR"},{"$f":"'Poule 4'!$E22","v":"GLORIA"},{"$f":"'Poule 4'!$G22","v":"94-4-SMSM"}]
["3ème",{"$f":"'Poule 1'!$C23","v":"COLLIN"},{"$f":"'Poule 1'!$E23","v":"CHLOE"},{"$f":"'Poule 1'!$G23","v":"94-4-PROV"},"3ème",{"$f":"'Poule 2'!$C23","v":"SUN CHEN"},{"$f":"'Poule 2'!$E23","v":"CHARLOTTE"},{"$f":"'Poule 2'!$G23","v":"94-4-ADMN"},"3ème",{"$f":"'Poule 3'!$C23","v":"BENOIT J"},{"$f":"'Poule 3'!$E23","v":"JADE"},{"$f":"'Poule 3'!$G23","v":"75-4-STAP"},"3ème",{"$f":"'Poule 4'!$C23","v":"CASSIM"},{"$f":"'Poule 4'!$E23","v":"CHARLIE"},{"$f":"'Poule 4'!$G23","v":"94-4-PROV"}]
["4ème",{"$f":"'Poule 1'!$C24","v":0},{"$f":"'Poule 1'!$E24","v":0},{"$f":"'Poule 1'!$G24","v":0},"4ème",{"$f":"'Poule 2'!$C24","v":0},{"$f":"'Poule 2'!$E24","v":0},{"$f":"'Poule 2'!$G24","v":0},"4ème",{"$f":"'Poule 3'!$C24","v":0},{"$f":"'Poule 3'!$E24","v":0},{"$f":"'Poule 3'!$G24","v":0},"4ème",{"$f":"'Poule 4'!$C24","v":0},{"$f":"'Poule 4'!$E24","v":0},{"$f":"'Poule 4'!$G24","v":0}]
["Poule 5",null,null,null,"Poule 6",null,null,null,"Poule 7",null,null,null,"Poule 8"]
["1er",{"$f":"'Poule 5'!$C21","v":"DELANNOY"},{"$f":"'Poule 5'!$E21","v":"JEANNE"},{"$f":"'Poule 5'!$G21","v":"94-4-SMSM"},"1er",{"$f":"'Poule 6'!$C21","v":"LI"},{"$f":"'Poule 6'!$E21","v":"SOPHIA"},{"$f":"'Poule 6'!$G21","v":"94-4-SMSM"},"1er",{"$f":"'Poule 7'!$C21","v":"CHRISTEN"},{"$f":"'Poule 7'!$E21","v":"NEVA"},{"$f":"'Poule 7'!$G21","v":"75-4-BNDP"},"1er",{"$f":"'Poule 8'!$C21","v":"COURTIAL"},{"$f":"'Poule 8'!$E21","v":"ADELE"},{"$f":"'Poule 8'!$G21","v":"94-4-PROV"}]
["2ème",{"$f":"'Poule 5'!$C22","v":"MONNIER"},{"$f":"'Poule 5'!$E22","v":"MARGUERITE"},{"$f":"'Poule 5'!$G22","v":"75-4-LRPA"},"2ème",{"$f":"'Poule 6'!$C22","v":"DE ROMANCE"},{"$f":"'Poule 6'!$E22","v":"SIXTINE"},{"$f":"'Poule 6'!$G22","v":"75-4-LRPA"},"2ème",{"$f":"'Poule 7'!$C22","v":"WEYER"},{"$f":"'Poule 7'!$E22","v":"MAXINE"},{"$f":"'Poule 7'!$G22","v":"94-4-SMSM"},"2ème",{"$f":"'Poule 8'!$C22","v":"DE MARCK "},{"$f":"'Poule 8'!$E22","v":"CLEMENCE"},{"$f":"'Poule 8'!$G22","v":"94-4-SMSM"}]
["3ème",{"$f":"'Poule 5'!$C23","v":"BENOIT L"},{"$f":"'Poule 5'!$E23","v":"LILA"},{"$f":"'Poule 5'!$G23","v":"75-4-STAP"},"3ème",{"$f":"'Poule 6'!$C23","v":"DROGAT"},{"$f":"'Poule 6'!$E23","v":"ORIANE"},{"$f":"'Poule 6'!$G23","v":"94-4-PROV"},"3ème",{"$f":"'Poule 7'!$C23","v":"CETTI"},{"$f":"'Poule 7'!$E23","v":"AMELIE"},{"$f":"'Poule 7'!$G23","v":"75-4-LRPA"},"3ème",{"$f":"'Poule 8'!$C23","v":"AUGUSTE"},{"$f":"'Poule 8'!$E23","v":"ELOA"},{"$f":"'Poule 8'!$G23","v":"75-4-STAP"}]
["4ème",{"$f":"'Poule 5'!$C24","v":0},{"$f":"'Poule 5'!$E24","v":0},{"$f":"'Poule 5'!$G24","v":0},"4ème",{"$f":"'Poule 6'!$C24","v":0},{"$f":"'Poule 6'!$E24","v":0},{"$f":"'Poule 6'!$G24","v":0},"4ème",{"$f":"'Poule 7'!$C24","v":0},{"$f":"'Poule 7'!$E24","v":0},{"$f":"'Poule 7'!$G24","v":0},"4ème",{"$f":"'Poule 8'!$C24","v":0},{"$f":"'Poule 8'!$E24","v":0},{"$f":"'Poule 8'!$G24","v":0}]

{"sheet":"Tableau","index":10,"n_rows":92,"n_cols":34,"rows_kept":92,"cut":false,"hidden":false,"merged":[[8,10,8,11],[50,20,50,21],[16,10,16,11],[23,10,23,11],[33,10,33,11],[40,10,40,11],[48,10,48,11],[10,20,10,21],[30,32,30,33],[0,16,0,19],[15,29,15,30],[0,0,0,14],[31,29,31,30],[10,1,10,2],[1,4,1,5],[0,20,0,33],[16,26,16,27],[23,23,23,24],[3,20,3,21],[18,20,18,21],[29,4,29,5],[25,20,25,21],[1,10,1,11],[9,23,9,24],[55,10,55,11],[33,4,33,5],[42,1,42,2],[59,29,59,30],[55,23,55,24],[47,29,47,30],[35,20,35,21],[42,20,42,21],[41,23,41,24],[48,26,48,27],[57,20,57,21]]}
["REPECHAGES ET MATCHS DE CLASSEMENT",null,null,null,null,null,null,null,null,null,null,null,null,null,null,null,"1er tour de tableau",null,null,null,"TABLEAU PRINCIPAL"]
[]
[]
[null,null,null,null,null,null,null,null,null,null,null,null,null,null,null,null,"1er poule 1",{"$f":"'Résultats de poule'!B2","v":"SMEETS"},{"$f":"'Résultats de poule'!D2","v":"75-4-LRPA"},"V","1/8 de finale 1"]
[null,null,null,null,null,null,null,null,null,null,null,null,"P",{"$f":"IF(T4=\"\",\"\",IF(T4=\"p\",S4,S5))","v":0},{"$f":"IF(T4=\"\",\"\",IF(T4=\"p\",R4,R5))","v":0},null,"4ème poule 8",{"$f":"'Résultats de poule'!N10","v":0},{"$f":"'Résultats de poule'!P10","v":0},"P",{"$f":"IF(T4=\"\",\"\",IF(T4=\"v\",R4,R5))","v":"SMEETS"},{"$f":"IF(T4=\"\",\"\",IF(T4=\"v\",S4,S5))","v":"75-4-LRPA"},"P"]
[null,null,null,null,null,null,null,null,null,"P",{"$f":"IF(M5=\"\",\"\",IF(M5=\"v\",N5,N7))","v":"75-4-STAP"},{"$f":"IF(M5=\"\",\"\",IF(M5=\"v\",O5,O7))","v":"BENOIT J"},null,null,null,null,null,null,null,null,null,null,null,{"$f":"IF(W5=\"\",\"\",IF(W5=\"v\",U5,U7))","v":"DE ROMANCE"},{"$f":"IF(W5=\"\",\"\",IF(W5=\"v\",V5,V7))","v":"75-4-LRPA"},"V"]
[null,null,null,null,null,null,null,null,null,null,null,null,"V",{"$f":"IF(T7=\"\",\"\",IF(T7=\"p\",S7,S8))","v":"75-4-STAP"},{"$f":"IF(T7=\"\",\"\",IF(T7=\"p\",R7,R8))","v":"BENOIT J"},null,"3ème poule 3",{"$f":"'Résultats de poule'!J4","v":"BENOIT J"},{"$f":"'Résultats de poule'!L4","v":"75-4-STAP"},"P",{"$f":"IF(T7=\"\",\"\",IF(T7=\"v\",R7,R8))","v":"DE ROMANCE"},{"$f":"IF(T7=\"\",\"\",IF(T7=\"v\",S7,S8))","v":"75-4-LRPA"},"V"]
[null,null,null,null,null,null,null,null,null,null,null,null,null,null,null,null,"2ème poule 6",{"$f":"'Résultats de poule'!F8","v":"DE ROMANCE"},{"$f":"'Résultats de poule'!H8","v":"75-4-LRPA"},"V"]
[null,null,null,null,null,null,"P",{"$f":"IF(J6=\"\",\"\",IF(J6=\"v\",K6,K13))","v":"75-4-STAP"},{"$f":"IF(J6=\"\",\"\",IF(J6=\"v\",L6,L13))","v":"BENOIT L"}]
[null,null,null,null,null,null,null,null,null,null,null,null,null,null,null,null,null,null,null,null,null,null,null,"1/4 finale 1",null,null,{"$f":"IF(Z6=\"\",\"\",IF(Z6=\"v\",X6,X13))","v":"DE ROMANCE"},{"$f":"IF(Z6=\"\",\"\",IF(Z6=\"v\",Y6,Y13))","v":"75-4-LRPA"},"P"]
[null,null,null,null,null,null,null,null,null,null,null,null,null,null,null,null,"2ème poule 4",{"$f":"'Résultats de poule'!N3","v":"MADAR"},{"$f":"'Résultats de poule'!P3","v":"94-4-SMSM"},"V","1/8 de finale 2"]
[null,null,null,null,null,null,null,null,null,null,null,null,"V",{"$f":"IF(T11=\"\",\"\",IF(T11=\"p\",S11,S12))","v":"75-4-STAP"},{"$f":"IF(T11=\"\",\"\",IF(T11=\"p\",R11,R12))","v":"BENOIT L"},null,"3ème poule 5",{"$f":"'Résultats de poule'!B9","v":"BENOIT L"},{"$f":"'Résultats de poule'!D9","v":"75-4-STAP"},"P",{"$f":"IF(T11=\"\",\"\",IF(T11=\"v\",R11,R12))","v":"MADAR"},{"$f":"IF(T11=\"\",\"\",IF(T11=\"v\",S11,S12))","v":"94-4-SMSM"},"P"]
[null,null,null,null,null,null,null,null,null,"V",{"$f":"IF(M12=\"\",\"\",IF(M12=\"v\",N12,N14))","v":"75-4-STAP"},{"$f":"IF(M12=\"\",\"\",IF(M12=\"v\",O12,O14))","v":"BENOIT L"},null,null,null,null,null,null,null,null,null,null,null,{"$f":"IF(W12=\"\",\"\",IF(W12=\"v\",U12,U14))","v":"CHRISTEN"},{"$f":"IF(W12=\"\",\"\",IF(W12=\"v\",V12,V14))","v":"75-4-BNDP"},"P"]
[null,null,null,null,null,null,null,null,null,null,null,null,"P",{"$f":"IF(T14=\"\",\"\",IF(T14=\"p\",S14,S15))","v":0},{"$f":"IF(T14=\"\",\"\",IF(T14=\"p\",R14,R15))","v":0},null,"4ème poule 2",{"$f":"'Résultats de poule'!F5","v":0},{"$f":"'Résultats de poule'!H5","v":0},"P",{"$f":"IF(T14=\"\",\"\",IF(T14=\"v\",R14,R15))","v":"CHRISTEN"},{"$f":"IF(T14=\"\",\"\",IF(T14=\"v\",S14,S15))","v":"75-4-BNDP"},"V"]
[null,null,null,null,null,null,null,null,null,null,null,null,null,null,null,null,"1er poule 7",{"$f":"'Résultats de poule'!J7","v":"CHRISTEN"},{"$f":"'Résultats de poule'!L7","v":"75-4-BNDP"},"V"]
[null,null,null,"V",{"$f":"IF(G9=\"\",\"\",IF(G9=\"v\",H9,H24))","v":"94-4-ADMN"},{"$f":"IF(G9=\"\",\"\",IF(G9=\"v\",I9,I24))","v":"SUN CHEN"}]
[null,null,null,null,null,null,null,null,null,null,null,null,null,null,null,null,null,null,null,null,null,null,null,null,null,null,"1/2 finale A",null,null,{"$f":"IF(AC10=\"\",\"\",IF(AC10=\"v\",AA10,AA24))","v":"LI"},{"$f":"IF(AC10=\"\",\"\",IF(AC10=\"v\",AB10,AB24))","v":"94-4-SMSM"},"V"]
[]
[null,null,null,null,null,null,null,null,null,null,null,null,null,null,null,null,"1er poule 6",{"$f":"'Résultats de poule'!F7","v":"LI"},{"$f":"'Résultats de poule'!H7","v":"94-4-SMSM"},"V","1/8 de finale 3"]
[null,null,null,null,null,null,null,null,null,null,null,null,"P",{"$f":"IF(T19=\"\",\"\",IF(T19=\"p\",S19,S20))","v":0},{"$f":"IF(T19=\"\",\"\",IF(T19=\"p\",R19,R20))","v":0},null,"4ème poule 3",{"$f":"'Résultats de poule'!J5","v":0},{"$f":"'Résultats de poule'!L5","v":0},"P",{"$f":"IF(T19=\"\",\"\",IF(T19=\"v\",R19,R20))","v":"LI"},{"$f":"IF(T19=\"\",\"\",IF(T19=\"v\",S19,S20))","v":"94-4-SMSM"},"V"]
[null,null,null,null,null,null,null,null,null,"P",{"$f":"IF(M20=\"\",\"\",IF(M20=\"v\",N20,N22))","v":"75-4-STAP"},{"$f":"IF(M20=\"\",\"\",IF(M20=\"v\",O20,O22))","v":"AUGUSTE"},null,null,null,null,null,null,null,null,null,null,null,{"$f":"IF(W20=\"\",\"\",IF(W20=\"v\",U20,U22))","v":"LI"},{"$f":"IF(W20=\"\",\"\",IF(W20=\"v\",V20,V22))","v":"94-4-SMSM"},"V"]
[null,null,null,null,null,null,null,null,null,null,null,null,"V",{"$f":"IF(T22=\"\",\"\",IF(T22=\"p\",S22,S23))","v":"75-4-STAP"},{"$f":"IF(T22=\"\",\"\",IF(T22=\"p\",R22,R23))","v":"AUGUSTE"},null,"3ème poule 8",{"$f":"'Résultats de poule'!N9","v":"AUGUSTE"},{"$f":"'Résultats de poule'!P9","v":"75-4-STAP"},"P",{"$f":"IF(T22=\"\",\"\",IF(T22=\"v\",R22,R23))","v":"D'ALENCON"},{"$f":"IF(T22=\"\",\"\",IF(T22=\"v\",S22,S23))","v":"75-4-STAP"},"P"]
[null,null,null,null,null,null,null,null,null,null,null,null,null,null,null,null,"2ème poule 1",{"$f":"'Résultats de poule'!B3","v":"D'ALENCON"},{"$f":"'Résultats de poule'!D3","v":"75-4-STAP"},"V"]
[null,null,null,null,null,null,"V",{"$f":"IF(J21=\"\",\"\",IF(J21=\"v\",K21,K28))","v":"94-4-ADMN"},{"$f":"IF(J21=\"\",\"\",IF(J21=\"v\",L21,L28))","v":"SUN CHEN"},null,null,null,null,null,null,null,null,null,null,null,null,null,null,"1/4 finale 2",null,null,{"$f":"IF(Z21=\"\",\"\",IF(Z21=\"v\",X21,X28))","v":"LI"},{"$f":"IF(Z21=\"\",\"\",IF(Z21=\"v\",Y21,Y28))","v":"94-4-SMSM"},"V"]
[]
[null,null,null,null,null,null,null,null,null,null,null,null,null,null,null,null,"2ème poule 7",{"$f":"'Résultats de poule'!J8","v":"WEYER"},{"$f":"'Résultats de poule'!L8","v":"94-4-SMSM"},"V","1/8 de finale 4"]
[null,null,null,null,null,null,null,null,null,null,null,null,"V",{"$f":"IF(T26=\"\",\"\",IF(T26=\"p\",S26,S27))","v":"94-4-ADMN"},{"$f":"IF(T26=\"\",\"\",IF(T26=\"p\",R26,R27))","v":"SUN CHEN"},null,"3ème poule 2",{"$f":"'Résultats de poule'!F4","v":"SUN CHEN"},{"$f":"'Résultats de poule'!H4","v":"94-4-ADMN"},"P",{"$f":"IF(T26=\"\",\"\",IF(T26=\"v\",R26,R27))","v":"WEYER"},{"$f":"IF(T26=\"\",\"\",IF(T26=\"v\",S26,S27))","v":"94-4-SMSM"},"V"]
[null,null,null,null,null,null,null,null,null,"V",{"$f":"IF(M27=\"\",\"\",IF(M27=\"v\",N27,N29))","v":"94-4-ADMN"},{"$f":"IF(M27=\"\",\"\",IF(M27=\"v\",O27,O29))","v":"SUN CHEN"},null,null,null,null,null,null,null,null,null,null,null,{"$f":"IF(W27=\"\",\"\",IF(W27=\"v\",U27,U29))","v":"WEYER"},{"$f":"IF(W27=\"\",\"\",IF(W27=\"v\",V27,V29))","v":"94-4-SMSM"},"P"]
[null,null,null,null,null,null,null,null,null,null,null,null,"P",{"$f":"IF(T29=\"\",\"\",IF(T29=\"p\",S29,S30))","v":0},{"$f":"IF(T29=\"\",\"\",IF(T29=\"p\",R29,R30))","v":0},null,"4ème poule 5",{"$f":"'Résultats de poule'!B10","v":0},{"$f":"'Résultats de poule'!D10","v":0},"P",{"$f":"IF(T29=\"\",\"\",IF(T29=\"v\",R29,R30))","v":"PAUGAM"},{"$f":"IF(T29=\"\",\"\",IF(T29=\"v\",S29,S30))","v":"75-4-LRPA"},"P"]
[null,null,null,null,null,null,null,null,null,null,null,null,null,null,null,null,"1er poule 4",{"$f":"'Résultats de poule'!N2","v":"PAUGAM"},{"$f":"'Résultats de poule'!P2","v":"75-4-LRPA"},"V"]
[null,"17ème",null,null,null,null,null,null,null,null,null,null,null,null,null,null,null,null,null,null,null,null,null,null,null,null,null,null,null,null,null,null,"VAINQUEUR"]
[null,{"$f":"IF(D16=\"\",\"\",IF(D16=\"v\",E16,E48))","v":"94-4-ADMN"},{"$f":"IF(D16=\"\",\"\",IF(D16=\"v\",F16,F48))","v":"SUN CHEN"},null,null,null,null,null,null,null,null,null,null,null,null,null,null,null,null,null,null,null,null,null,null,null,null,null,null,"FINALE",null,null,{"$f":"IF(AF17=\"\",\"\",IF(AF17=\"v\",AD17,AD49))","v":"LI"},{"$f":"IF(AF17=\"\",\"\",IF(AF17=\"v\",AE17,AE49))","v":"94-4-SMSM"}]
[]
[]
[]
[null,null,null,null,null,null,null,null,null,null,null,null,null,null,null,null,"1er poule 3",{"$f":"'Résultats de poule'!J2","v":"KRZEWSKI"},{"$f":"'Résultats de poule'!L2","v":"94-4-ADMN"},"V","1/8 de finale 5"]
[null,null,null,null,null,null,null,null,null,null,null,null,"P",{"$f":"IF(T36=\"\",\"\",IF(T36=\"p\",S36,S37))","v":0},{"$f":"IF(T36=\"\",\"\",IF(T36=\"p\",R36,R37))","v":0},null,"4ème poule 6",{"$f":"'Résultats de poule'!F10","v":0},{"$f":"'Résultats de poule'!H10","v":0},"P",{"$f":"IF(T36=\"\",\"\",IF(T36=\"v\",R36,R37))","v":"KRZEWSKI"},{"$f":"IF(T36=\"\",\"\",IF(T36=\"v\",S36,S37))","v":"94-4-ADMN"},"P"]
[null,null,null,null,null,null,null,null,null,"P",{"$f":"IF(M37=\"\",\"\",IF(M37=\"v\",N37,N39))","v":"94-4-PROV"},{"$f":"IF(M37=\"\",\"\",IF(M37=\"v\",O37,O39))","v":"COLLIN"},null,null,null,null,null,null,null,null,null,null,null,{"$f":"IF(W37=\"\",\"\",IF(W37=\"v\",U37,U39))","v":"DE MARCK "},{"$f":"IF(W37=\"\",\"\",IF(W37=\"v\",V37,V39))","v":"94-4-SMSM"},"P"]
[null,null,null,null,null,null,null,null,null,null,null,null,"V",{"$f":"IF(T39=\"\",\"\",IF(T39=\"p\",S39,S40))","v":"94-4-PROV"},{"$f":"IF(T39=\"\",\"\",IF(T39=\"p\",R39,R40))","v":"COLLIN"},null,"3ème poule 1",{"$f":"'Résultats de poule'!B4","v":"COLLIN"},{"$f":"'Résultats de poule'!D4","v":"94-4-PROV"},"P",{"$f":"IF(T39=\"\",\"\",IF(T39=\"v\",R39,R40))","v":"DE MARCK "},{"$f":"IF(T39=\"\",\"\",IF(T39=\"v\",S39,S40))","v":"94-4-SMSM"},"V"]
[null,null,null,null,null,null,null,null,null,null,null,null,null,null,null,null,"2ème poule 8",{"$f":"'Résultats de poule'!N8","v":"DE MARCK "},{"$f":"'Résultats de poule'!P8","v":"94-4-SMSM"},"V"]
[null,null,null,null,null,null,"V",{"$f":"IF(J38=\"\",\"\",IF(J38=\"v\",K38,K45))","v":"75-4-LRPA"},{"$f":"IF(J38=\"\",\"\",IF(J38=\"v\",L38,L45))","v":"CETTI"}]
[null,null,null,null,null,null,null,null,null,null,null,null,null,null,null,null,null,null,null,null,null,null,null,"1/4 finale 3",null,null,{"$f":"IF(Z38=\"\",\"\",IF(Z38=\"v\",X38,X45))","v":"DELANNOY"},{"$f":"IF(Z38=\"\",\"\",IF(Z38=\"v\",Y38,Y45))","v":"94-4-SMSM"},"V"]
[null,null,null,null,null,null,null,null,null,null,null,null,null,null,null,null,"2ème poule 2",{"$f":"'Résultats de poule'!F3","v":"GAGNEUX-BISSON"},{"$f":"'Résultats de poule'!H3","v":"75-4-STAP"},"V","1/8 de finale 6"]
[null,null,null,null,null,null,null,null,null,null,null,null,"V",{"$f":"IF(T43=\"\",\"\",IF(T43=\"p\",S43,S44))","v":"75-4-LRPA"},{"$f":"IF(T43=\"\",\"\",IF(T43=\"p\",R43,R44))","v":"CETTI"},null,"3ème poule 7",{"$f":"'Résultats de poule'!J9","v":"CETTI"},{"$f":"'Résultats de poule'!L9","v":"75-4-LRPA"},"P",{"$f":"IF(T43=\"\",\"\",IF(T43=\"v\",R43,R44))","v":"GAGNEUX-BISSON"},{"$f":"IF(T43=\"\",\"\",IF(T43=\"v\",S43,S44))","v":"75-4-STAP"},"P"]
[null,null,null,null,null,null,null,null,null,"V",{"$f":"IF(M44=\"\",\"\",IF(M44=\"v\",N44,N46))","v":"75-4-LRPA"},{"$f":"IF(M44=\"\",\"\",IF(M44=\"v\",O44,O46))","v":"CETTI"},null,null,null,null,null,null,null,null,null,null,null,{"$f":"IF(W44=\"\",\"\",IF(W44=\"v\",U44,U46))","v":"DELANNOY"},{"$f":"IF(W44=\"\",\"\",IF(W44=\"v\",V44,V46))","v":"94-4-SMSM"},"V"]
[null,null,null,null,null,null,null,null,null,null,null,null,"P",{"$f":"IF(T46=\"\",\"\",IF(T46=\"p\",S46,S47))","v":0},{"$f":"IF(T46=\"\",\"\",IF(T46=\"p\",R46,R47))","v":0},null,"4ème poule 4",{"$f":"'Résultats de poule'!N5","v":0},{"$f":"'Résultats de poule'!P5","v":0},"P",{"$f":"IF(T46=\"\",\"\",IF(T46=\"v\",R46,R47))","v":"DELANNOY"},{"$f":"IF(T46=\"\",\"\",IF(T46=\"v\",S46,S47))","v":"94-4-SMSM"},"V"]
[null,null,null,null,null,null,null,null,null,null,null,null,null,null,null,null,"1er poule 5",{"$f":"'Résultats de poule'!B7","v":"DELANNOY"},{"$f":"'Résultats de poule'!D7","v":"94-4-SMSM"},"V"]
[null,null,null,"P",{"$f":"IF(G41=\"\",\"\",IF(G41=\"v\",H41,H56))","v":"75-4-LRPA"},{"$f":"IF(G41=\"\",\"\",IF(G41=\"v\",I41,I56))","v":"CETTI"}]
[null,null,null,null,null,null,null,null,null,null,null,null,null,null,null,null,null,null,null,null,null,null,null,null,null,null,"1/2 finale B",null,null,{"$f":"IF(AC42=\"\",\"\",IF(AC42=\"v\",AA42,AA56))","v":"DELANNOY"},{"$f":"IF(AC42=\"\",\"\",IF(AC42=\"v\",AB42,AB56))","v":"94-4-SMSM"},"P"]
[]
[null,null,null,null,null,null,null,null,null,null,null,null,null,null,null,null,"1er poule 8",{"$f":"'Résultats de poule'!N7","v":"COURTIAL"},{"$f":"'Résultats de poule'!P7","v":"94-4-PROV"},"V","1/8 de finale 7"]
[null,null,null,null,null,null,null,null,null,null,null,null,"P",{"$f":"IF(T51=\"\",\"\",IF(T51=\"p\",S51,S52))","v":0},{"$f":"IF(T51=\"\",\"\",IF(T51=\"p\",R51,R52))","v":0},null,"4ème poule 1",{"$f":"'Résultats de poule'!B5","v":0},{"$f":"'Résultats de poule'!D5","v":0},"P",{"$f":"IF(T51=\"\",\"\",IF(T51=\"v\",R51,R52))","v":"COURTIAL"},{"$f":"IF(T51=\"\",\"\",IF(T51=\"v\",S51,S52))","v":"94-4-PROV"},"P"]
[null,null,null,null,null,null,null,null,null,"P",{"$f":"IF(M52=\"\",\"\",IF(M52=\"v\",N52,N54))","v":"75-4-SMPP"},{"$f":"IF(M52=\"\",\"\",IF(M52=\"v\",O52,O54))","v":"ZHANG"},null,null,null,null,null,null,null,null,null,null,null,{"$f":"IF(W52=\"\",\"\",IF(W52=\"v\",U52,U54))","v":"DROGAT"},{"$f":"IF(W52=\"\",\"\",IF(W52=\"v\",V52,V54))","v":"94-4-PROV"},"V"]
[null,null,null,null,null,null,null,null,null,null,null,null,"V",{"$f":"IF(T54=\"\",\"\",IF(T54=\"p\",S54,S55))","v":"75-4-SMPP"},{"$f":"IF(T54=\"\",\"\",IF(T54=\"p\",R54,R55))","v":"ZHANG"},null,"3ème poule 6",{"$f":"'Résultats de poule'!F9","v":"DROGAT"},{"$f":"'Résultats de poule'!H9","v":"94-4-PROV"},"V",{"$f":"IF(T54=\"\",\"\",IF(T54=\"v\",R54,R55))","v":"DROGAT"},{"$f":"IF(T54=\"\",\"\",IF(T54=\"v\",S54,S55))","v":"94-4-PROV"},"V"]
[null,null,null,null,null,null,null,null,null,null,null,null,null,null,null,null,"2ème poule 3",{"$f":"'Résultats de poule'!J3","v":"ZHANG"},{"$f":"'Résultats de poule'!L3","v":"75-4-SMPP"},"P"]
[null,null,null,null,null,null,"P",{"$f":"IF(J53=\"\",\"\",IF(J53=\"v\",K53,K60))","v":"94-4-PROV"},{"$f":"IF(J53=\"\",\"\",IF(J53=\"v\",L53,L60))","v":"CASSIM"},null,null,null,null,null,null,null,null,null,null,null,null,null,null,"1/4 finale 4",null,null,{"$f":"IF(Z53=\"\",\"\",IF(Z53=\"v\",X53,X60))","v":"DROGAT"},{"$f":"IF(Z53=\"\",\"\",IF(Z53=\"v\",Y53,Y60))","v":"94-4-PROV"},"P"]
[]
[null,null,null,null,null,null,null,null,null,null,null,null,null,null,null,null,"2ème poule 5",{"$f":"'Résultats de poule'!B8","v":"MONNIER"},{"$f":"'Résultats de poule'!D8","v":"75-4-LRPA"},"V","1/8 de finale 8"]
[null,null,null,null,null,null,null,null,null,null,null,null,"V",{"$f":"IF(T58=\"\",\"\",IF(T58=\"p\",S58,S59))","v":"94-4-PROV"},{"$f":"IF(T58=\"\",\"\",IF(T58=\"p\",R58,R59))","v":"CASSIM"},null,"3ème poule 4",{"$f":"'Résultats de poule'!N4","v":"CASSIM"},{"$f":"'Résultats de poule'!P4","v":"94-4-PROV"},"P",{"$f":"IF(T58=\"\",\"\",IF(T58=\"v\",R58,R59))","v":"MONNIER"},{"$f":"IF(T58=\"\",\"\",IF(T58=\"v\",S58,S59))","v":"75-4-LRPA"},"P"]
[null,"19ème",null,"V",{"$f":"IF(G9=\"\",\"\",IF(G9=\"p\",H9,H24))","v":"75-4-STAP"},{"$f":"IF(G9=\"\",\"\",IF(G9=\"p\",I9,I24))","v":"BENOIT L"},null,null,null,"V",{"$f":"IF(M59=\"\",\"\",IF(M59=\"v\",N59,N61))","v":"94-4-PROV"},{"$f":"IF(M59=\"\",\"\",IF(M59=\"v\",O59,O61))","v":"CASSIM"},null,null,null,null,null,null,null,null,null,null,null,{"$f":"IF(W59=\"\",\"\",IF(W59=\"v\",U59,U61))","v":"COFFINIER"},{"$f":"IF(W59=\"\",\"\",IF(W59=\"v\",V59,V61))","v":"75-4-LRPA"},"P",null,null,null,"Place de 3ème/4ème"]
[null,{"$f":"IF(D60=\"\",\"\",IF(D60=\"v\",E60,E62))","v":"75-4-STAP"},{"$f":"IF(D60=\"\",\"\",IF(D60=\"v\",F60,F62))","v":"BENOIT L"},null,null,null,null,null,null,null,null,null,"P",{"$f":"IF(T61=\"\",\"\",IF(T61=\"p\",S61,S62))","v":0},{"$f":"IF(T61=\"\",\"\",IF(T61=\"p\",R61,R62))","v":0},null,"4ème poule 7",{"$f":"'Résultats de poule'!J10","v":0},{"$f":"'Résultats de poule'!L10","v":0},"P",{"$f":"IF(T61=\"\",\"\",IF(T61=\"v\",R61,R62))","v":"COFFINIER"},{"$f":"IF(T61=\"\",\"\",IF(T61=\"v\",S61,S62))","v":"75-4-LRPA"},"V",null,null,null,null,null,null,{"$f":"IF(AC10=\"\",\"\",IF(AC10=\"p\",AA10,AA24))","v":"DE ROMANCE"},{"$f":"IF(AC10=\"\",\"\",IF(AC10=\"p\",AB10,AB24))","v":"75-4-LRPA"},"P"]
[null,null,null,"P",{"$f":"IF(G41=\"\",\"\",IF(G41=\"p\",H41,H56))","v":"94-4-PROV"},{"$f":"IF(G41=\"\",\"\",IF(G41=\"p\",I41,I56))","v":"CASSIM"},null,null,null,null,null,null,null,null,null,null,"1er poule 2",{"$f":"'Résultats de poule'!F2","v":"COFFINIER"},{"$f":"'Résultats de poule'!H2","v":"75-4-LRPA"},"V",null,null,null,null,null,null,null,null,null,null,null,null,{"$f":"IF(AF61=\"\",\"\",IF(AF61=\"v\",AD61,AD63))","v":"DROGAT"},{"$f":"IF(AF61=\"\",\"\",IF(AF61=\"v\",AE61,AE63))","v":"94-4-PROV"}]
[null,null,null,null,null,null,null,null,null,null,null,null,null,null,null,null,null,null,null,null,null,null,null,null,null,null,null,null,null,{"$f":"IF(AC42=\"\",\"\",IF(AC42=\"p\",AA42,AA56))","v":"DROGAT"},{"$f":"IF(AC42=\"\",\"\",IF(AC42=\"p\",AB42,AB56))","v":"94-4-PROV"},"V"]
[]
[null,null,null,null,null,null,null,null,null,null,null,null,null,{"$f":"IF(M5=\"\",\"\",IF(M5=\"p\",N5,N7))","v":0},{"$f":"IF(M5=\"\",\"\",IF(M5=\"p\",O5,O7))","v":0},null,null,{"$f":"IF(W5=\"\",\"\",IF(W5=\"p\",U5,U7))","v":"SMEETS"},{"$f":"IF(W5=\"\",\"\",IF(W5=\"p\",V5,V7))","v":"75-4-LRPA"},"P"]
[null,null,null,null,null,null,null,null,null,null,{"$f":"IF(M65=\"\",\"\",IF(M65=\"v\",N65,N66))","v":""},{"$f":"IF(M65=\"\",\"\",IF(M65=\"v\",O65,O66))","v":""},null,{"$f":"IF(M12=\"\",\"\",IF(M12=\"p\",N12,N14))","v":0},{"$f":"IF(M12=\"\",\"\",IF(M12=\"p\",O12,O14))","v":0},null,null,{"$f":"IF(W12=\"\",\"\",IF(W12=\"p\",U12,U14))","v":"MADAR"},{"$f":"IF(W12=\"\",\"\",IF(W12=\"p\",V12,V14))","v":"94-4-SMSM"},"V",{"$f":"IF(T65=\"\",\"\",IF(T65=\"v\",R65,R66))","v":"MADAR"},{"$f":"IF(T65=\"\",\"\",IF(T65=\"v\",S65,S66))","v":"94-4-SMSM"},"V"]
[null,null,null,null,null,null,null,{"$f":"IF(J66=\"\",\"\",IF(J66=\"v\",K66,K68))","v":""},{"$f":"IF(J66=\"\",\"\",IF(J66=\"v\",L66,L68))","v":""},null,null,null,null,null,null,null,null,null,null,null,null,null,null,{"$f":"IF(W66=\"\",\"\",IF(W66=\"v\",U66,U68))","v":"MADAR"},{"$f":"IF(W66=\"\",\"\",IF(W66=\"v\",V66,V68))","v":"94-4-SMSM"},"V"]
[null,null,null,null,null,null,null,null,null,null,{"$f":"IF(M68=\"\",\"\",IF(M68=\"v\",N68,N69))","v":""},{"$f":"IF(M68=\"\",\"\",IF(M68=\"v\",O68,O69))","v":""},null,{"$f":"IF(M20=\"\",\"\",IF(M20=\"p\",N20,N22))","v":0},{"$f":"IF(M20=\"\",\"\",IF(M20=\"p\",O20,O22))","v":0},null,null,{"$f":"IF(W20=\"\",\"\",IF(W20=\"p\",U20,U22))","v":"D'ALENCON"},{"$f":"IF(W20=\"\",\"\",IF(W20=\"p\",V20,V22))","v":"75-4-STAP"},"P",{"$f":"IF(T68=\"\",\"\",IF(T68=\"v\",R68,R69))","v":"PAUGAM"},{"$f":"IF(T68=\"\",\"\",IF(T68=\"v\",S68,S69))","v":"75-4-LRPA"},"P"]
[null,null,null,null,"25ème",null,null,null,null,null,null,null,null,{"$f":"IF(M27=\"\",\"\",IF(M27=\"p\",N27,N29))","v":0},{"$f":"IF(M27=\"\",\"\",IF(M27=\"p\",O27,O29))","v":0},null,null,{"$f":"IF(W27=\"\",\"\",IF(W27=\"p\",U27,U29))","v":"PAUGAM"},{"$f":"IF(W27=\"\",\"\",IF(W27=\"p\",V27,V29))","v":"75-4-LRPA"},"V",null,null,null,null,null,null,null,"9ème"]
[null,null,null,null,{"$f":"IF(G67=\"\",\"\",IF(G67=\"v\",H67,H73))","v":""},{"$f":"IF(G67=\"\",\"\",IF(G67=\"v\",I67,I73))","v":""},null,null,null,null,null,null,null,null,null,null,null,null,null,null,null,null,null,null,null,null,{"$f":"IF(Z67=\"\",\"\",IF(Z67=\"v\",X67,X73))","v":"MADAR"},{"$f":"IF(Z67=\"\",\"\",IF(Z67=\"v\",Y67,Y73))","v":"94-4-SMSM"}]
[null,null,null,null,null,null,null,null,null,null,null,null,null,{"$f":"IF(M37=\"\",\"\",IF(M37=\"p\",N37,N39))","v":0},{"$f":"IF(M37=\"\",\"\",IF(M37=\"p\",O37,O39))","v":0},null,null,{"$f":"IF(W37=\"\",\"\",IF(W37=\"p\",U37,U39))","v":"KRZEWSKI"},{"$f":"IF(W37=\"\",\"\",IF(W37=\"p\",V37,V39))","v":"94-4-ADMN"},"V"]
[null,null,null,null,null,null,null,null,null,null,{"$f":"IF(M71=\"\",\"\",IF(M71=\"v\",N71,N72))","v":""},{"$f":"IF(M71=\"\",\"\",IF(M71=\"v\",O71,O72))","v":""},null,{"$f":"IF(M44=\"\",\"\",IF(M44=\"p\",N44,N46))","v":0},{"$f":"IF(M44=\"\",\"\",IF(M44=\"p\",O44,O46))","v":0},null,null,{"$f":"IF(W44=\"\",\"\",IF(W44=\"p\",U44,U46))","v":"GAGNEUX-BISSON"},{"$f":"IF(W44=\"\",\"\",IF(W44=\"p\",V44,V46))","v":"75-4-STAP"},"P",{"$f":"IF(T71=\"\",\"\",IF(T71=\"v\",R71,R72))","v":"KRZEWSKI"},{"$f":"IF(T71=\"\",\"\",IF(T71=\"v\",S71,S72))","v":"94-4-ADMN"},"P"]
[null,null,null,null,null,null,null,{"$f":"IF(J72=\"\",\"\",IF(J72=\"v\",K72,K74))","v":""},{"$f":"IF(J72=\"\",\"\",IF(J72=\"v\",L72,L74))","v":""},null,null,null,null,null,null,null,null,null,null,null,null,null,null,{"$f":"IF(W72=\"\",\"\",IF(W72=\"v\",U72,U74))","v":"COURTIAL"},{"$f":"IF(W72=\"\",\"\",IF(W72=\"v\",V72,V74))","v":"94-4-PROV"},"P"]
[null,null,null,null,null,null,null,null,null,null,{"$f":"IF(M74=\"\",\"\",IF(M74=\"v\",N74,N75))","v":""},{"$f":"IF(M74=\"\",\"\",IF(M74=\"v\",O74,O75))","v":""},null,{"$f":"IF(M52=\"\",\"\",IF(M52=\"p\",N52,N54))","v":0},{"$f":"IF(M52=\"\",\"\",IF(M52=\"p\",O52,O54))","v":0},null,null,{"$f":"IF(W52=\"\",\"\",IF(W52=\"p\",U52,U54))","v":"COURTIAL"},{"$f":"IF(W52=\"\",\"\",IF(W52=\"p\",V52,V54))","v":"94-4-PROV"},"V",{"$f":"IF(T74=\"\",\"\",IF(T74=\"v\",R74,R75))","v":"COURTIAL"},{"$f":"IF(T74=\"\",\"\",IF(T74=\"v\",S74,S75))","v":"94-4-PROV"},"V"]
[null,null,null,null,null,null,null,null,null,null,null,null,null,{"$f":"IF(M59=\"\",\"\",IF(M59=\"p\",N59,N61))","v":0},{"$f":"IF(M59=\"\",\"\",IF(M59=\"p\",O59,O61))","v":0},null,null,{"$f":"IF(W59=\"\",\"\",IF(W59=\"p\",U59,U61))","v":"MONNIER"},{"$f":"IF(W59=\"\",\"\",IF(W59=\"p\",V59,V61))","v":"75-4-LRPA"},"P",null,null,null,null,null,null,{"$f":"IF(Z6=\"\",\"\",IF(Z6=\"p\",X6,X13))","v":"CHRISTEN"},{"$f":"IF(Z6=\"\",\"\",IF(Z6=\"p\",Y6,Y13))","v":"75-4-BNDP"},"P"]
[null,null,null,null,null,null,null,null,null,null,null,null,null,null,null,null,null,null,null,null,null,null,null,null,null,null,null,null,null,{"$f":"IF(AC75=\"\",\"\",IF(AC75=\"v\",AA75,AA77))","v":"WEYER"},{"$f":"IF(AC75=\"\",\"\",IF(AC75=\"v\",AB75,AB77))","v":"94-4-SMSM"},"V"]
[null,null,null,null,null,null,null,null,null,null,null,null,null,{"$f":"IF(M65=\"\",\"\",IF(M65=\"p\",N65,N66))","v":""},{"$f":"IF(M65=\"\",\"\",IF(M65=\"p\",O65,O66))","v":""},null,null,{"$f":"IF(T65=\"\",\"\",IF(T65=\"p\",R65,R66))","v":"SMEETS"},{"$f":"IF(T65=\"\",\"\",IF(T65=\"p\",S65,S66))","v":"75-4-LRPA"},"V",null,null,null,null,null,null,{"$f":"IF(Z21=\"\",\"\",IF(Z21=\"p\",X21,X28))","v":"WEYER"},{"$f":"IF(Z21=\"\",\"\",IF(Z21=\"p\",Y21,Y28))","v":"94-4-SMSM"},"V"]
[null,null,null,null,null,null,null,"29ème",null,null,{"$f":"IF(M77=\"\",\"\",IF(M77=\"v\",N77,N78))","v":""},{"$f":"IF(M77=\"\",\"\",IF(M77=\"v\",O77,O78))","v":""},null,{"$f":"IF(M68=\"\",\"\",IF(M68=\"p\",N68,N69))","v":""},{"$f":"IF(M68=\"\",\"\",IF(M68=\"p\",O68,O69))","v":""},null,null,{"$f":"IF(T68=\"\",\"\",IF(T68=\"p\",R68,R69))","v":"D'ALENCON"},{"$f":"IF(T68=\"\",\"\",IF(T68=\"p\",S68,S69))","v":"75-4-STAP"},"P",{"$f":"IF(T77=\"\",\"\",IF(T77=\"v\",R77,R78))","v":"SMEETS"},{"$f":"IF(T77=\"\",\"\",IF(T77=\"v\",S77,S78))","v":"75-4-LRPA"},"V",null,"13ème",null,null,null,null,null,null,null,null,"5ème"]
[null,null,null,null,null,null,null,{"$f":"IF(J78=\"\",\"\",IF(J78=\"v\",K78,K80))","v":""},{"$f":"IF(J78=\"\",\"\",IF(J78=\"v\",L78,L80))","v":""},null,null,null,null,null,null,null,null,null,null,null,null,null,null,{"$f":"IF(W78=\"\",\"\",IF(W78=\"v\",U78,U80))","v":"SMEETS"},{"$f":"IF(W78=\"\",\"\",IF(W78=\"v\",V78,V80))","v":"75-4-LRPA"},null,null,null,null,null,null,null,{"$f":"IF(AF76=\"\",\"\",IF(AF76=\"v\",AD76,AD82))","v":"WEYER"},{"$f":"IF(AF76=\"\",\"\",IF(AF76=\"v\",AE76,AE82))","v":"94-4-SMSM"}]
[null,null,null,null,null,null,null,null,null,null,{"$f":"IF(M80=\"\",\"\",IF(M80=\"v\",N80,N81))","v":""},{"$f":"IF(M80=\"\",\"\",IF(M80=\"v\",O80,O81))","v":""},null,{"$f":"IF(M71=\"\",\"\",IF(M71=\"p\",N71,N72))","v":""},{"$f":"IF(M71=\"\",\"\",IF(M71=\"p\",O71,O72))","v":""},null,null,{"$f":"IF(T71=\"\",\"\",IF(T71=\"p\",R71,R72))","v":"GAGNEUX-BISSON"},{"$f":"IF(T71=\"\",\"\",IF(T71=\"p\",S71,S72))","v":"75-4-STAP"},"V",{"$f":"IF(T80=\"\",\"\",IF(T80=\"v\",R80,R81))","v":"GAGNEUX-BISSON"},{"$f":"IF(T80=\"\",\"\",IF(T80=\"v\",S80,S81))","v":"75-4-STAP"},"P"]
[null,null,null,null,null,null,null,null,null,null,null,null,null,{"$f":"IF(M74=\"\",\"\",IF(M74=\"p\",N74,N75))","v":""},{"$f":"IF(M74=\"\",\"\",IF(M74=\"p\",O74,O75))","v":""},null,null,{"$f":"IF(T74=\"\",\"\",IF(T74=\"p\",R74,R75))","v":"MONNIER"},{"$f":"IF(T74=\"\",\"\",IF(T74=\"p\",S74,S75))","v":"75-4-LRPA"},"P",null,null,null,null,null,null,{"$f":"IF(Z38=\"\",\"\",IF(Z38=\"p\",X38,X45))","v":"DE MARCK "},{"$f":"IF(Z38=\"\",\"\",IF(Z38=\"p\",Y38,Y45))","v":"94-4-SMSM"},"P"]
[null,null,null,null,null,null,null,null,null,null,"27ème",null,null,null,null,null,null,null,null,null,null,"11ème",null,null,null,null,null,null,null,{"$f":"IF(AC81=\"\",\"\",IF(AC81=\"v\",AA81,AA83))","v":"COFFINIER"},{"$f":"IF(AC81=\"\",\"\",IF(AC81=\"v\",AB81,AB83))","v":"75-4-LRPA"},"P"]
[null,null,null,null,null,null,null,null,null,null,{"$f":"IF(M83=\"\",\"\",IF(M83=\"v\",N83,N84))","v":""},{"$f":"IF(M83=\"\",\"\",IF(M83=\"v\",O83,O84))","v":""},null,{"$f":"IF(J66=\"\",\"\",IF(J66=\"p\",K66,K68))","v":""},{"$f":"IF(J66=\"\",\"\",IF(J66=\"p\",L66,L68))","v":""},null,null,{"$f":"IF(W66=\"\",\"\",IF(W66=\"p\",U66,U68))","v":"PAUGAM"},{"$f":"IF(W66=\"\",\"\",IF(W66=\"p\",V66,V68))","v":"75-4-LRPA"},"V",{"$f":"IF(T83=\"\",\"\",IF(T83=\"v\",R83,R84))","v":"PAUGAM"},{"$f":"IF(T83=\"\",\"\",IF(T83=\"v\",S83,S84))","v":"75-4-LRPA"},null,null,null,null,{"$f":"IF(Z53=\"\",\"\",IF(Z53=\"p\",X53,X60))","v":"COFFINIER"},{"$f":"IF(Z53=\"\",\"\",IF(Z53=\"p\",Y53,Y60))","v":"75-4-LRPA"},"V"]
[null,null,null,null,null,null,null,null,null,null,null,null,null,{"$f":"IF(J72=\"\",\"\",IF(J72=\"p\",K72,K74))","v":""},{"$f":"IF(J72=\"\",\"\",IF(J72=\"p\",L72,L74))","v":""},null,null,{"$f":"IF(W72=\"\",\"\",IF(W72=\"p\",U72,U74))","v":"KRZEWSKI"},{"$f":"IF(W72=\"\",\"\",IF(W72=\"p\",V72,V74))","v":"94-4-ADMN"},"P"]
[null,null,null,null,null,null,"P",{"$f":"IF(J6=\"\",\"\",IF(J6=\"p\",K6,K13))","v":"75-4-STAP"},{"$f":"IF(J6=\"\",\"\",IF(J6=\"p\",L6,L13))","v":"BENOIT J"},null,null,null,null,null,null,null,null,null,null,null,null,null,null,null,null,null,{"$f":"IF(AC75=\"\",\"\",IF(AC75=\"p\",AA75,AA77))","v":"CHRISTEN"},{"$f":"IF(AC75=\"\",\"\",IF(AC75=\"p\",AB75,AB77))","v":"75-4-BNDP"},"V",null,"7ème"]
[null,"21ème",null,"P",{"$f":"IF(G85=\"\",\"\",IF(G85=\"v\",H85,H86))","v":"75-4-STAP"},{"$f":"IF(G85=\"\",\"\",IF(G85=\"v\",I85,I86))","v":"AUGUSTE"},"V",{"$f":"IF(J21=\"\",\"\",IF(J21=\"p\",K21,K28))","v":"75-4-STAP"},{"$f":"IF(J21=\"\",\"\",IF(J21=\"p\",L21,L28))","v":"AUGUSTE"},null,"31ème",null,null,null,null,null,null,null,null,null,null,"15ème",null,null,null,null,null,null,null,{"$f":"IF(AC85=\"\",\"\",IF(AC85=\"v\",AA85,AA87))","v":"CHRISTEN"},{"$f":"IF(AC85=\"\",\"\",IF(AC85=\"v\",AB85,AB87))","v":"75-4-BNDP"}]
[null,{"$f":"IF(D86=\"\",\"\",IF(D86=\"v\",E86,E88))","v":"75-4-SMPP"},{"$f":"IF(D86=\"\",\"\",IF(D86=\"v\",F86,F88))","v":"ZHANG"},null,null,null,null,null,null,null,{"$f":"IF(M87=\"\",\"\",IF(M87=\"v\",N87,N88))","v":""},{"$f":"IF(M87=\"\",\"\",IF(M87=\"v\",O87,O88))","v":""},null,{"$f":"IF(M77=\"\",\"\",IF(M77=\"p\",N77,N78))","v":""},{"$f":"IF(M77=\"\",\"\",IF(M77=\"p\",O77,O78))","v":""},null,null,{"$f":"IF(T77=\"\",\"\",IF(T77=\"p\",R77,R78))","v":"D'ALENCON"},{"$f":"IF(T77=\"\",\"\",IF(T77=\"p\",S77,S78))","v":"75-4-STAP"},"V",{"$f":"IF(T87=\"\",\"\",IF(T87=\"v\",R87,R88))","v":"D'ALENCON"},{"$f":"IF(T87=\"\",\"\",IF(T87=\"v\",S87,S88))","v":"75-4-STAP"},null,null,null,null,{"$f":"IF(AC81=\"\",\"\",IF(AC81=\"p\",AA81,AA83))","v":"DE MARCK "},{"$f":"IF(AC81=\"\",\"\",IF(AC81=\"p\",AB81,AB83))","v":"94-4-SMSM"},"P"]
[null,null,null,"V",{"$f":"IF(G88=\"\",\"\",IF(G88=\"v\",H88,H89))","v":"75-4-SMPP"},{"$f":"IF(G88=\"\",\"\",IF(G88=\"v\",I88,I89))","v":"ZHANG"},"P",{"$f":"IF(J38=\"\",\"\",IF(J38=\"p\",K38,K45))","v":"94-4-PROV"},{"$f":"IF(J38=\"\",\"\",IF(J38=\"p\",L38,L45))","v":"COLLIN"},null,null,null,null,{"$f":"IF(M80=\"\",\"\",IF(M80=\"p\",N80,N81))","v":""},{"$f":"IF(M80=\"\",\"\",IF(M80=\"p\",O80,O81))","v":""},null,null,{"$f":"IF(T80=\"\",\"\",IF(T80=\"p\",R80,R81))","v":"MONNIER"},{"$f":"IF(T80=\"\",\"\",IF(T80=\"p\",S80,S81))","v":"75-4-LRPA"},"P"]
[null,null,null,null,null,null,"V",{"$f":"IF(J53=\"\",\"\",IF(J53=\"p\",K53,K60))","v":"75-4-SMPP"},{"$f":"IF(J53=\"\",\"\",IF(J53=\"p\",L53,L60))","v":"ZHANG"}]
[null,"23ème"]
[null,{"$f":"IF(D91=\"\",\"\",IF(D91=\"v\",E91,E92))","v":"94-4-PROV"},{"$f":"IF(D91=\"\",\"\",IF(D91=\"v\",F91,F92))","v":"COLLIN"},"P",{"$f":"IF(G85=\"\",\"\",IF(G85=\"p\",H85,H86))","v":"75-4-STAP"},{"$f":"IF(G85=\"\",\"\",IF(G85=\"p\",I85,I86))","v":"BENOIT J"}]
[null,null,null,"V",{"$f":"IF(G88=\"\",\"\",IF(G88=\"p\",H88,H89))","v":"94-4-PROV"},{"$f":"IF(G88=\"\",\"\",IF(G88=\"p\",I88,I89))","v":"COLLIN"}]

{"sheet":"Classement","index":11,"n_rows":35,"n_cols":3,"rows_kept":35,"cut":false,"hidden":false,"merged":[[1,0,1,2],[0,0,0,2]]}
[{"$f":"IF(Engagés!A1=\"\",\"\",Engagés!A1)","v":"QUALIFICATIONS Comité de Paris et Est-Francilien"}]
[{"$f":"IF(Engagés!E3=\"\",\"\",Engagés!E3)","v":"BF DIV 1"}]
["CLASSEMENT","NOMS","Etablissement"]
["1er",{"$f":"Tableau!AG32","v":"LI"},{"$f":"Tableau!AH32","v":"94-4-SMSM"}]
["2ème",{"$f":"IF(Tableau!$AF$17=\"\",\"\",IF(Tableau!$AF$17=\"p\",Tableau!$AD$17,Tableau!$AD$49))","v":"DELANNOY"},{"$f":"IF(Tableau!$AF$17=\"\",\"\",IF(Tableau!$AF$17=\"p\",Tableau!$AE$17,Tableau!$AE$49))","v":"94-4-SMSM"}]
["3ème",{"$f":"Tableau!AG62","v":"DROGAT"},{"$f":"Tableau!AH62","v":"94-4-PROV"}]
["4ème",{"$f":"IF(Tableau!AF61=\"\",\"\",IF(Tableau!$AF$61=\"p\",Tableau!$AD$61,Tableau!$AD$63))","v":"DE ROMANCE"},{"$f":"IF(Tableau!AF61=\"\",\"\",IF(Tableau!$AF$61=\"p\",Tableau!$AE$61,Tableau!$AE$63))","v":"75-4-LRPA"}]
["5ème",{"$f":"Tableau!AG79","v":"WEYER"},{"$f":"Tableau!AH79","v":"94-4-SMSM"}]
["6ème",{"$f":"IF(Tableau!AF76=\"\",\"\",IF(Tableau!$AF$76=\"p\",Tableau!$AD$76,Tableau!$AD$82))","v":"COFFINIER"},{"$f":"IF(Tableau!$AF$76=\"\",\"\",IF(Tableau!$AF$76=\"p\",Tableau!$AE$76,Tableau!$AE$82))","v":"75-4-LRPA"}]
["7ème",{"$f":"Tableau!AD86","v":"CHRISTEN"},{"$f":"Tableau!AE86","v":"75-4-BNDP"}]
["8ème",{"$f":"IF(Tableau!$AC$85=\"\",\"\",IF(Tableau!$AC$85=\"p\",Tableau!$AA$85,Tableau!$AA$87))","v":"DE MARCK "},{"$f":"IF(Tableau!$AC$85=\"\",\"\",IF(Tableau!$AC$85=\"p\",Tableau!$AB$85,Tableau!$AB$87))","v":"94-4-SMSM"}]
["9ème",{"$f":"Tableau!AA70","v":"MADAR"},{"$f":"Tableau!Y73","v":"94-4-PROV"}]
["10ème",{"$f":"IF(Tableau!$Z$67=\"\",\"\",IF(Tableau!$Z$67=\"p\",Tableau!$X$67,Tableau!$X$73))","v":"COURTIAL"},{"$f":"IF(Tableau!$Z$67=\"\",\"\",IF(Tableau!$Z$67=\"p\",Tableau!$Y$67,Tableau!$Y$73))","v":"94-4-PROV"}]
["11ème",{"$f":"Tableau!U83","v":"PAUGAM"},{"$f":"Tableau!V83","v":"75-4-LRPA"}]
["12ème",{"$f":"IF(Tableau!$T$83=\"\",\"\",IF(Tableau!$T$83=\"p\",Tableau!$R$83,Tableau!$R$84))","v":"KRZEWSKI"},{"$f":"IF(Tableau!$T$83=\"\",\"\",IF(Tableau!$T$83=\"p\",Tableau!$S$83,Tableau!$S$84))","v":"94-4-ADMN"}]
["13ème",{"$f":"Tableau!X79","v":"SMEETS"},{"$f":"Tableau!Y79","v":"75-4-LRPA"}]
["14ème",{"$f":"IF(Tableau!$W$78=\"\",\"\",IF(Tableau!$W$78=\"p\",Tableau!$U$78,Tableau!$U$80))","v":"GAGNEUX-BISSON"},{"$f":"IF(Tableau!$W$78=\"\",\"\",IF(Tableau!$W$78=\"p\",Tableau!$V$78,Tableau!$V$80))","v":"75-4-STAP"}]
["15ème",{"$f":"Tableau!U87","v":"D'ALENCON"},{"$f":"Tableau!V87","v":"75-4-STAP"}]
["16ème",{"$f":"IF(Tableau!$T$87=\"\",\"\",IF(Tableau!$T$87=\"p\",Tableau!$R$87,Tableau!$R$88))","v":"MONNIER"},{"$f":"IF(Tableau!$T$87=\"\",\"\",IF(Tableau!$T$87=\"p\",Tableau!$S$87,Tableau!$S$88))","v":"75-4-LRPA"}]
["17ème",{"$f":"Tableau!C32","v":"SUN CHEN"},{"$f":"Tableau!B32","v":"94-4-ADMN"}]
["18ème",{"$f":"IF(Tableau!$D$16=\"\",\"\",IF(Tableau!$D$16=\"p\",Tableau!$F$60,Tableau!$F$48))","v":"CETTI"},{"$f":"IF(Tableau!$D$16=\"\",\"\",IF(Tableau!$D$16=\"p\",Tableau!$E$16,Tableau!$E$48))","v":"75-4-LRPA"}]
["19ème",{"$f":"Tableau!C61","v":"BENOIT L"},{"$f":"Tableau!B61","v":"75-4-STAP"}]
["20ème",{"$f":"IF(Tableau!D60=\"\",\"\",IF(Tableau!$D$60=\"p\",Tableau!$F$60,Tableau!$F$62))","v":"CASSIM"},{"$f":"IF(Tableau!D60=\"\",\"\",IF(Tableau!$D$60=\"p\",Tableau!$E$60,Tableau!$E$62))","v":"94-4-PROV"}]
["21ème",{"$f":"Tableau!C87","v":"ZHANG"},{"$f":"Tableau!B87","v":"75-4-SMPP"}]
["22ème",{"$f":"IF(Tableau!$D$86=\"\",\"\",IF(Tableau!$D$86=\"p\",Tableau!$F$86,Tableau!$F$88))","v":"AUGUSTE"},{"$f":"IF(Tableau!$D$86=\"\",\"\",IF(Tableau!$D$86=\"p\",Tableau!$E$86,Tableau!$E$88))","v":"75-4-STAP"}]
["23ème",{"$f":"Tableau!C91","v":"COLLIN"},{"$f":"Tableau!B91","v":"94-4-PROV"}]
["24ème",{"$f":"IF(Tableau!$D$91=\"\",\"\",IF(Tableau!$D$91=\"p\",Tableau!$F$91,Tableau!$F$92))","v":"BENOIT J"},{"$f":"IF(Tableau!$D$91=\"\",\"\",IF(Tableau!$D$91=\"p\",Tableau!$E$91,Tableau!$E$92))","v":"75-4-STAP"}]
["25ème",{"$f":"Tableau!F70","v":""},{"$f":"Tableau!E70","v":""}]
["26ème",{"$f":"IF(Tableau!$G$67=\"\",\"\",IF(Tableau!$G$67=\"p\",Tableau!$I$67,Tableau!$I$73))","v":""},{"$f":"IF(Tableau!$G$67=\"\",\"\",IF(Tableau!$G$67=\"p\",Tableau!$H$73,Tableau!$H$67))","v":""}]
["27ème",{"$f":"Tableau!L83","v":""},{"$f":"Tableau!K83","v":""}]
["28ème",{"$f":"IF(Tableau!$M$83=\"\",\"\",IF(Tableau!$M$83=\"p\",Tableau!$O$83,Tableau!$O$84))","v":""},{"$f":"IF(Tableau!$M$83=\"\",\"\",IF(Tableau!$M$83=\"p\",Tableau!$N$83,Tableau!$N$84))","v":""}]
["29ème",{"$f":"Tableau!I79","v":""},{"$f":"Tableau!H79","v":""}]
["30ème",{"$f":"IF(Tableau!$J$78=\"\",\"\",IF(Tableau!$J$78=\"p\",Tableau!$L$78,Tableau!$L$80))","v":""},{"$f":"IF(Tableau!$J$78=\"\",\"\",IF(Tableau!$J$78=\"p\",Tableau!$K$78,Tableau!$K$80))","v":""}]
["31ème",{"$f":"Tableau!L87","v":""},{"$f":"Tableau!K87","v":""}]
["32ème",{"$f":"IF(Tableau!$M$87=\"\",\"\",IF(Tableau!$M$87=\"p\",Tableau!$O$87,Tableau!$O$88))","v":""},{"$f":"IF(Tableau!$M$87=\"\",\"\",IF(Tableau!$M$87=\"p\",Tableau!$N$87,Tableau!$N$88))","v":""}]