{"text_format":"1","workbook":"xlsx","n_sheets":12,"sheets":["Engagés","Poule 1","Poule 2","Poule 3","Poule 4","Poule 5","Poule 6","Poule 7","Poule 8","Résultats de poule","Tableau","Classement"],"not_rendered":{"charts":0,"images":81,"macros":1,"external_links":0,"defined_names":1,"comments":0,"pivot_tables":0},"unopened":[],"bounds":{"document_bytes":16777216,"sheet_cells":100000,"rows_first":2000,"rows_last":500,"rows_between":2000,"halvings":0,"cell_chars":16384,"cell_head_chars":4096},"cells_cut":0,"cells_raw":0,"read":"whole","date_system":"1900"}

{"sheet":"Engagés","index":0,"n_rows":37,"n_cols":14,"rows_kept":37,"cut":false,"hidden":false,"merged":[[17,6,17,9],[17,10,17,13],[23,6,23,9],[23,10,23,13],[0,0,2,1],[5,10,5,13],[5,6,5,9],[11,6,11,9],[11,10,11,13],[0,2,2,2]]}
["QUALIFICATIONS Comité de Paris et Est-Francilien",null,"BADMINTON","DATE :","13 dec"]
[null,null,null,"LIEU :","LR"]
[null,null,null,"CATEGORIE :","BF DIV 1"]
["Tête de série","ETABLISSEMENT","NOM","PRENOM","SIGLE"]
[]
[1,"ETOILE SP. LA ROCHEFOUCAULD","SMEETS","MARTA","75-4-LRPA",null,"Poule 1",null,null,null,"Poule 2"]
[2,"ALBERT DE MUN","SUN CHEN","CHARLOTTE","94-4-ADMN",null,1,{"$f":"VLOOKUP($G7,$A$1:$E$37,3,FALSE)","v":"SMEETS"},{"$f":"VLOOKUP($G7,$A$1:$E$37,4,FALSE)","v":"MARTA"},{"$f":"VLOOKUP($G7,$A$1:$E$37,5,FALSE)","v":"75-4-LRPA"},2,{"$f":"VLOOKUP($K7,$A$1:$E$37,3,FALSE)","v":"SUN CHEN"},{"$f":"VLOOKUP($K7,$A$1:$E$37,4,FALSE)","v":"CHARLOTTE"},{"$f":"VLOOKUP($K7,$A$1:$E$37,5,FALSE)","v":"94-4-ADMN"}]
[3,"ALBERT DE MUN","KRZEWSKI","AMBRE","94-4-ADMN",null,16,{"$f":"VLOOKUP($G8,$A$1:$E$37,3,FALSE)","v":"COLLIN"},{"$f":"VLOOKUP($G8,$A$1:$E$37,4,FALSE)","v":"CHLOE"},{"$f":"VLOOKUP($G8,$A$1:$E$37,5,FALSE)","v":"94-4-PROV"},15,{"$f":"VLOOKUP($K8,$A$1:$E$37,3,FALSE)","v":"COFFINIER"},{"$f":"VLOOKUP($K8,$A$1:$E$37,4,FALSE)","v":"NOUR"},{"$f":"VLOOKUP($K8,$A$1:$E$37,5,FALSE)","v":"75-4-LRPA"}]
[4,"ETOILE SP. LA ROCHEFOUCAULD","PAUGAM","AMBRE","75-4-LRPA",null,17,{"$f":"VLOOKUP($G9,$A$1:$E$37,3,FALSE)","v":"D'ALENCON"},{"$f":"VLOOKUP($G9,$A$1:$E$37,4,FALSE)","v":"EVANNA"},{"$f":"VLOOKUP($G9,$A$1:$E$37,5,FALSE)","v":"75-4-STAP"},18,{"$f":"VLOOKUP($K9,$A$1:$E$37,3,FALSE)","v":"GAGNEUX-BISSON"},{"$f":"VLOOKUP($K9,$A$1:$E$37,4,FALSE)","v":"MAY-ANN"},{"$f":"VLOOKUP($K9,$A$1:$E$37,5,FALSE)","v":"75-4-STAP"}]
[5,"ETOILE SP. LA ROCHEFOUCAULD","MONNIER","MARGUERITE","75-4-LRPA",null,32,{"$f":"VLOOKUP($G10,$A$1:$E$37,3,FALSE)","v":0},{"$f":"VLOOKUP($G10,$A$1:$E$37,4,FALSE)","v":0},{"$f":"VLOOKUP($G10,$A$1:$E$37,5,FALSE)","v":0},31,{"$f":"VLOOKUP($K10,$A$1:$E$37,3,FALSE)","v":0},{"$f":"VLOOKUP($K10,$A$1:$E$37,4,FALSE)","v":0},{"$f":"VLOOKUP($K10,$A$1:$E$37,5,FALSE)","v":0}]
{"$rows_left_out":28}
{"sheet":"Poule 1","index":1,"n_rows":24,"n_cols":7,"rows_kept":24,"cut":false,"hidden":false,"merged":[[0,0,0,2],[0,3,0,4],[22,0,22,1],[20,2,20,3],[23,4,23,5],[22,4,22,5],[13,0,13,6],[14,3,14,4],[23,2,23,3],[21,0,21,1],[23,0,23,1],[21,2,21,3],[19,4,19,5],[20,4,20,5],[7,0,7,6],[8,3,8,4],[8,0,8,2],[9,0,9,2],[10,0,10,2],[1,0,1,2],[1,3,1,6],[22,2,22,3],[20,0,20,1],[18,4,18,6],[11,0,11,2],[12,0,12,2],[14,0,14,2],[17,0,17,2],[18,0,18,3],[21,4,21,5],[19,0,19,1],[15,0,15,2],[16,0,16,2],[19,2,19,3]]}
[{"$f":"Engagés!C1","v":"BADMINTON"},null,null,{"$f":"Engagés!C3","v":0}]
["POULE 1"]
[null,"NOM","Prénom","Sigle","Vict","Def","Classement"]
[1,{"$f":"VLOOKUP($A4,Engagés!$A$1:$E$374,3,FALSE)","v":"SMEETS"},{"$f":"VLOOKUP($A4,Engagés!$A$1:$E$374,4,FALSE)","v":"MARTA"},{"$f":"VLOOKUP($A4,Engagés!$A$1:$E$374,5,FALSE)","v":"75-4-LRPA"},null,null,"1er"]
[16,{"$f":"VLOOKUP($A5,Engagés!$A$1:$E$374,3,FALSE)","v":"COLLIN"},{"$f":"VLOOKUP($A5,Engagés!$A$1:$E$374,4,FALSE)","v":"CHLOE"},{"$f":"VLOOKUP($A5,Engagés!$A$1:$E$374,5,FALSE)","v":"94-4-PROV"},null,null,"3ème"]
[17,{"$f":"VLOOKUP($A6,Engagés!$A$1:$E$374,3,FALSE)","v":"D'ALENCON"},{"$f":"VLOOKUP($A6,Engagés!$A$1:$E$374,4,FALSE)","v":"EVANNA"},{"$f":"VLOOKUP($A6,Engagés!$A$1:$E$374,5,FALSE)","v":"75-4-STAP"},null,null,"2ème"]
[32,{"$f":"VLOOKUP($A7,Engagés!$A$1:$E$374,3,FALSE)","v":0},{"$f":"VLOOKUP($A7,Engagés!$A$1:$E$374,4,FALSE)","v":0},{"$f":"VLOOKUP($A7,Engagés!$A$1:$E$374,5,FALSE)","v":0},null,null,"4ème"]
["Si poule de 4 joueurs alors…"]
["Déroulement",null,null,"Joueurs A contre Joueur B",null,"Vainqueur","Score"]
["Match 1",null,null,{"$f":"B4","v":"SMEETS"},{"$f":"B7","v":0}]
{"$rows_left_out":15}
{"sheet":"Poule 2","index":2,"n_rows":24,"n_cols":7,"rows_kept":24,"cut":false,"hidden":false,"merged":[[0,3,0,4],[15,0,15,2],[16,0,16,2],[1,0,1,2],[1,3,1,6],[7,0,7,6],[8,0,8,2],[8,3,8,4],[9,0,9,2],[10,0,10,2],[11,0,11,2],[12,0,12,2],[13,0,13,6],[14,0,14,2],[14,3,14,4],[0,0,0,2],[17,0,17,2],[18,0,18,3],[18,4,18,6],[20,0,20,1],[20,2,20,3],[20,4,20,5],[19,0,19,1],[19,2,19,3],[19,4,19,5],[23,0,23,1],[23,2,23,3],[23,4,23,5],[21,0,21,1],[21,2,21,3],[21,4,21,5],[22,0,22,1],[22,2,22,3],[22,4,22,5]]}
[{"$f":"Engagés!C1","v":"BADMINTON"},null,null,{"$f":"Engagés!C3","v":0}]
["POULE 2"]
[null,"NOM","Prénom","Sigle","Vict","Def","Classement"]
[2,{"$f":"VLOOKUP($A4,Engagés!$A$1:$E$374,3,FALSE)","v":"SUN CHEN"},{"$f":"VLOOKUP($A4,Engagés!$A$1:$E$374,4,FALSE)","v":"CHARLOTTE"},{"$f":"VLOOKUP($A4,Engagés!$A$1:$E$374,5,FALSE)","v":"94-4-ADMN"},null,null,"3ème"]
[15,{"$f":"VLOOKUP($A5,Engagés!$A$1:$E$374,3,FALSE)","v":"COFFINIER"},{"$f":"VLOOKUP($A5,Engagés!$A$1:$E$374,4,FALSE)","v":"NOUR"},{"$f":"VLOOKUP($A5,Engagés!$A$1:$E$374,5,FALSE)","v":"75-4-LRPA"},null,null,"1er"]
[18,{"$f":"VLOOKUP($A6,Engagés!$A$1:$E$374,3,FALSE)","v":"GAGNEUX-BISSON"},{"$f":"VLOOKUP($A6,Engagés!$A$1:$E$374,4,FALSE)","v":"MAY-ANN"},{"$f":"VLOOKUP($A6,Engagés!$A$1:$E$374,5,FALSE)","v":"75-4-STAP"},null,null,"2ème"]
[31,{"$f":"VLOOKUP($A7,Engagés!$A$1:$E$374,3,FALSE)","v":0},{"$f":"VLOOKUP($A7,Engagés!$A$1:$E$374,4,FALSE)","v":0},{"$f":"VLOOKUP($A7,Engagés!$A$1:$E$374,5,FALSE)","v":0},null,null,"4ème"]
["Si poule de 4 joueurs alors…"]
["Déroulement",null,null,"Joueurs A contre Joueur B",null,"Vainqueur","Score"]
["Match 1",null,null,{"$f":"B4","v":"SUN CHEN"},{"$f":"B7","v":0}]
{"$rows_left_out":15}
{"sheet":"Poule 3","index":3,"n_rows":24,"n_cols":7,"rows_kept":24,"cut":false,"hidden":false,"merged":[[0,3,0,4],[15,0,15,2],[16,0,16,2],[1,0,1,2],[1,3,1,6],[7,0,7,6],[8,0,8,2],[8,3,8,4],[9,0,9,2],[10,0,10,2],[11,0,11,2],[12,0,12,2],[13,0,13,6],[14,0,14,2],[14,3,14,4],[0,0,0,2],[17,0,17,2],[18,0,18,3],[18,4,18,6],[20,0,20,1],[20,2,20,3],[20,4,20,5],[19,0,19,1],[19,2,19,3],[19,4,19,5],[23,0,23,1],[23,2,23,3],[23,4,23,5],[21,0,21,1],[21,2,21,3],[21,4,21,5],[22,0,22,1],[22,2,22,3],[22,4,22,5]]}
[{"$f":"Engagés!C1","v":"BADMINTON"},null,null,{"$f":"Engagés!C3","v":0}]
["POULE 3"]
[null,"NOM","Prénom","Sigle","Vict","Def","Classement"]
[3,{"$f":"VLOOKUP($A4,Engagés!$A$1:$E$374,3,FALSE)","v":"KRZEWSKI"},{"$f":"VLOOKUP($A4,Engagés!$A$1:$E$374,4,FALSE)","v":"AMBRE"},{"$f":"VLOOKUP($A4,Engagés!$A$1:$E$374,5,FALSE)","v":"94-4-ADMN"},null,null,"1er"]
[14,{"$f":"VLOOKUP($A5,Engagés!$A$1:$E$374,3,FALSE)","v":"ZHANG"},{"$f":"VLOOKUP($A5,Engagés!$A$1:$E$374,4,FALSE)","v":"WENDY"},{"$f":"VLOOKUP($A5,Engagés!$A$1:$E$374,5,FALSE)","v":"75-4-SMPP"},null,null,"2ème"]
[19,{"$f":"VLOOKUP($A6,Engagés!$A$1:$E$374,3,FALSE)","v":"BENOIT J"},{"$f":"VLOOKUP($A6,Engagés!$A$1:$E$374,4,FALSE)","v":"JADE"},{"$f":"VLOOKUP($A6,Engagés!$A$1:$E$374,5,FALSE)","v":"75-4-STAP"},null,null,"3ème"]
[30,{"$f":"VLOOKUP($A7,Engagés!$A$1:$E$374,3,FALSE)","v":0},{"$f":"VLOOKUP($A7,Engagés!$A$1:$E$374,4,FALSE)","v":0},{"$f":"VLOOKUP($A7,Engagés!$A$1:$E$374,5,FALSE)","v":0},null,null,"4ème"]
["Si poule de 4 joueurs alors…"]
["Déroulement",null,null,"Joueurs A contre Joueur B",null,"Vainqueur","Score"]
["Match 1",null,null,{"$f":"B4","v":"KRZEWSKI"},{"$f":"B7","v":0}]
{"$rows_left_out":15}
{"sheet":"Poule 4","index":4,"n_rows":24,"n_cols":7,"rows_kept":24,"cut":false,"hidden":false,"merged":[[0,3,0,4],[15,0,15,2],[16,0,16,2],[1,0,1,2],[1,3,1,6],[7,0,7,6],[8,0,8,2],[8,3,8,4],[9,0,9,2],[10,0,10,2],[11,0,11,2],[12,0,12,2],[13,0,13,6],[14,0,14,2],[14,3,14,4],[0,0,0,2],[17,0,17,2],[18,0,18,3],[18,4,18,6],[20,0,20,1],[20,2,20,3],[20,4,20,5],[19,0,19,1],[19,2,19,3],[19,4,19,5],[23,0,23,1],[23,2,23,3],[23,4,23,5],[21,0,21,1],[21,2,21,3],[21,4,21,5],[22,0,22,1],[22,2,22,3],[22,4,22,5]]}
[{"$f":"Engagés!C1","v":"BADMINTON"},null,null,{"$f":"Engagés!C3","v":0}]
["POULE 4"]
[null,"NOM","Prénom","Sigle","Vict","Def","Classement"]
[4,{"$f":"VLOOKUP($A4,Engagés!$A$1:$E$374,3,FALSE)","v":"PAUGAM"},{"$f":"VLOOKUP($A4,Engagés!$A$1:$E$374,4,FALSE)","v":"AMBRE"},{"$f":"VLOOKUP($A4,Engagés!$A$1:$E$374,5,FALSE)","v":"75-4-LRPA"},null,null,"1er"]
[13,{"$f":"VLOOKUP($A5,Engagés!$A$1:$E$374,3,FALSE)","v":"MADAR"},{"$f":"VLOOKUP($A5,Engagés!$A$1:$E$374,4,FALSE)","v":"GLORIA"},{"$f":"VLOOKUP($A5,Engagés!$A$1:$E$374,5,FALSE)","v":"94-4-SMSM"},null,null,"2ème"]
[20,{"$f":"VLOOKUP($A6,Engagés!$A$1:$E$374,3,FALSE)","v":"CASSIM"},{"$f":"VLOOKUP($A6,Engagés!$A$1:$E$374,4,FALSE)","v":"CHARLIE"},{"$f":"VLOOKUP($A6,Engagés!$A$1:$E$374,5,FALSE)","v":"94-4-PROV"},null,null,"3ème"]
[29,{"$f":"VLOOKUP($A7,Engagés!$A$1:$E$374,3,FALSE)","v":0},{"$f":"VLOOKUP($A7,Engagés!$A$1:$E$374,4,FALSE)","v":0},{"$f":"VLOOKUP($A7,Engagés!$A$1:$E$374,5,FALSE)","v":0},null,null,"4ème"]
["Si poule de 4 joueurs alors…"]
["Déroulement",null,null,"Joueurs A contre Joueur B",null,"Vainqueur","Score"]
["Match 1",null,null,{"$f":"B4","v":"PAUGAM"},{"$f":"B7","v":0},0]
{"$rows_left_out":15}
{"sheet":"Poule 5","index":5,"n_rows":24,"n_cols":7,"rows_kept":24,"cut":false,"hidden":false,"merged":[[12,0,12,2],[13,0,13,6],[0,0,0,2],[0,3,0,4],[10,0,10,2],[11,0,11,2],[1,0,1,2],[1,3,1,6],[7,0,7,6],[8,0,8,2],[8,3,8,4],[9,0,9,2],[20,0,20,1],[20,2,20,3],[20,4,20,5],[14,0,14,2],[14,3,14,4],[15,0,15,2],[18,4,18,6],[19,0,19,1],[19,2,19,3],[19,4,19,5],[16,0,16,2],[17,0,17,2],[18,0,18,3],[23,0,23,1],[23,2,23,3],[23,4,23,5],[21,0,21,1],[21,2,21,3],[21,4,21,5],[22,0,22,1],[22,2,22,3],[22,4,22,5]]}
[{"$f":"Engagés!C1","v":"BADMINTON"},null,null,{"$f":"Engagés!C3","v":0}]
["POULE 5"]
[null,"NOM","Prénom","Sigle","Vict","Def","Classement"]
[5,{"$f":"VLOOKUP($A4,Engagés!$A$1:$E$374,3,FALSE)","v":"MONNIER"},{"$f":"VLOOKUP($A4,Engagés!$A$1:$E$374,4,FALSE)","v":"MARGUERITE"},{"$f":"VLOOKUP($A4,Engagés!$A$1:$E$374,5,FALSE)","v":"75-4-LRPA"},null,null,"2ème"]
[12,{"$f":"VLOOKUP($A5,Engagés!$A$1:$E$374,3,FALSE)","v":"BENOIT L"},{"$f":"VLOOKUP($A5,Engagés!$A$1:$E$374,4,FALSE)","v":"LILA"},{"$f":"VLOOKUP($A5,Engagés!$A$1:$E$374,5,FALSE)","v":"75-4-STAP"},null,null,"3ème"]
[21,{"$f":"VLOOKUP($A6,Engagés!$A$1:$E$374,3,FALSE)","v":"DELANNOY"},{"$f":"VLOOKUP($A6,Engagés!$A$1:$E$374,4,FALSE)","v":"JEANNE"},{"$f":"VLOOKUP($A6,Engagés!$A$1:$E$374,5,FALSE)","v":"94-4-SMSM"},null,null,"1er"]
[28,{"$f":"VLOOKUP($A7,Engagés!$A$1:$E$374,3,FALSE)","v":0},{"$f":"VLOOKUP($A7,Engagés!$A$1:$E$374,4,FALSE)","v":0},{"$f":"VLOOKUP($A7,Engagés!$A$1:$E$374,5,FALSE)","v":0},null,null,"4ème"]
["Si poule de 4 joueurs alors…"]
["Déroulement",null,null,"Joueurs A contre Joueur B",null,"Vainqueur","Score"]
["Match 1",null,null,{"$f":"B4","v":"MONNIER"},{"$f":"B7","v":0},0]
{"$rows_left_out":15}
{"sheet":"Poule 6","index":6,"n_rows":24,"n_cols":7,"rows_kept":24,"cut":false,"hidden":false,"merged":[[12,0,12,2],[13,0,13,6],[0,0,0,2],[0,3,0,4],[10,0,10,2],[11,0,11,2],[1,0,1,2],[1,3,1,6],[7,0,7,6],[8,0,8,2],[8,3,8,4],[9,0,9,2],[20,0,20,1],[20,2,20,3],[20,4,20,5],[14,0,14,2],[14,3,14,4],[15,0,15,2],[18,4,18,6],[19,0,19,1],[19,2,19,3],[19,4,19,5],[16,0,16,2],[17,0,17,2],[18,0,18,3],[23,0,23,1],[23,2,23,3],[23,4,23,5],[21,0,21,1],[21,2,21,3],[21,4,21,5],[22,0,22,1],[22,2,22,3],[22,4,22,5]]}
[{"$f":"Engagés!C1","v":"BADMINTON"},null,null,{"$f":"Engagés!C3","v":0}]
["POULE 6"]
[null,"NOM","Prénom","Sigle","Vict","Def","Classement"]
[6,{"$f":"VLOOKUP($A4,Engagés!$A$1:$E$374,3,FALSE)","v":"DE ROMANCE"},{"$f":"VLOOKUP($A4,Engagés!$A$1:$E$374,4,FALSE)","v":"SIXTINE"},{"$f":"VLOOKUP($A4,Engagés!$A$1:$E$374,5,FALSE)","v":"75-4-LRPA"},null,null,"2ème"]
[11,{"$f":"VLOOKUP($A5,Engagés!$A$1:$E$374,3,FALSE)","v":"LI"},{"$f":"VLOOKUP($A5,Engagés!$A$1:$E$374,4,FALSE)","v":"SOPHIA"},{"$f":"VLOOKUP($A5,Engagés!$A$1:$E$374,5,FALSE)","v":"94-4-SMSM"},null,null,"1er"]
[22,{"$f":"VLOOKUP($A6,Engagés!$A$1:$E$374,3,FALSE)","v":"DROGAT"},{"$f":"VLOOKUP($A6,Engagés!$A$1:$E$374,4,FALSE)","v":"ORIANE"},{"$f":"VLOOKUP($A6,Engagés!$A$1:$E$374,5,FALSE)","v":"94-4-PROV"},null,null,"3ème"]
[27,{"$f":"VLOOKUP($A7,Engagés!$A$1:$E$374,3,FALSE)","v":0},{"$f":"VLOOKUP($A7,Engagés!$A$1:$E$374,4,FALSE)","v":0},{"$f":"VLOOKUP($A7,Engagés!$A$1:$E$374,5,FALSE)","v":0},null,null,"4ème"]
["Si poule de 4 joueurs alors…"]
["Déroulement",null,null,"Joueurs A contre Joueur B",null,"Vainqueur","Score"]
["Match 1",null,null,{"$f":"B4","v":"DE ROMANCE"},{"$f":"B7","v":0},0]
{"$rows_left_out":15}
{"sheet":"Poule 7","index":7,"n_rows":24,"n_cols":9,"rows_kept":24,"cut":false,"hidden":false,"merged":[[12,0,12,2],[13,0,13,6],[0,0,0,2],[0,3,0,4],[10,0,10,2],[11,0,11,2],[1,0,1,2],[1,3,1,6],[7,0,7,6],[8,0,8,2],[8,3,8,4],[9,0,9,2],[20,0,20,1],[20,2,20,3],[20,4,20,5],[14,0,14,2],[14,3,14,4],[15,0,15,2],[18,4,18,6],[19,0,19,1],[19,2,19,3],[19,4,19,5],[16,0,16,2],[17,0,17,2],[18,0,18,3],[23,0,23,1],[23,2,23,3],[23,4,23,5],[21,0,21,1],[21,2,21,3],[21,4,21,5],[22,0,22,1],[22,2,22,3],[22,4,22,5]]}
[{"$f":"Engagés!C1","v":"BADMINTON"},null,null,{"$f":"Engagés!C3","v":0}]
["POULE 7"]
[null,"NOM","Prénom","Sigle","Vict","Def","Classement"]
[7,{"$f":"VLOOKUP($A4,Engagés!$A$1:$E$374,3,FALSE)","v":"CHRISTEN"},{"$f":"VLOOKUP($A4,Engagés!$A$1:$E$374,4,FALSE)","v":"NEVA"},{"$f":"VLOOKUP($A4,Engagés!$A$1:$E$374,5,FALSE)","v":"75-4-BNDP"},null,null,"1er"]
[10,{"$f":"VLOOKUP($A5,Engagés!$A$1:$E$374,3,FALSE)","v":"CETTI"},{"$f":"VLOOKUP($A5,Engagés!$A$1:$E$374,4,FALSE)","v":"AMELIE"},{"$f":"VLOOKUP($A5,Engagés!$A$1:$E$374,5,FALSE)","v":"75-4-LRPA"},null,null,"3ème"]
[23,{"$f":"VLOOKUP($A6,Engagés!$A$1:$E$374,3,FALSE)","v":"WEYER"},{"$f":"VLOOKUP($A6,Engagés!$A$1:$E$374,4,FALSE)","v":"MAXINE"},{"$f":"VLOOKUP($A6,Engagés!$A$1:$E$374,5,FALSE)","v":"94-4-SMSM"},null,null,"2ème"]
[26,{"$f":"VLOOKUP($A7,Engagés!$A$1:$E$374,3,FALSE)","v":0},{"$f":"VLOOKUP($A7,Engagés!$A$1:$E$374,4,FALSE)","v":0},{"$f":"VLOOKUP($A7,Engagés!$A$1:$E$374,5,FALSE)","v":0},null,null,"4ème"]
["Si poule de 4 joueurs alors…"]
["Déroulement",null,null,"Joueurs A contre Joueur B",null,"Vainqueur","Score"]
["Match 1",null,null,{"$f":"B4","v":"CHRISTEN"},{"$f":"B7","v":0},0]
{"$rows_left_out":15}
{"sheet":"Poule 8","index":8,"n_rows":24,"n_cols":7,"rows_kept":24,"cut":false,"hidden":false,"merged":[[12,0,12,2],[13,0,13,6],[0,0,0,2],[0,3,0,4],[10,0,10,2],[11,0,11,2],[1,0,1,2],[1,3,1,6],[7,0,7,6],[8,0,8,2],[8,3,8,4],[9,0,9,2],[20,0,20,1],[20,2,20,3],[20,4,20,5],[14,0,14,2],[14,3,14,4],[15,0,15,2],[18,4,18,6],[19,0,19,1],[19,2,19,3],[19,4,19,5],[16,0,16,2],[17,0,17,2],[18,0,18,3],[23,0,23,1],[23,2,23,3],[23,4,23,5],[21,0,21,1],[21,2,21,3],[21,4,21,5],[22,0,22,1],[22,2,22,3],[22,4,22,5]]}
[{"$f":"Engagés!C1","v":"BADMINTON"},null,null,{"$f":"Engagés!C3","v":0}]
["POULE 8"]
[null,"NOM","Prénom","Sigle","Vict","Def","Classement"]
[8,{"$f":"VLOOKUP($A4,Engagés!$A$1:$E$374,3,FALSE)","v":"COURTIAL"},{"$f":"VLOOKUP($A4,Engagés!$A$1:$E$374,4,FALSE)","v":"ADELE"},{"$f":"VLOOKUP($A4,Engagés!$A$1:$E$374,5,FALSE)","v":"94-4-PROV"},null,null,"1er"]
[9,{"$f":"VLOOKUP($A5,Engagés!$A$1:$E$374,3,FALSE)","v":"AUGUSTE"},{"$f":"VLOOKUP($A5,Engagés!$A$1:$E$374,4,FALSE)","v":"ELOA"},{"$f":"VLOOKUP($A5,Engagés!$A$1:$E$374,5,FALSE)","v":"75-4-STAP"},null,null,"3ème"]
[24,{"$f":"VLOOKUP($A6,Engagés!$A$1:$E$374,3,FALSE)","v":"DE MARCK "},{"$f":"VLOOKUP($A6,Engagés!$A$1:$E$374,4,FALSE)","v":"CLEMENCE"},{"$f":"VLOOKUP($A6,Engagés!$A$1:$E$374,5,FALSE)","v":"94-4-SMSM"},null,null,"2ème"]
[25,{"$f":"VLOOKUP($A7,Engagés!$A$1:$E$374,3,FALSE)","v":0},{"$f":"VLOOKUP($A7,Engagés!$A$1:$E$374,4,FALSE)","v":0},{"$f":"VLOOKUP($A7,Engagés!$A$1:$E$374,5,FALSE)","v":0},null,null,"4ème"]
["Si poule de 4 joueurs alors…"]
["Déroulement",null,null,"Joueurs A contre Joueur B",null,"Vainqueur","Score"]
["Match 1",null,null,{"$f":"B4","v":"COURTIAL"},{"$f":"B7","v":0}]
{"$rows_left_out":15}
{"sheet":"Résultats de poule","index":9,"n_rows":10,"n_cols":16,"rows_kept":10,"cut":false,"hidden":false,"merged":[[0,0,0,3],[0,4,0,7],[0,8,0,11],[0,12,0,15],[5,0,5,3],[5,4,5,7],[5,8,5,11],[5,12,5,15]]}
["Poule 1",null,null,null,"Poule 2",null,null,null,"Poule 3",null,null,null,"Poule 4"]
["1er",{"$f":"'Poule 1'!$C21","v":"SMEETS"},{"$f":"'Poule 1'!$E21","v":"MARTA"},{"$f":"'Poule 1'!$G21","v":"75-4-LRPA"},"1er",{"$f":"'Poule 2'!$C21","v":"COFFINIER"},{"$f":"'Poule 2'!$E21","v":"NOUR"},{"$f":"'Poule 2'!$G21","v":"75-4-LRPA"},"1er",{"$f":"'Poule 3'!$C21","v":"KRZEWSKI"},{"$f":"'Poule 3'!$E21","v":"AMBRE"},{"$f":"'Poule 3'!$G21","v":"94-4-ADMN"},"1er",{"$f":"'Poule 4'!$C21","v":"PAUGAM"},{"$f":"'Poule 4'!$E21","v":"AMBRE"},{"$f":"'Poule 4'!$G21","v":"75-4-LRPA"}]
["2ème",{"$f":"'Poule 1'!$C22","v":"D'ALENCON"},{"$f":"'Poule 1'!$E22","v":"EVANNA"},{"$f":"'Poule 1'!$G22","v":"75-4-STAP"},"2ème",{"$f":"'Poule 2'!$C22","v":"GAGNEUX-BISSON"},{"$f":"'Poule 2'!$E22","v":"MAY-ANN"},{"$f":"'Poule 2'!$G22","v":"75-4-STAP"},"2ème",{"$f":"'Poule 3'!$C22","v":"ZHANG"},{"$f":"'Poule 3'!$E22","v":"WENDY"},{"$f":"'Poule 3'!$G22","v":"75-4-SMPP"},"2ème",{"$f":"'Poule 4'!$C22","v":"MADAR"},{"$f":"'Poule 4'!$E22","v":"GLORIA"},{"$f":"'Poule 4'!$G22","v":"94-4-SMSM"}]
["3ème",{"$f":"'Poule 1'!$C23","v":"COLLIN"},{"$f":"'Poule 1'!$E23","v":"CHLOE"},{"$f":"'Poule 1'!$G23","v":"94-4-PROV"},"3ème",{"$f":"'Poule 2'!$C23","v":"SUN CHEN"},{"$f":"'Poule 2'!$E23","v":"CHARLOTTE"},{"$f":"'Poule 2'!$G23","v":"94-4-ADMN"},"3ème",{"$f":"'Poule 3'!$C23","v":"BENOIT J"},{"$f":"'Poule 3'!$E23","v":"JADE"},{"$f":"'Poule 3'!$G23","v":"75-4-STAP"},"3ème",{"$f":"'Poule 4'!$C23","v":"CASSIM"},{"$f":"'Poule 4'!$E23","v":"CHARLIE"},{"$f":"'Poule 4'!$G23","v":"94-4-PROV"}]
["4ème",{"$f":"'Poule 1'!$C24","v":0},{"$f":"'Poule 1'!$E24","v":0},{"$f":"'Poule 1'!$G24","v":0},"4ème",{"$f":"'Poule 2'!$C24","v":0},{"$f":"'Poule 2'!$E24","v":0},{"$f":"'Poule 2'!$G24","v":0},"4ème",{"$f":"'Poule 3'!$C24","v":0},{"$f":"'Poule 3'!$E24","v":0},{"$f":"'Poule 3'!$G24","v":0},"4ème",{"$f":"'Poule 4'!$C24","v":0},{"$f":"'Poule 4'!$E24","v":0},{"$f":"'Poule 4'!$G24","v":0}]
["Poule 5",null,null,null,"Poule 6",null,null,null,"Poule 7",null,null,null,"Poule 8"]
["1er",{"$f":"'Poule 5'!$C21","v":"DELANNOY"},{"$f":"'Poule 5'!$E21","v":"JEANNE"},{"$f":"'Poule 5'!$G21","v":"94-4-SMSM"},"1er",{"$f":"'Poule 6'!$C21","v":"LI"},{"$f":"'Poule 6'!$E21","v":"SOPHIA"},{"$f":"'Poule 6'!$G21","v":"94-4-SMSM"},"1er",{"$f":"'Poule 7'!$C21","v":"CHRISTEN"},{"$f":"'Poule 7'!$E21","v":"NEVA"},{"$f":"'Poule 7'!$G21","v":"75-4-BNDP"},"1er",{"$f":"'Poule 8'!$C21","v":"COURTIAL"},{"$f":"'Poule 8'!$E21","v":"ADELE"},{"$f":"'Poule 8'!$G21","v":"94-4-PROV"}]
["2ème",{"$f":"'Poule 5'!$C22","v":"MONNIER"},{"$f":"'Poule 5'!$E22","v":"MARGUERITE"},{"$f":"'Poule 5'!$G22","v":"75-4-LRPA"},"2ème",{"$f":"'Poule 6'!$C22","v":"DE ROMANCE"},{"$f":"'Poule 6'!$E22","v":"SIXTINE"},{"$f":"'Poule 6'!$G22","v":"75-4-LRPA"},"2ème",{"$f":"'Poule 7'!$C22","v":"WEYER"},{"$f":"'Poule 7'!$E22","v":"MAXINE"},{"$f":"'Poule 7'!$G22","v":"94-4-SMSM"},"2ème",{"$f":"'Poule 8'!$C22","v":"DE MARCK "},{"$f":"'Poule 8'!$E22","v":"CLEMENCE"},{"$f":"'Poule 8'!$G22","v":"94-4-SMSM"}]
["3ème",{"$f":"'Poule 5'!$C23","v":"BENOIT L"},{"$f":"'Poule 5'!$E23","v":"LILA"},{"$f":"'Poule 5'!$G23","v":"75-4-STAP"},"3ème",{"$f":"'Poule 6'!$C23","v":"DROGAT"},{"$f":"'Poule 6'!$E23","v":"ORIANE"},{"$f":"'Poule 6'!$G23","v":"94-4-PROV"},"3ème",{"$f":"'Poule 7'!$C23","v":"CETTI"},{"$f":"'Poule 7'!$E23","v":"AMELIE"},{"$f":"'Poule 7'!$G23","v":"75-4-LRPA"},"3ème",{"$f":"'Poule 8'!$C23","v":"AUGUSTE"},{"$f":"'Poule 8'!$E23","v":"ELOA"},{"$f":"'Poule 8'!$G23","v":"75-4-STAP"}]
["4ème",{"$f":"'Poule 5'!$C24","v":0},{"$f":"'Poule 5'!$E24","v":0},{"$f":"'Poule 5'!$G24","v":0},"4ème",{"$f":"'Poule 6'!$C24","v":0},{"$f":"'Poule 6'!$E24","v":0},{"$f":"'Poule 6'!$G24","v":0},"4ème",{"$f":"'Poule 7'!$C24","v":0},{"$f":"'Poule 7'!$E24","v":0},{"$f":"'Poule 7'!$G24","v":0},"4ème",{"$f":"'Poule 8'!$C24","v":0},{"$f":"'Poule 8'!$E24","v":0},{"$f":"'Poule 8'!$G24","v":0}]
{"$rows_left_out":1}
{"sheet":"Tableau","index":10,"n_rows":92,"n_cols":34,"rows_kept":92,"cut":false,"hidden":false,"merged":[[8,10,8,11],[50,20,50,21],[16,10,16,11],[23,10,23,11],[33,10,33,11],[40,10,40,11],[48,10,48,11],[10,20,10,21],[30,32,30,33],[0,16,0,19],[15,29,15,30],[0,0,0,14],[31,29,31,30],[10,1,10,2],[1,4,1,5],[0,20,0,33],[16,26,16,27],[23,23,23,24],[3,20,3,21],[18,20,18,21],[29,4,29,5],[25,20,25,21],[1,10,1,11],[9,23,9,24],[55,10,55,11],[33,4,33,5],[42,1,42,2],[59,29,59,30],[55,23,55,24],[47,29,47,30],[35,20,35,21],[42,20,42,21],[41,23,41,24],[48,26,48,27],[57,20,57,21]]}
["REPECHAGES ET MATCHS DE CLASSEMENT",null,null,null,null,null,null,null,null,null,null,null,null,null,null,null,"1er tour de tableau",null,null,null,"TABLEAU PRINCIPAL"]
[]
[]
[null,null,null,null,null,null,null,null,null,null,null,null,null,null,null,null,"1er poule 1",{"$f":"'Résultats de poule'!B2","v":"SMEETS"},{"$f":"'Résultats de poule'!D2","v":"75-4-LRPA"},"V","1/8 de finale 1"]
[null,null,null,null,null,null,null,null,null,null,null,null,"P",{"$f":"IF(T4=\"\",\"\",IF(T4=\"p\",S4,S5))","v":0},{"$f":"IF(T4=\"\",\"\",IF(T4=\"p\",R4,R5))","v":0},null,"4ème poule 8",{"$f":"'Résultats de poule'!N10","v":0},{"$f":"'Résultats de poule'!P10","v":0},"P",{"$f":"IF(T4=\"\",\"\",IF(T4=\"v\",R4,R5))","v":"SMEETS"},{"$f":"IF(T4=\"\",\"\",IF(T4=\"v\",S4,S5))","v":"75-4-LRPA"},"P"]
[null,null,null,null,null,null,null,null,null,"P",{"$f":"IF(M5=\"\",\"\",IF(M5=\"v\",N5,N7))","v":"75-4-STAP"},{"$f":"IF(M5=\"\",\"\",IF(M5=\"v\",O5,O7))","v":"BENOIT J"},null,null,null,null,null,null,null,null,null,null,null,{"$f":"IF(W5=\"\",\"\",IF(W5=\"v\",U5,U7))","v":"DE ROMANCE"},{"$f":"IF(W5=\"\",\"\",IF(W5=\"v\",V5,V7))","v":"75-4-LRPA"},"V"]
[null,null,null,null,null,null,null,null,null,null,null,null,"V",{"$f":"IF(T7=\"\",\"\",IF(T7=\"p\",S7,S8))","v":"75-4-STAP"},{"$f":"IF(T7=\"\",\"\",IF(T7=\"p\",R7,R8))","v":"BENOIT J"},null,"3ème poule 3",{"$f":"'Résultats de poule'!J4","v":"BENOIT J"},{"$f":"'Résultats de poule'!L4","v":"75-4-STAP"},"P",{"$f":"IF(T7=\"\",\"\",IF(T7=\"v\",R7,R8))","v":"DE ROMANCE"},{"$f":"IF(T7=\"\",\"\",IF(T7=\"v\",S7,S8))","v":"75-4-LRPA"},"V"]
[null,null,null,null,null,null,null,null,null,null,null,null,null,null,null,null,"2ème poule 6",{"$f":"'Résultats de poule'!F8","v":"DE ROMANCE"},{"$f":"'Résultats de poule'!H8","v":"75-4-LRPA"},"V"]
[null,null,null,null,null,null,"P",{"$f":"IF(J6=\"\",\"\",IF(J6=\"v\",K6,K13))","v":"75-4-STAP"},{"$f":"IF(J6=\"\",\"\",IF(J6=\"v\",L6,L13))","v":"BENOIT L"}]
[null,null,null,null,null,null,null,null,null,null,null,null,null,null,null,null,null,null,null,null,null,null,null,"1/4 finale 1",null,null,{"$f":"IF(Z6=\"\",\"\",IF(Z6=\"v\",X6,X13))","v":"DE ROMANCE"},{"$f":"IF(Z6=\"\",\"\",IF(Z6=\"v\",Y6,Y13))","v":"75-4-LRPA"},"P"]
{"$rows_left_out":83}
{"sheet":"Classement","index":11,"n_rows":35,"n_cols":3,"rows_kept":35,"cut":false,"hidden":false,"merged":[[1,0,1,2],[0,0,0,2]]}
[{"$f":"IF(Engagés!A1=\"\",\"\",Engagés!A1)","v":"QUALIFICATIONS Comité de Paris et Est-Francilien"}]
[{"$f":"IF(Engagés!E3=\"\",\"\",Engagés!E3)","v":"BF DIV 1"}]
["CLASSEMENT","NOMS","Etablissement"]
["1er",{"$f":"Tableau!AG32","v":"LI"},{"$f":"Tableau!AH32","v":"94-4-SMSM"}]
["2ème",{"$f":"IF(Tableau!$AF$17=\"\",\"\",IF(Tableau!$AF$17=\"p\",Tableau!$AD$17,Tableau!$AD$49))","v":"DELANNOY"},{"$f":"IF(Tableau!$AF$17=\"\",\"\",IF(Tableau!$AF$17=\"p\",Tableau!$AE$17,Tableau!$AE$49))","v":"94-4-SMSM"}]
["3ème",{"$f":"Tableau!AG62","v":"DROGAT"},{"$f":"Tableau!AH62","v":"94-4-PROV"}]
["4ème",{"$f":"IF(Tableau!AF61=\"\",\"\",IF(Tableau!$AF$61=\"p\",Tableau!$AD$61,Tableau!$AD$63))","v":"DE ROMANCE"},{"$f":"IF(Tableau!AF61=\"\",\"\",IF(Tableau!$AF$61=\"p\",Tableau!$AE$61,Tableau!$AE$63))","v":"75-4-LRPA"}]
["5ème",{"$f":"Tableau!AG79","v":"WEYER"},{"$f":"Tableau!AH79","v":"94-4-SMSM"}]
["6ème",{"$f":"IF(Tableau!AF76=\"\",\"\",IF(Tableau!$AF$76=\"p\",Tableau!$AD$76,Tableau!$AD$82))","v":"COFFINIER"},{"$f":"IF(Tableau!$AF$76=\"\",\"\",IF(Tableau!$AF$76=\"p\",Tableau!$AE$76,Tableau!$AE$82))","v":"75-4-LRPA"}]
["7ème",{"$f":"Tableau!AD86","v":"CHRISTEN"},{"$f":"Tableau!AE86","v":"75-4-BNDP"}]
{"$rows_left_out":25}