{"text_format":"1","workbook":"xlsx","n_sheets":14,"sheets":["Engagés","Poule 1","Poule 2","Poule 3","Poule 4","Poule 5","Poule 6","Poule 7","Poule 8","Résultats de poule","Tableau","Classement","Feuille de match","Feuilles"],"not_rendered":{"charts":0,"images":82,"macros":1,"external_links":0,"defined_names":1,"comments":0,"pivot_tables":0},"unopened":[],"bounds":{"document_bytes":16777216,"sheet_cells":100000,"rows_first":2000,"rows_last":500,"rows_between":2000,"halvings":0,"cell_chars":16384,"cell_head_chars":4096},"cells_cut":0,"cells_raw":0,"read":"whole","date_system":"1900"}

{"sheet":"Engagés","index":0,"n_rows":37,"n_cols":14,"rows_kept":37,"cut":false,"hidden":false,"merged":[[17,6,17,9],[17,10,17,13],[23,6,23,9],[23,10,23,13],[0,0,2,1],[5,10,5,13],[5,6,5,9],[11,6,11,9],[11,10,11,13],[0,2,2,2]]}
["FINALES Comité de Paris ",null,"TENNIS DE TABLE","DATE :","8 fev"]
[null,null,null,"LIEU :","Stanislas"]
[null,null,null,"CATEGORIE :","MF Promo"]
["Tête de série","ETABLISSEMENT","NOM","PRENOM","SIGLE"]
[]
[1,"FENELON STE MARIE","GROB","CAMILLE","75-4-FENP",null,"Poule 1",null,null,null,"Poule 2"]
[2,"STANISLAS","DE BATTISTA","TIPHAINE","75-4-STAP",null,1,{"$f":"VLOOKUP($G7,$A$1:$E$37,3,FALSE)","v":"GROB"},{"$f":"VLOOKUP($G7,$A$1:$E$37,4,FALSE)","v":"CAMILLE"},{"$f":"VLOOKUP($G7,$A$1:$E$37,5,FALSE)","v":"75-4-FENP"},2,{"$f":"VLOOKUP($K7,$A$1:$E$37,3,FALSE)","v":"DE BATTISTA"},{"$f":"VLOOKUP($K7,$A$1:$E$37,4,FALSE)","v":"TIPHAINE"},{"$f":"VLOOKUP($K7,$A$1:$E$37,5,FALSE)","v":"75-4-STAP"}]
[3,"STANISLAS","DE POULPIQUET DU HALGOUET","SOLINE","75-4-STAP",null,16,{"$f":"VLOOKUP($G8,$A$1:$E$37,3,FALSE)","v":"OYHARNART--FAYET"},{"$f":"VLOOKUP($G8,$A$1:$E$37,4,FALSE)","v":"HORTENSE"},{"$f":"VLOOKUP($G8,$A$1:$E$37,5,FALSE)","v":"75-4-LMAP"},15,{"$f":"VLOOKUP($K8,$A$1:$E$37,3,FALSE)","v":"THOREL"},{"$f":"VLOOKUP($K8,$A$1:$E$37,4,FALSE)","v":"ZELIE"},{"$f":"VLOOKUP($K8,$A$1:$E$37,5,FALSE)","v":"75-4-FENP"}]
[4,"FENELON STE MARIE","JEAN","ALICE","75-4-FENP",null,17,{"$f":"VLOOKUP($G9,$A$1:$E$37,3,FALSE)","v":"MATHIAN"},{"$f":"VLOOKUP($G9,$A$1:$E$37,4,FALSE)","v":"RAPHAELLE"},{"$f":"VLOOKUP($G9,$A$1:$E$37,5,FALSE)","v":"75-2-SUPA"},18,{"$f":"VLOOKUP($K9,$A$1:$E$37,3,FALSE)","v":"DENIS"},{"$f":"VLOOKUP($K9,$A$1:$E$37,4,FALSE)","v":"PRUNE"},{"$f":"VLOOKUP($K9,$A$1:$E$37,5,FALSE)","v":"75-4-LMAP"}]
[5,"AS ALMA","BIZARD","DARYA","75-4-LMAP",null,32,{"$f":"VLOOKUP($G10,$A$1:$E$37,3,FALSE)","v":0},{"$f":"VLOOKUP($G10,$A$1:$E$37,4,FALSE)","v":0},{"$f":"VLOOKUP($G10,$A$1:$E$37,5,FALSE)","v":0},31,{"$f":"VLOOKUP($K10,$A$1:$E$37,3,FALSE)","v":0},{"$f":"VLOOKUP($K10,$A$1:$E$37,4,FALSE)","v":0},{"$f":"VLOOKUP($K10,$A$1:$E$37,5,FALSE)","v":0}]
[6,"AS ALMA","ROY-REMY","VALENTINE","75-4-LMAP"]
[7,"SAINTE URSULE","BRUNELAT","CAMILLE","75-2-SUPA",null,"Poule 3",null,null,null,"Poule 4"]
[8,"PAUL CLAUDEL HULST","GALLAND","CLEMENCE","75-4-PCHP",null,3,{"$f":"VLOOKUP($G13,$A$1:$E$37,3,FALSE)","v":"DE POULPIQUET DU HALGOUET"},{"$f":"VLOOKUP($G13,$A$1:$E$37,4,FALSE)","v":"SOLINE"},{"$f":"VLOOKUP($G13,$A$1:$E$37,5,FALSE)","v":"75-4-STAP"},4,{"$f":"VLOOKUP($K13,$A$1:$E$37,3,FALSE)","v":"JEAN"},{"$f":"VLOOKUP($K13,$A$1:$E$37,4,FALSE)","v":"ALICE"},{"$f":"VLOOKUP($K13,$A$1:$E$37,5,FALSE)","v":"75-4-FENP"}]
[9,"SAINT LOUIS","GARREC","JULIE","75-2-SLHP",null,14,{"$f":"VLOOKUP($G14,$A$1:$E$37,3,FALSE)","v":"ASHIKHMIN"},{"$f":"VLOOKUP($G14,$A$1:$E$37,4,FALSE)","v":"DOUNIA"},{"$f":"VLOOKUP($G14,$A$1:$E$37,5,FALSE)","v":"75-4-LMAP"},13,{"$f":"VLOOKUP($K14,$A$1:$E$37,3,FALSE)","v":"MAHU"},{"$f":"VLOOKUP($K14,$A$1:$E$37,4,FALSE)","v":"ELOISE"},{"$f":"VLOOKUP($K14,$A$1:$E$37,5,FALSE)","v":"75-2-SLHP"}]
[10,"AS ALMA","ILLOUZ","LEANA","75-4-LMAP",null,19,{"$f":"VLOOKUP($G15,$A$1:$E$37,3,FALSE)","v":0},{"$f":"VLOOKUP($G15,$A$1:$E$37,4,FALSE)","v":0},{"$f":"VLOOKUP($G15,$A$1:$E$37,5,FALSE)","v":0},20,{"$f":"VLOOKUP($K15,$A$1:$E$37,3,FALSE)","v":"SALOME"},{"$f":"VLOOKUP($K15,$A$1:$E$37,4,FALSE)","v":"JOSEPHINE"},{"$f":"VLOOKUP($K15,$A$1:$E$37,5,FALSE)","v":"75-4-LMAP"}]
[11,"EDELWEISS","BONNIN","ELEONORE","75-4-BLOP",null,30,{"$f":"VLOOKUP($G16,$A$1:$E$37,3,FALSE)","v":0},{"$f":"VLOOKUP($G16,$A$1:$E$37,4,FALSE)","v":0},{"$f":"VLOOKUP($G16,$A$1:$E$37,5,FALSE)","v":0},29,{"$f":"VLOOKUP($K16,$A$1:$E$37,3,FALSE)","v":0},{"$f":"VLOOKUP($K16,$A$1:$E$37,4,FALSE)","v":0},{"$f":"VLOOKUP($K16,$A$1:$E$37,5,FALSE)","v":0}]
[12]
[13,"SAINT LOUIS","MAHU","ELOISE","75-2-SLHP",null,"Poule 5",null,null,null,"Poule 6"]
[14,"AS ALMA","ASHIKHMIN","DOUNIA","75-4-LMAP",null,5,{"$f":"VLOOKUP($G19,$A$1:$E$37,3,FALSE)","v":"BIZARD"},{"$f":"VLOOKUP($G19,$A$1:$E$37,4,FALSE)","v":"DARYA"},{"$f":"VLOOKUP($G19,$A$1:$E$37,5,FALSE)","v":"75-4-LMAP"},6,{"$f":"VLOOKUP($K19,$A$1:$E$37,3,FALSE)","v":"ROY-REMY"},{"$f":"VLOOKUP($K19,$A$1:$E$37,4,FALSE)","v":"VALENTINE"},{"$f":"VLOOKUP($K19,$A$1:$E$37,5,FALSE)","v":"75-4-LMAP"}]
[15,"FENELON STE MARIE","THOREL","ZELIE","75-4-FENP",null,12,{"$f":"VLOOKUP($G20,$A$1:$E$37,3,FALSE)","v":0},{"$f":"VLOOKUP($G20,$A$1:$E$37,4,FALSE)","v":0},{"$f":"VLOOKUP($G20,$A$1:$E$37,5,FALSE)","v":0},11,{"$f":"VLOOKUP($K20,$A$1:$E$37,3,FALSE)","v":"BONNIN"},{"$f":"VLOOKUP($K20,$A$1:$E$37,4,FALSE)","v":"ELEONORE"},{"$f":"VLOOKUP($K20,$A$1:$E$37,5,FALSE)","v":"75-4-BLOP"}]
[16,"AS ALMA","OYHARNART--FAYET","HORTENSE","75-4-LMAP",null,21,{"$f":"VLOOKUP($G21,$A$1:$E$37,3,FALSE)","v":"ANDRIOT"},{"$f":"VLOOKUP($G21,$A$1:$E$37,4,FALSE)","v":"ALICE"},{"$f":"VLOOKUP($G21,$A$1:$E$37,5,FALSE)","v":"75-4-LMAP"},22,{"$f":"VLOOKUP($K21,$A$1:$E$37,3,FALSE)","v":"RISSE-RAUD"},{"$f":"VLOOKUP($K21,$A$1:$E$37,4,FALSE)","v":"MAHAUT"},{"$f":"VLOOKUP($K21,$A$1:$E$37,5,FALSE)","v":"75-4-LMAP"}]
[17,null,"MATHIAN","RAPHAELLE","75-2-SUPA",null,28,{"$f":"VLOOKUP($G22,$A$1:$E$37,3,FALSE)","v":0},{"$f":"VLOOKUP($G22,$A$1:$E$37,4,FALSE)","v":0},{"$f":"VLOOKUP($G22,$A$1:$E$37,5,FALSE)","v":0},27,{"$f":"VLOOKUP($K22,$A$1:$E$37,3,FALSE)","v":0},{"$f":"VLOOKUP($K22,$A$1:$E$37,4,FALSE)","v":0},{"$f":"VLOOKUP($K22,$A$1:$E$37,5,FALSE)","v":0}]
[18,"AS ALMA","DENIS","PRUNE","75-4-LMAP"]
[19,null,null,null,null,null,"Poule 7",null,null,null,"Poule 8"]
[20,"AS ALMA","SALOME","JOSEPHINE","75-4-LMAP",null,7,{"$f":"VLOOKUP($G25,$A$1:$E$37,3,FALSE)","v":"BRUNELAT"},{"$f":"VLOOKUP($G25,$A$1:$E$37,4,FALSE)","v":"CAMILLE"},{"$f":"VLOOKUP($G25,$A$1:$E$37,5,FALSE)","v":"75-2-SUPA"},8,{"$f":"VLOOKUP($K25,$A$1:$E$37,3,FALSE)","v":"GALLAND"},{"$f":"VLOOKUP($K25,$A$1:$E$37,4,FALSE)","v":"CLEMENCE"},{"$f":"VLOOKUP($K25,$A$1:$E$37,5,FALSE)","v":"75-4-PCHP"}]
[21,"AS ALMA","ANDRIOT","ALICE","75-4-LMAP",null,10,{"$f":"VLOOKUP($G26,$A$1:$E$37,3,FALSE)","v":"ILLOUZ"},{"$f":"VLOOKUP($G26,$A$1:$E$37,4,FALSE)","v":"LEANA"},{"$f":"VLOOKUP($G26,$A$1:$E$37,5,FALSE)","v":"75-4-LMAP"},9,{"$f":"VLOOKUP($K26,$A$1:$E$37,3,FALSE)","v":"GARREC"},{"$f":"VLOOKUP($K26,$A$1:$E$37,4,FALSE)","v":"JULIE"},{"$f":"VLOOKUP($K26,$A$1:$E$37,5,FALSE)","v":"75-2-SLHP"}]
[22,"AS ALMA","RISSE-RAUD","MAHAUT","75-4-LMAP",null,23,{"$f":"VLOOKUP($G27,$A$1:$E$37,3,FALSE)","v":0},{"$f":"VLOOKUP($G27,$A$1:$E$37,4,FALSE)","v":0},{"$f":"VLOOKUP($G27,$A$1:$E$37,5,FALSE)","v":0},24,{"$f":"VLOOKUP($K27,$A$1:$E$37,3,FALSE)","v":"ZOGHBI DE MEDLEGE GUILANI"},{"$f":"VLOOKUP($K27,$A$1:$E$37,4,FALSE)","v":"HENRYETTE"},{"$f":"VLOOKUP($K27,$A$1:$E$37,5,FALSE)","v":"75-4-LMAP"}]
[23,null,null,null,null,null,26,{"$f":"VLOOKUP($G28,$A$1:$E$37,3,FALSE)","v":0},{"$f":"VLOOKUP($G28,$A$1:$E$37,4,FALSE)","v":0},{"$f":"VLOOKUP($G28,$A$1:$E$37,5,FALSE)","v":0},25,{"$f":"VLOOKUP($K28,$A$1:$E$37,3,FALSE)","v":0},{"$f":"VLOOKUP($K28,$A$1:$E$37,4,FALSE)","v":0},{"$f":"VLOOKUP($K28,$A$1:$E$37,5,FALSE)","v":0}]
[24,"AS ALMA","ZOGHBI DE MEDLEGE GUILANI","HENRYETTE","75-4-LMAP"]
[25]
[26]
[27]
[28]
[29]
[30]
[31]
[32]

{"sheet":"Poule 1","index":1,"n_rows":24,"n_cols":7,"rows_kept":24,"cut":false,"hidden":false,"merged":[[0,0,0,2],[0,3,0,4],[22,0,22,1],[20,2,20,3],[23,4,23,5],[22,4,22,5],[13,0,13,6],[14,3,14,4],[23,2,23,3],[21,0,21,1],[23,0,23,1],[21,2,21,3],[19,4,19,5],[20,4,20,5],[7,0,7,6],[8,3,8,4],[8,0,8,2],[9,0,9,2],[10,0,10,2],[1,0,1,2],[1,3,1,6],[22,2,22,3],[20,0,20,1],[18,4,18,6],[11,0,11,2],[12,0,12,2],[14,0,14,2],[17,0,17,2],[18,0,18,3],[21,4,21,5],[19,0,19,1],[15,0,15,2],[16,0,16,2],[19,2,19,3]]}
[{"$f":"Engagés!C1","v":"TENNIS DE TABLE"},null,null,{"$f":"Engagés!E3","v":"MF Promo"}]
["POULE 1"]
[null,"NOM","Prénom","Sigle","Vict","Def","Classement"]
[1,{"$f":"VLOOKUP($A4,Engagés!$A$1:$E$380,3,FALSE)","v":"GROB"},{"$f":"VLOOKUP($A4,Engagés!$A$1:$E$380,4,FALSE)","v":"CAMILLE"},{"$f":"VLOOKUP($A4,Engagés!$A$1:$E$380,5,FALSE)","v":"75-4-FENP"},null,null,"1er"]
[16,{"$f":"VLOOKUP($A5,Engagés!$A$1:$E$380,3,FALSE)","v":"OYHARNART--FAYET"},{"$f":"VLOOKUP($A5,Engagés!$A$1:$E$380,4,FALSE)","v":"HORTENSE"},{"$f":"VLOOKUP($A5,Engagés!$A$1:$E$380,5,FALSE)","v":"75-4-LMAP"},null,null,"2ème"]
[17,{"$f":"VLOOKUP($A6,Engagés!$A$1:$E$380,3,FALSE)","v":"MATHIAN"},{"$f":"VLOOKUP($A6,Engagés!$A$1:$E$380,4,FALSE)","v":"RAPHAELLE"},{"$f":"VLOOKUP($A6,Engagés!$A$1:$E$380,5,FALSE)","v":"75-2-SUPA"},null,null,"3ème"]
[32,{"$f":"VLOOKUP($A7,Engagés!$A$1:$E$380,3,FALSE)","v":0},{"$f":"VLOOKUP($A7,Engagés!$A$1:$E$380,4,FALSE)","v":0},{"$f":"VLOOKUP($A7,Engagés!$A$1:$E$380,5,FALSE)","v":0},null,null,"4ème"]
["Si poule de 4 joueurs alors…"]
["Déroulement",null,null,"Joueurs A contre Joueur B",null,"Vainqueur","Score"]
["Match 1",null,null,{"$f":"B4","v":"GROB"},{"$f":"B7","v":0}]
["Match 2",null,null,{"$f":"B5","v":"OYHARNART--FAYET"},{"$f":"B6","v":"MATHIAN"}]
["Finale vainqueur Match 1 contre vainqueur Match 2",null,null,{"$f":"IF(F10=\"\",\"\",F10)","v":""},{"$f":"IF(F11=\"\",\"\",F11)","v":""}]
["Petite finale entre les deux perdants des matchs 1 et 2",null,null,{"$f":"IF(D12=\"\",\"\",IF(D12=D10,E10,D10))","v":""},{"$f":"IF(E12=\"\",\"\",IF(E12=D11,E11,D11))","v":""}]
["Si poule de 3 joueurs alors…"]
["Déroulement",null,null,"Joueurs A contre Joueur B",null,"Vainqueur","Score"]
["Match 1",null,null,{"$f":"B4","v":"GROB"},{"$f":"B6","v":"MATHIAN"},0]
["Match 2",null,null,{"$f":"B5","v":"OYHARNART--FAYET"},{"$f":"B6","v":"MATHIAN"},0]
["Match 3",null,null,{"$f":"B4","v":"GROB"},{"$f":"B5","v":"OYHARNART--FAYET"},0]
["CLASSEMENT",null,null,null,{"$f":"A2","v":"POULE 1"}]
[null,null,"NOM",null,"PRENOM",null,"SIGLE"]
["1er",null,{"$f":"IF($G$4=\"1er\", $B$4,IF($G$5=\"1er\",$B$5,IF($G$6=\"1er\",$B$6,IF($G$7=\"1er\",$B$7,\"\"))))","v":"GROB"},null,{"$f":"IF($G$4=\"1er\", $C$4,IF($G$5=\"1er\",$C$5,IF($G$6=\"1er\",$C$6,IF($G$7=\"1er\",$C$7,\"\"))))","v":"CAMILLE"},null,{"$f":"IF($G$4=\"1er\", $D$4,IF($G$5=\"1er\",$D$5,IF($G$6=\"1er\",$D$6,IF($G$7=\"1er\",$D$7,\"\"))))","v":"75-4-FENP"}]
["2ème",null,{"$f":"IF($G$4=\"2ème\", $B$4,IF($G$5=\"2ème\",$B$5,IF($G$6=\"2ème\",$B$6,IF($G$7=\"2ème\",$B$7,\"\"))))","v":"OYHARNART--FAYET"},null,{"$f":"IF($G$4=\"2ème\", $C$4,IF($G$5=\"2ème\",$C$5,IF($G$6=\"2ème\",$C$6,IF($G$7=\"2ème\",$C$7,\"\"))))","v":"HORTENSE"},null,{"$f":"IF($G$4=\"2ème\", $D$4,IF($G$5=\"2ème\",$D$5,IF($G$6=\"2ème\",$D$6,IF($G$7=\"2ème\",$D$7,\"\"))))","v":"75-4-LMAP"}]
["3ème",null,{"$f":"IF($G$4=\"3ème\", $B$4,IF($G$5=\"3ème\",$B$5,IF($G$6=\"3ème\",$B$6,IF($G$7=\"3ème\",$B$7,\"\"))))","v":"MATHIAN"},null,{"$f":"IF($G$4=\"3ème\", $C$4,IF($G$5=\"3ème\",$C$5,IF($G$6=\"3ème\",$C$6,IF($G$7=\"3ème\",$C$7,\"\"))))","v":"RAPHAELLE"},null,{"$f":"IF($G$4=\"3ème\", $D$4,IF($G$5=\"3ème\",$D$5,IF($G$6=\"3ème\",$D$6,IF($G$7=\"3ème\",$D$7,\"\"))))","v":"75-2-SUPA"}]
["4ème",null,{"$f":"IF($G$4=\"4ème\", $B$4,IF($G$5=\"4ème\",$B$5,IF($G$6=\"4ème\",$B$6,IF($G$7=\"4ème\",$B$7,\"\"))))","v":0},null,{"$f":"IF($G$4=\"4ème\", $C$4,IF($G$5=\"4ème\",$C$5,IF($G$6=\"4ème\",$C$6,IF($G$7=\"4ème\",$C$7,\"\"))))","v":0},null,{"$f":"IF($G$4=\"4ème\", $D$4,IF($G$5=\"4ème\",$D$5,IF($G$6=\"4ème\",$D$6,IF($G$7=\"4ème\",$D$7,\"\"))))","v":0}]

{"sheet":"Poule 2","index":2,"n_rows":24,"n_cols":7,"rows_kept":24,"cut":false,"hidden":false,"merged":[[0,3,0,4],[15,0,15,2],[16,0,16,2],[1,0,1,2],[1,3,1,6],[7,0,7,6],[8,0,8,2],[8,3,8,4],[9,0,9,2],[10,0,10,2],[11,0,11,2],[12,0,12,2],[13,0,13,6],[14,0,14,2],[14,3,14,4],[0,0,0,2],[17,0,17,2],[18,0,18,3],[18,4,18,6],[20,0,20,1],[20,2,20,3],[20,4,20,5],[19,0,19,1],[19,2,19,3],[19,4,19,5],[23,0,23,1],[23,2,23,3],[23,4,23,5],[21,0,21,1],[21,2,21,3],[21,4,21,5],[22,0,22,1],[22,2,22,3],[22,4,22,5]]}
[{"$f":"Engagés!C1","v":"TENNIS DE TABLE"},null,null,{"$f":"Engagés!E3","v":"MF Promo"}]
["POULE 2"]
[null,"NOM","Prénom","Sigle","Vict","Def","Classement"]
[2,{"$f":"VLOOKUP($A4,Engagés!$A$1:$E$380,3,FALSE)","v":"DE BATTISTA"},{"$f":"VLOOKUP($A4,Engagés!$A$1:$E$380,4,FALSE)","v":"TIPHAINE"},{"$f":"VLOOKUP($A4,Engagés!$A$1:$E$380,5,FALSE)","v":"75-4-STAP"},null,null,"1er"]
[15,{"$f":"VLOOKUP($A5,Engagés!$A$1:$E$380,3,FALSE)","v":"THOREL"},{"$f":"VLOOKUP($A5,Engagés!$A$1:$E$380,4,FALSE)","v":"ZELIE"},{"$f":"VLOOKUP($A5,Engagés!$A$1:$E$380,5,FALSE)","v":"75-4-FENP"},null,null,"3ème"]
[18,{"$f":"VLOOKUP($A6,Engagés!$A$1:$E$380,3,FALSE)","v":"DENIS"},{"$f":"VLOOKUP($A6,Engagés!$A$1:$E$380,4,FALSE)","v":"PRUNE"},{"$f":"VLOOKUP($A6,Engagés!$A$1:$E$380,5,FALSE)","v":"75-4-LMAP"},null,null,"2ème"]
[31,{"$f":"VLOOKUP($A7,Engagés!$A$1:$E$380,3,FALSE)","v":0},{"$f":"VLOOKUP($A7,Engagés!$A$1:$E$380,4,FALSE)","v":0},{"$f":"VLOOKUP($A7,Engagés!$A$1:$E$380,5,FALSE)","v":0},null,null,"4ème"]
["Si poule de 4 joueurs alors…"]
["Déroulement",null,null,"Joueurs A contre Joueur B",null,"Vainqueur","Score"]
["Match 1",null,null,{"$f":"B4","v":"DE BATTISTA"},{"$f":"B7","v":0}]
["Match 2",null,null,{"$f":"B5","v":"THOREL"},{"$f":"B6","v":"DENIS"}]
["Finale vainqueur Match 1 contre vainqueur Match 2",null,null,{"$f":"IF(F10=\"\",\"\",F10)","v":""},{"$f":"IF(F11=\"\",\"\",F11)","v":""}]
["Petite finale entre les deux perdants des matchs 1 et 2",null,null,{"$f":"IF(D12=\"\",\"\",IF(D12=D10,E10,D10))","v":""},{"$f":"IF(E12=\"\",\"\",IF(E12=D11,E11,D11))","v":""}]
["Si poule de 3 joueurs alors…"]
["Déroulement",null,null,"Joueurs A contre Joueur B",null,"Vainqueur","Score"]
["Match 1",null,null,{"$f":"B4","v":"DE BATTISTA"},{"$f":"B6","v":"DENIS"},0]
["Match 2",null,null,{"$f":"B5","v":"THOREL"},{"$f":"B6","v":"DENIS"},0]
["Match 3",null,null,{"$f":"B4","v":"DE BATTISTA"},{"$f":"B5","v":"THOREL"},0]
["CLASSEMENT",null,null,null,{"$f":"A2","v":"POULE 2"}]
[null,null,"NOM",null,"PRENOM",null,"SIGLE"]
["1er",null,{"$f":"IF($G$4=\"1er\", $B$4,IF($G$5=\"1er\",$B$5,IF($G$6=\"1er\",$B$6,IF($G$7=\"1er\",$B$7,\"\"))))","v":"DE BATTISTA"},null,{"$f":"IF($G$4=\"1er\", $C$4,IF($G$5=\"1er\",$C$5,IF($G$6=\"1er\",$C$6,IF($G$7=\"1er\",$C$7,\"\"))))","v":"TIPHAINE"},null,{"$f":"IF($G$4=\"1er\", $D$4,IF($G$5=\"1er\",$D$5,IF($G$6=\"1er\",$D$6,IF($G$7=\"1er\",$D$7,\"\"))))","v":"75-4-STAP"}]
["2ème",null,{"$f":"IF($G$4=\"2ème\", $B$4,IF($G$5=\"2ème\",$B$5,IF($G$6=\"2ème\",$B$6,IF($G$7=\"2ème\",$B$7,\"\"))))","v":"DENIS"},null,{"$f":"IF($G$4=\"2ème\", $C$4,IF($G$5=\"2ème\",$C$5,IF($G$6=\"2ème\",$C$6,IF($G$7=\"2ème\",$C$7,\"\"))))","v":"PRUNE"},null,{"$f":"IF($G$4=\"2ème\", $D$4,IF($G$5=\"2ème\",$D$5,IF($G$6=\"2ème\",$D$6,IF($G$7=\"2ème\",$D$7,\"\"))))","v":"75-4-LMAP"}]
["3ème",null,{"$f":"IF($G$4=\"3ème\", $B$4,IF($G$5=\"3ème\",$B$5,IF($G$6=\"3ème\",$B$6,IF($G$7=\"3ème\",$B$7,\"\"))))","v":"THOREL"},null,{"$f":"IF($G$4=\"3ème\", $C$4,IF($G$5=\"3ème\",$C$5,IF($G$6=\"3ème\",$C$6,IF($G$7=\"3ème\",$C$7,\"\"))))","v":"ZELIE"},null,{"$f":"IF($G$4=\"3ème\", $D$4,IF($G$5=\"3ème\",$D$5,IF($G$6=\"3ème\",$D$6,IF($G$7=\"3ème\",$D$7,\"\"))))","v":"75-4-FENP"}]
["4ème",null,{"$f":"IF($G$4=\"4ème\", $B$4,IF($G$5=\"4ème\",$B$5,IF($G$6=\"4ème\",$B$6,IF($G$7=\"4ème\",$B$7,\"\"))))","v":0},null,{"$f":"IF($G$4=\"4ème\", $C$4,IF($G$5=\"4ème\",$C$5,IF($G$6=\"4ème\",$C$6,IF($G$7=\"4ème\",$C$7,\"\"))))","v":0},null,{"$f":"IF($G$4=\"4ème\", $D$4,IF($G$5=\"4ème\",$D$5,IF($G$6=\"4ème\",$D$6,IF($G$7=\"4ème\",$D$7,\"\"))))","v":0}]

{"sheet":"Poule 3","index":3,"n_rows":24,"n_cols":7,"rows_kept":24,"cut":false,"hidden":false,"merged":[[0,3,0,4],[15,0,15,2],[16,0,16,2],[1,0,1,2],[1,3,1,6],[7,0,7,6],[8,0,8,2],[8,3,8,4],[9,0,9,2],[10,0,10,2],[11,0,11,2],[12,0,12,2],[13,0,13,6],[14,0,14,2],[14,3,14,4],[0,0,0,2],[17,0,17,2],[18,0,18,3],[18,4,18,6],[20,0,20,1],[20,2,20,3],[20,4,20,5],[19,0,19,1],[19,2,19,3],[19,4,19,5],[23,0,23,1],[23,2,23,3],[23,4,23,5],[21,0,21,1],[21,2,21,3],[21,4,21,5],[22,0,22,1],[22,2,22,3],[22,4,22,5]]}
[{"$f":"Engagés!C1","v":"TENNIS DE TABLE"},null,null,{"$f":"Engagés!E3","v":"MF Promo"}]
["POULE 3"]
[null,"NOM","Prénom","Sigle","Vict","Def","Classement"]
[3,{"$f":"VLOOKUP($A4,Engagés!$A$1:$E$380,3,FALSE)","v":"DE POULPIQUET DU HALGOUET"},{"$f":"VLOOKUP($A4,Engagés!$A$1:$E$380,4,FALSE)","v":"SOLINE"},{"$f":"VLOOKUP($A4,Engagés!$A$1:$E$380,5,FALSE)","v":"75-4-STAP"},null,null,"1er"]
[14,{"$f":"VLOOKUP($A5,Engagés!$A$1:$E$380,3,FALSE)","v":"ASHIKHMIN"},{"$f":"VLOOKUP($A5,Engagés!$A$1:$E$380,4,FALSE)","v":"DOUNIA"},{"$f":"VLOOKUP($A5,Engagés!$A$1:$E$380,5,FALSE)","v":"75-4-LMAP"},null,null,"2ème"]
[19,{"$f":"VLOOKUP($A6,Engagés!$A$1:$E$380,3,FALSE)","v":0},{"$f":"VLOOKUP($A6,Engagés!$A$1:$E$380,4,FALSE)","v":0},{"$f":"VLOOKUP($A6,Engagés!$A$1:$E$380,5,FALSE)","v":0},null,null,"3ème"]
[30,{"$f":"VLOOKUP($A7,Engagés!$A$1:$E$380,3,FALSE)","v":0},{"$f":"VLOOKUP($A7,Engagés!$A$1:$E$380,4,FALSE)","v":0},{"$f":"VLOOKUP($A7,Engagés!$A$1:$E$380,5,FALSE)","v":0},null,null,"4ème"]
["Si poule de 4 joueurs alors…"]
["Déroulement",null,null,"Joueurs A contre Joueur B",null,"Vainqueur","Score"]
["Match 1",null,null,{"$f":"B4","v":"DE POULPIQUET DU HALGOUET"},{"$f":"B7","v":0}]
["Match 2",null,null,{"$f":"B5","v":"ASHIKHMIN"},{"$f":"B6","v":0}]
["Finale vainqueur Match 1 contre vainqueur Match 2",null,null,{"$f":"IF(F10=\"\",\"\",F10)","v":""},{"$f":"IF(F11=\"\",\"\",F11)","v":""}]
["Petite finale entre les deux perdants des matchs 1 et 2",null,null,{"$f":"IF(D12=\"\",\"\",IF(D12=D10,E10,D10))","v":""},{"$f":"IF(E12=\"\",\"\",IF(E12=D11,E11,D11))","v":""}]
["Si poule de 3 joueurs alors…"]
["Déroulement",null,null,"Joueurs A contre Joueur B",null,"Vainqueur","Score"]
["Match 1",null,null,{"$f":"B4","v":"DE POULPIQUET DU HALGOUET"},{"$f":"B6","v":0},0]
["Match 2",null,null,{"$f":"B5","v":"ASHIKHMIN"},{"$f":"B6","v":0},0]
["Match 3",null,null,{"$f":"B4","v":"DE POULPIQUET DU HALGOUET"},{"$f":"B5","v":"ASHIKHMIN"},0]
["CLASSEMENT",null,null,null,{"$f":"A2","v":"POULE 3"}]
[null,null,"NOM",null,"PRENOM",null,"SIGLE"]
["1er",null,{"$f":"IF($G$4=\"1er\", $B$4,IF($G$5=\"1er\",$B$5,IF($G$6=\"1er\",$B$6,IF($G$7=\"1er\",$B$7,\"\"))))","v":"DE POULPIQUET DU HALGOUET"},null,{"$f":"IF($G$4=\"1er\", $C$4,IF($G$5=\"1er\",$C$5,IF($G$6=\"1er\",$C$6,IF($G$7=\"1er\",$C$7,\"\"))))","v":"SOLINE"},null,{"$f":"IF($G$4=\"1er\", $D$4,IF($G$5=\"1er\",$D$5,IF($G$6=\"1er\",$D$6,IF($G$7=\"1er\",$D$7,\"\"))))","v":"75-4-STAP"}]
["2ème",null,{"$f":"IF($G$4=\"2ème\", $B$4,IF($G$5=\"2ème\",$B$5,IF($G$6=\"2ème\",$B$6,IF($G$7=\"2ème\",$B$7,\"\"))))","v":"ASHIKHMIN"},null,{"$f":"IF($G$4=\"2ème\", $C$4,IF($G$5=\"2ème\",$C$5,IF($G$6=\"2ème\",$C$6,IF($G$7=\"2ème\",$C$7,\"\"))))","v":"DOUNIA"},null,{"$f":"IF($G$4=\"2ème\", $D$4,IF($G$5=\"2ème\",$D$5,IF($G$6=\"2ème\",$D$6,IF($G$7=\"2ème\",$D$7,\"\"))))","v":"75-4-LMAP"}]
["3ème",null,{"$f":"IF($G$4=\"3ème\", $B$4,IF($G$5=\"3ème\",$B$5,IF($G$6=\"3ème\",$B$6,IF($G$7=\"3ème\",$B$7,\"\"))))","v":0},null,{"$f":"IF($G$4=\"3ème\", $C$4,IF($G$5=\"3ème\",$C$5,IF($G$6=\"3ème\",$C$6,IF($G$7=\"3ème\",$C$7,\"\"))))","v":0},null,{"$f":"IF($G$4=\"3ème\", $D$4,IF($G$5=\"3ème\",$D$5,IF($G$6=\"3ème\",$D$6,IF($G$7=\"3ème\",$D$7,\"\"))))","v":0}]
["4ème",null,{"$f":"IF($G$4=\"4ème\", $B$4,IF($G$5=\"4ème\",$B$5,IF($G$6=\"4ème\",$B$6,IF($G$7=\"4ème\",$B$7,\"\"))))","v":0},null,{"$f":"IF($G$4=\"4ème\", $C$4,IF($G$5=\"4ème\",$C$5,IF($G$6=\"4ème\",$C$6,IF($G$7=\"4ème\",$C$7,\"\"))))","v":0},null,{"$f":"IF($G$4=\"4ème\", $D$4,IF($G$5=\"4ème\",$D$5,IF($G$6=\"4ème\",$D$6,IF($G$7=\"4ème\",$D$7,\"\"))))","v":0}]

{"sheet":"Poule 4","index":4,"n_rows":24,"n_cols":7,"rows_kept":24,"cut":false,"hidden":false,"merged":[[0,3,0,4],[15,0,15,2],[16,0,16,2],[1,0,1,2],[1,3,1,6],[7,0,7,6],[8,0,8,2],[8,3,8,4],[9,0,9,2],[10,0,10,2],[11,0,11,2],[12,0,12,2],[13,0,13,6],[14,0,14,2],[14,3,14,4],[0,0,0,2],[17,0,17,2],[18,0,18,3],[18,4,18,6],[20,0,20,1],[20,2,20,3],[20,4,20,5],[19,0,19,1],[19,2,19,3],[19,4,19,5],[23,0,23,1],[23,2,23,3],[23,4,23,5],[21,0,21,1],[21,2,21,3],[21,4,21,5],[22,0,22,1],[22,2,22,3],[22,4,22,5]]}
[{"$f":"Engagés!C1","v":"TENNIS DE TABLE"},null,null,{"$f":"Engagés!E3","v":"MF Promo"}]
["POULE 4"]
[null,"NOM","Prénom","Sigle","Vict","Def","Classement"]
[4,{"$f":"VLOOKUP($A4,Engagés!$A$1:$E$380,3,FALSE)","v":"JEAN"},{"$f":"VLOOKUP($A4,Engagés!$A$1:$E$380,4,FALSE)","v":"ALICE"},{"$f":"VLOOKUP($A4,Engagés!$A$1:$E$380,5,FALSE)","v":"75-4-FENP"},null,null,"1er"]
[13,{"$f":"VLOOKUP($A5,Engagés!$A$1:$E$380,3,FALSE)","v":"MAHU"},{"$f":"VLOOKUP($A5,Engagés!$A$1:$E$380,4,FALSE)","v":"ELOISE"},{"$f":"VLOOKUP($A5,Engagés!$A$1:$E$380,5,FALSE)","v":"75-2-SLHP"},null,null,"2ème"]
[20,{"$f":"VLOOKUP($A6,Engagés!$A$1:$E$380,3,FALSE)","v":"SALOME"},{"$f":"VLOOKUP($A6,Engagés!$A$1:$E$380,4,FALSE)","v":"JOSEPHINE"},{"$f":"VLOOKUP($A6,Engagés!$A$1:$E$380,5,FALSE)","v":"75-4-LMAP"},null,null,"3ème"]
[29,{"$f":"VLOOKUP($A7,Engagés!$A$1:$E$380,3,FALSE)","v":0},{"$f":"VLOOKUP($A7,Engagés!$A$1:$E$380,4,FALSE)","v":0},{"$f":"VLOOKUP($A7,Engagés!$A$1:$E$380,5,FALSE)","v":0},null,null,"4ème"]
["Si poule de 4 joueurs alors…"]
["Déroulement",null,null,"Joueurs A contre Joueur B",null,"Vainqueur","Score"]
["Match 1",null,null,{"$f":"B4","v":"JEAN"},{"$f":"B7","v":0},0]
["Match 2",null,null,{"$f":"B5","v":"MAHU"},{"$f":"B6","v":"SALOME"},0]
["Finale vainqueur Match 1 contre vainqueur Match 2",null,null,{"$f":"IF(F10=\"\",\"\",F10)","v":0},{"$f":"IF(F11=\"\",\"\",F11)","v":0},0]
["Petite finale entre les deux perdants des matchs 1 et 2",null,null,null,null,0]
["Si poule de 3 joueurs alors…"]
["Déroulement",null,null,"Joueurs A contre Joueur B",null,"Vainqueur","Score"]
["Match 1",null,null,{"$f":"B4","v":"JEAN"},{"$f":"B6","v":"SALOME"}]
["Match 2",null,null,{"$f":"B5","v":"MAHU"},{"$f":"B6","v":"SALOME"}]
["Match 3",null,null,{"$f":"B4","v":"JEAN"},{"$f":"B5","v":"MAHU"}]
["CLASSEMENT",null,null,null,{"$f":"A2","v":"POULE 4"}]
[null,null,"NOM",null,"PRENOM",null,"SIGLE"]
["1er",null,{"$f":"IF($G$4=\"1er\", $B$4,IF($G$5=\"1er\",$B$5,IF($G$6=\"1er\",$B$6,IF($G$7=\"1er\",$B$7,\"\"))))","v":"JEAN"},null,{"$f":"IF($G$4=\"1er\", $C$4,IF($G$5=\"1er\",$C$5,IF($G$6=\"1er\",$C$6,IF($G$7=\"1er\",$C$7,\"\"))))","v":"ALICE"},null,{"$f":"IF($G$4=\"1er\", $D$4,IF($G$5=\"1er\",$D$5,IF($G$6=\"1er\",$D$6,IF($G$7=\"1er\",$D$7,\"\"))))","v":"75-4-FENP"}]
["2ème",null,{"$f":"IF($G$4=\"2ème\", $B$4,IF($G$5=\"2ème\",$B$5,IF($G$6=\"2ème\",$B$6,IF($G$7=\"2ème\",$B$7,\"\"))))","v":"MAHU"},null,{"$f":"IF($G$4=\"2ème\", $C$4,IF($G$5=\"2ème\",$C$5,IF($G$6=\"2ème\",$C$6,IF($G$7=\"2ème\",$C$7,\"\"))))","v":"ELOISE"},null,{"$f":"IF($G$4=\"2ème\", $D$4,IF($G$5=\"2ème\",$D$5,IF($G$6=\"2ème\",$D$6,IF($G$7=\"2ème\",$D$7,\"\"))))","v":"75-2-SLHP"}]
["3ème",null,{"$f":"IF($G$4=\"3ème\", $B$4,IF($G$5=\"3ème\",$B$5,IF($G$6=\"3ème\",$B$6,IF($G$7=\"3ème\",$B$7,\"\"))))","v":"SALOME"},null,{"$f":"IF($G$4=\"3ème\", $C$4,IF($G$5=\"3ème\",$C$5,IF($G$6=\"3ème\",$C$6,IF($G$7=\"3ème\",$C$7,\"\"))))","v":"JOSEPHINE"},null,{"$f":"IF($G$4=\"3ème\", $D$4,IF($G$5=\"3ème\",$D$5,IF($G$6=\"3ème\",$D$6,IF($G$7=\"3ème\",$D$7,\"\"))))","v":"75-4-LMAP"}]
["4ème",null,{"$f":"IF($G$4=\"4ème\", $B$4,IF($G$5=\"4ème\",$B$5,IF($G$6=\"4ème\",$B$6,IF($G$7=\"4ème\",$B$7,\"\"))))","v":0},null,{"$f":"IF($G$4=\"4ème\", $C$4,IF($G$5=\"4ème\",$C$5,IF($G$6=\"4ème\",$C$6,IF($G$7=\"4ème\",$C$7,\"\"))))","v":0},null,{"$f":"IF($G$4=\"4ème\", $D$4,IF($G$5=\"4ème\",$D$5,IF($G$6=\"4ème\",$D$6,IF($G$7=\"4ème\",$D$7,\"\"))))","v":0}]

{"sheet":"Poule 5","index":5,"n_rows":24,"n_cols":7,"rows_kept":24,"cut":false,"hidden":false,"merged":[[12,0,12,2],[13,0,13,6],[0,0,0,2],[0,3,0,4],[10,0,10,2],[11,0,11,2],[1,0,1,2],[1,3,1,6],[7,0,7,6],[8,0,8,2],[8,3,8,4],[9,0,9,2],[20,0,20,1],[20,2,20,3],[20,4,20,5],[14,0,14,2],[14,3,14,4],[15,0,15,2],[18,4,18,6],[19,0,19,1],[19,2,19,3],[19,4,19,5],[16,0,16,2],[17,0,17,2],[18,0,18,3],[23,0,23,1],[23,2,23,3],[23,4,23,5],[21,0,21,1],[21,2,21,3],[21,4,21,5],[22,0,22,1],[22,2,22,3],[22,4,22,5]]}
[{"$f":"Engagés!C1","v":"TENNIS DE TABLE"},null,null,{"$f":"Engagés!E3","v":"MF Promo"}]
["POULE 5"]
[null,"NOM","Prénom","Sigle","Vict","Def","Classement"]
[5,{"$f":"VLOOKUP($A4,Engagés!$A$1:$E$380,3,FALSE)","v":"BIZARD"},{"$f":"VLOOKUP($A4,Engagés!$A$1:$E$380,4,FALSE)","v":"DARYA"},{"$f":"VLOOKUP($A4,Engagés!$A$1:$E$380,5,FALSE)","v":"75-4-LMAP"},null,null,"1er"]
[12,{"$f":"VLOOKUP($A5,Engagés!$A$1:$E$380,3,FALSE)","v":0},{"$f":"VLOOKUP($A5,Engagés!$A$1:$E$380,4,FALSE)","v":0},{"$f":"VLOOKUP($A5,Engagés!$A$1:$E$380,5,FALSE)","v":0},null,null,"3ème"]
[21,{"$f":"VLOOKUP($A6,Engagés!$A$1:$E$380,3,FALSE)","v":"ANDRIOT"},{"$f":"VLOOKUP($A6,Engagés!$A$1:$E$380,4,FALSE)","v":"ALICE"},{"$f":"VLOOKUP($A6,Engagés!$A$1:$E$380,5,FALSE)","v":"75-4-LMAP"},null,null,"2ème"]
[28,{"$f":"VLOOKUP($A7,Engagés!$A$1:$E$380,3,FALSE)","v":0},{"$f":"VLOOKUP($A7,Engagés!$A$1:$E$380,4,FALSE)","v":0},{"$f":"VLOOKUP($A7,Engagés!$A$1:$E$380,5,FALSE)","v":0},null,null,"4ème"]
["Si poule de 4 joueurs alors…"]
["Déroulement",null,null,"Joueurs A contre Joueur B",null,"Vainqueur","Score"]
["Match 1",null,null,{"$f":"B4","v":"BIZARD"},{"$f":"B7","v":0},0]
["Match 2",null,null,{"$f":"B5","v":0},{"$f":"B6","v":"ANDRIOT"},0]
["Finale vainqueur Match 1 contre vainqueur Match 2",null,null,{"$f":"IF(F10=\"\",\"\",F10)","v":0},{"$f":"IF(F11=\"\",\"\",F11)","v":0},0]
["Petite finale entre les deux perdants des matchs 1 et 2",null,null,null,null,0]
["Si poule de 3 joueurs alors…"]
["Déroulement",null,null,"Joueurs A contre Joueur B",null,"Vainqueur","Score"]
["Match 1",null,null,{"$f":"B4","v":"BIZARD"},{"$f":"B6","v":"ANDRIOT"}]
["Match 2",null,null,{"$f":"B5","v":0},{"$f":"B6","v":"ANDRIOT"}]
["Match 3",null,null,{"$f":"B4","v":"BIZARD"},{"$f":"B5","v":0}]
["CLASSEMENT",null,null,null,{"$f":"A2","v":"POULE 5"}]
[null,null,"NOM",null,"PRENOM",null,"SIGLE"]
["1er",null,{"$f":"IF($G$4=\"1er\", $B$4,IF($G$5=\"1er\",$B$5,IF($G$6=\"1er\",$B$6,IF($G$7=\"1er\",$B$7,\"\"))))","v":"BIZARD"},null,{"$f":"IF($G$4=\"1er\", $C$4,IF($G$5=\"1er\",$C$5,IF($G$6=\"1er\",$C$6,IF($G$7=\"1er\",$C$7,\"\"))))","v":"DARYA"},null,{"$f":"IF($G$4=\"1er\", $D$4,IF($G$5=\"1er\",$D$5,IF($G$6=\"1er\",$D$6,IF($G$7=\"1er\",$D$7,\"\"))))","v":"75-4-LMAP"}]
["2ème",null,{"$f":"IF($G$4=\"2ème\", $B$4,IF($G$5=\"2ème\",$B$5,IF($G$6=\"2ème\",$B$6,IF($G$7=\"2ème\",$B$7,\"\"))))","v":"ANDRIOT"},null,{"$f":"IF($G$4=\"2ème\", $C$4,IF($G$5=\"2ème\",$C$5,IF($G$6=\"2ème\",$C$6,IF($G$7=\"2ème\",$C$7,\"\"))))","v":"ALICE"},null,{"$f":"IF($G$4=\"2ème\", $D$4,IF($G$5=\"2ème\",$D$5,IF($G$6=\"2ème\",$D$6,IF($G$7=\"2ème\",$D$7,\"\"))))","v":"75-4-LMAP"}]
["3ème",null,{"$f":"IF($G$4=\"3ème\", $B$4,IF($G$5=\"3ème\",$B$5,IF($G$6=\"3ème\",$B$6,IF($G$7=\"3ème\",$B$7,\"\"))))","v":0},null,{"$f":"IF($G$4=\"3ème\", $C$4,IF($G$5=\"3ème\",$C$5,IF($G$6=\"3ème\",$C$6,IF($G$7=\"3ème\",$C$7,\"\"))))","v":0},null,{"$f":"IF($G$4=\"3ème\", $D$4,IF($G$5=\"3ème\",$D$5,IF($G$6=\"3ème\",$D$6,IF($G$7=\"3ème\",$D$7,\"\"))))","v":0}]
["4ème",null,{"$f":"IF($G$4=\"4ème\", $B$4,IF($G$5=\"4ème\",$B$5,IF($G$6=\"4ème\",$B$6,IF($G$7=\"4ème\",$B$7,\"\"))))","v":0},null,{"$f":"IF($G$4=\"4ème\", $C$4,IF($G$5=\"4ème\",$C$5,IF($G$6=\"4ème\",$C$6,IF($G$7=\"4ème\",$C$7,\"\"))))","v":0},null,{"$f":"IF($G$4=\"4ème\", $D$4,IF($G$5=\"4ème\",$D$5,IF($G$6=\"4ème\",$D$6,IF($G$7=\"4ème\",$D$7,\"\"))))","v":0}]

{"sheet":"Poule 6","index":6,"n_rows":24,"n_cols":7,"rows_kept":24,"cut":false,"hidden":false,"merged":[[12,0,12,2],[13,0,13,6],[0,0,0,2],[0,3,0,4],[10,0,10,2],[11,0,11,2],[1,0,1,2],[1,3,1,6],[7,0,7,6],[8,0,8,2],[8,3,8,4],[9,0,9,2],[20,0,20,1],[20,2,20,3],[20,4,20,5],[14,0,14,2],[14,3,14,4],[15,0,15,2],[18,4,18,6],[19,0,19,1],[19,2,19,3],[19,4,19,5],[16,0,16,2],[17,0,17,2],[18,0,18,3],[23,0,23,1],[23,2,23,3],[23,4,23,5],[21,0,21,1],[21,2,21,3],[21,4,21,5],[22,0,22,1],[22,2,22,3],[22,4,22,5]]}
[{"$f":"Engagés!C1","v":"TENNIS DE TABLE"},null,null,{"$f":"Engagés!E3","v":"MF Promo"}]
["POULE 6"]
[null,"NOM","Prénom","Sigle","Vict","Def","Classement"]
[6,{"$f":"VLOOKUP($A4,Engagés!$A$1:$E$380,3,FALSE)","v":"ROY-REMY"},{"$f":"VLOOKUP($A4,Engagés!$A$1:$E$380,4,FALSE)","v":"VALENTINE"},{"$f":"VLOOKUP($A4,Engagés!$A$1:$E$380,5,FALSE)","v":"75-4-LMAP"},null,null,"1er"]
[11,{"$f":"VLOOKUP($A5,Engagés!$A$1:$E$380,3,FALSE)","v":"BONNIN"},{"$f":"VLOOKUP($A5,Engagés!$A$1:$E$380,4,FALSE)","v":"ELEONORE"},{"$f":"VLOOKUP($A5,Engagés!$A$1:$E$380,5,FALSE)","v":"75-4-BLOP"},null,null,"2ème"]
[22,{"$f":"VLOOKUP($A6,Engagés!$A$1:$E$380,3,FALSE)","v":"RISSE-RAUD"},{"$f":"VLOOKUP($A6,Engagés!$A$1:$E$380,4,FALSE)","v":"MAHAUT"},{"$f":"VLOOKUP($A6,Engagés!$A$1:$E$380,5,FALSE)","v":"75-4-LMAP"},null,null,"3ème"]
[27,{"$f":"VLOOKUP($A7,Engagés!$A$1:$E$380,3,FALSE)","v":0},{"$f":"VLOOKUP($A7,Engagés!$A$1:$E$380,4,FALSE)","v":0},{"$f":"VLOOKUP($A7,Engagés!$A$1:$E$380,5,FALSE)","v":0},null,null,"4ème"]
["Si poule de 4 joueurs alors…"]
["Déroulement",null,null,"Joueurs A contre Joueur B",null,"Vainqueur","Score"]
["Match 1",null,null,{"$f":"B4","v":"ROY-REMY"},{"$f":"B7","v":0},0]
["Match 2",null,null,{"$f":"B5","v":"BONNIN"},{"$f":"B6","v":"RISSE-RAUD"},0]
["Finale vainqueur Match 1 contre vainqueur Match 2",null,null,{"$f":"IF(F10=\"\",\"\",F10)","v":0},{"$f":"IF(F11=\"\",\"\",F11)","v":0},0]
["Petite finale entre les deux perdants des matchs 1 et 2",null,null,null,null,0]
["Si poule de 3 joueurs alors…"]
["Déroulement",null,null,"Joueurs A contre Joueur B",null,"Vainqueur","Score"]
["Match 1",null,null,{"$f":"B4","v":"ROY-REMY"},{"$f":"B6","v":"RISSE-RAUD"}]
["Match 2",null,null,{"$f":"B5","v":"BONNIN"},{"$f":"B6","v":"RISSE-RAUD"}]
["Match 3",null,null,{"$f":"B4","v":"ROY-REMY"},{"$f":"B5","v":"BONNIN"}]
["CLASSEMENT",null,null,null,{"$f":"A2","v":"POULE 6"}]
[null,null,"NOM",null,"PRENOM",null,"SIGLE"]
["1er",null,{"$f":"IF($G$4=\"1er\", $B$4,IF($G$5=\"1er\",$B$5,IF($G$6=\"1er\",$B$6,IF($G$7=\"1er\",$B$7,\"\"))))","v":"ROY-REMY"},null,{"$f":"IF($G$4=\"1er\", $C$4,IF($G$5=\"1er\",$C$5,IF($G$6=\"1er\",$C$6,IF($G$7=\"1er\",$C$7,\"\"))))","v":"VALENTINE"},null,{"$f":"IF($G$4=\"1er\", $D$4,IF($G$5=\"1er\",$D$5,IF($G$6=\"1er\",$D$6,IF($G$7=\"1er\",$D$7,\"\"))))","v":"75-4-LMAP"}]
["2ème",null,{"$f":"IF($G$4=\"2ème\", $B$4,IF($G$5=\"2ème\",$B$5,IF($G$6=\"2ème\",$B$6,IF($G$7=\"2ème\",$B$7,\"\"))))","v":"BONNIN"},null,{"$f":"IF($G$4=\"2ème\", $C$4,IF($G$5=\"2ème\",$C$5,IF($G$6=\"2ème\",$C$6,IF($G$7=\"2ème\",$C$7,\"\"))))","v":"ELEONORE"},null,{"$f":"IF($G$4=\"2ème\", $D$4,IF($G$5=\"2ème\",$D$5,IF($G$6=\"2ème\",$D$6,IF($G$7=\"2ème\",$D$7,\"\"))))","v":"75-4-BLOP"}]
["3ème",null,{"$f":"IF($G$4=\"3ème\", $B$4,IF($G$5=\"3ème\",$B$5,IF($G$6=\"3ème\",$B$6,IF($G$7=\"3ème\",$B$7,\"\"))))","v":"RISSE-RAUD"},null,{"$f":"IF($G$4=\"3ème\", $C$4,IF($G$5=\"3ème\",$C$5,IF($G$6=\"3ème\",$C$6,IF($G$7=\"3ème\",$C$7,\"\"))))","v":"MAHAUT"},null,{"$f":"IF($G$4=\"3ème\", $D$4,IF($G$5=\"3ème\",$D$5,IF($G$6=\"3ème\",$D$6,IF($G$7=\"3ème\",$D$7,\"\"))))","v":"75-4-LMAP"}]
["4ème",null,{"$f":"IF($G$4=\"4ème\", $B$4,IF($G$5=\"4ème\",$B$5,IF($G$6=\"4ème\",$B$6,IF($G$7=\"4ème\",$B$7,\"\"))))","v":0},null,{"$f":"IF($G$4=\"4ème\", $C$4,IF($G$5=\"4ème\",$C$5,IF($G$6=\"4ème\",$C$6,IF($G$7=\"4ème\",$C$7,\"\"))))","v":0},null,{"$f":"IF($G$4=\"4ème\", $D$4,IF($G$5=\"4ème\",$D$5,IF($G$6=\"4ème\",$D$6,IF($G$7=\"4ème\",$D$7,\"\"))))","v":0}]

{"sheet":"Poule 7","index":7,"n_rows":24,"n_cols":7,"rows_kept":24,"cut":false,"hidden":false,"merged":[[12,0,12,2],[13,0,13,6],[0,0,0,2],[0,3,0,4],[10,0,10,2],[11,0,11,2],[1,0,1,2],[1,3,1,6],[7,0,7,6],[8,0,8,2],[8,3,8,4],[9,0,9,2],[20,0,20,1],[20,2,20,3],[20,4,20,5],[14,0,14,2],[14,3,14,4],[15,0,15,2],[18,4,18,6],[19,0,19,1],[19,2,19,3],[19,4,19,5],[16,0,16,2],[17,0,17,2],[18,0,18,3],[23,0,23,1],[23,2,23,3],[23,4,23,5],[21,0,21,1],[21,2,21,3],[21,4,21,5],[22,0,22,1],[22,2,22,3],[22,4,22,5]]}
[{"$f":"Engagés!C1","v":"TENNIS DE TABLE"},null,null,{"$f":"Engagés!E3","v":"MF Promo"}]
["POULE 7"]
[null,"NOM","Prénom","Sigle","Vict","Def","Classement"]
[7,{"$f":"VLOOKUP($A4,Engagés!$A$1:$E$380,3,FALSE)","v":"BRUNELAT"},{"$f":"VLOOKUP($A4,Engagés!$A$1:$E$380,4,FALSE)","v":"CAMILLE"},{"$f":"VLOOKUP($A4,Engagés!$A$1:$E$380,5,FALSE)","v":"75-2-SUPA"},null,null,"2ème"]
[10,{"$f":"VLOOKUP($A5,Engagés!$A$1:$E$380,3,FALSE)","v":"ILLOUZ"},{"$f":"VLOOKUP($A5,Engagés!$A$1:$E$380,4,FALSE)","v":"LEANA"},{"$f":"VLOOKUP($A5,Engagés!$A$1:$E$380,5,FALSE)","v":"75-4-LMAP"},null,null,"1er"]
[23,{"$f":"VLOOKUP($A6,Engagés!$A$1:$E$380,3,FALSE)","v":0},{"$f":"VLOOKUP($A6,Engagés!$A$1:$E$380,4,FALSE)","v":0},{"$f":"VLOOKUP($A6,Engagés!$A$1:$E$380,5,FALSE)","v":0},null,null,"3ème"]
[26,{"$f":"VLOOKUP($A7,Engagés!$A$1:$E$380,3,FALSE)","v":0},{"$f":"VLOOKUP($A7,Engagés!$A$1:$E$380,4,FALSE)","v":0},{"$f":"VLOOKUP($A7,Engagés!$A$1:$E$380,5,FALSE)","v":0},null,null,"4ème"]
["Si poule de 4 joueurs alors…"]
["Déroulement",null,null,"Joueurs A contre Joueur B",null,"Vainqueur","Score"]
["Match 1",null,null,{"$f":"B4","v":"BRUNELAT"},{"$f":"B7","v":0},0]
["Match 2",null,null,{"$f":"B5","v":"ILLOUZ"},{"$f":"B6","v":0},0]
["Finale vainqueur Match 1 contre vainqueur Match 2",null,null,{"$f":"IF(F10=\"\",\"\",F10)","v":0},{"$f":"IF(F11=\"\",\"\",F11)","v":0},0]
["Petite finale entre les deux perdants des matchs 1 et 2",null,null,null,null,0]
["Si poule de 3 joueurs alors…"]
["Déroulement",null,null,"Joueurs A contre Joueur B",null,"Vainqueur","Score"]
["Match 1",null,null,{"$f":"B4","v":"BRUNELAT"},{"$f":"B6","v":0}]
["Match 2",null,null,{"$f":"B5","v":"ILLOUZ"},{"$f":"B6","v":0}]
["Match 3",null,null,{"$f":"B4","v":"BRUNELAT"},{"$f":"B5","v":"ILLOUZ"}]
["CLASSEMENT",null,null,null,{"$f":"A2","v":"POULE 7"}]
[null,null,"NOM",null,"PRENOM",null,"SIGLE"]
["1er",null,{"$f":"IF($G$4=\"1er\", $B$4,IF($G$5=\"1er\",$B$5,IF($G$6=\"1er\",$B$6,IF($G$7=\"1er\",$B$7,\"\"))))","v":"ILLOUZ"},null,{"$f":"IF($G$4=\"1er\", $C$4,IF($G$5=\"1er\",$C$5,IF($G$6=\"1er\",$C$6,IF($G$7=\"1er\",$C$7,\"\"))))","v":"LEANA"},null,{"$f":"IF($G$4=\"1er\", $D$4,IF($G$5=\"1er\",$D$5,IF($G$6=\"1er\",$D$6,IF($G$7=\"1er\",$D$7,\"\"))))","v":"75-4-LMAP"}]
["2ème",null,{"$f":"IF($G$4=\"2ème\", $B$4,IF($G$5=\"2ème\",$B$5,IF($G$6=\"2ème\",$B$6,IF($G$7=\"2ème\",$B$7,\"\"))))","v":"BRUNELAT"},null,{"$f":"IF($G$4=\"2ème\", $C$4,IF($G$5=\"2ème\",$C$5,IF($G$6=\"2ème\",$C$6,IF($G$7=\"2ème\",$C$7,\"\"))))","v":"CAMILLE"},null,{"$f":"IF($G$4=\"2ème\", $D$4,IF($G$5=\"2ème\",$D$5,IF($G$6=\"2ème\",$D$6,IF($G$7=\"2ème\",$D$7,\"\"))))","v":"75-2-SUPA"}]
["3ème",null,{"$f":"IF($G$4=\"3ème\", $B$4,IF($G$5=\"3ème\",$B$5,IF($G$6=\"3ème\",$B$6,IF($G$7=\"3ème\",$B$7,\"\"))))","v":0},null,{"$f":"IF($G$4=\"3ème\", $C$4,IF($G$5=\"3ème\",$C$5,IF($G$6=\"3ème\",$C$6,IF($G$7=\"3ème\",$C$7,\"\"))))","v":0},null,{"$f":"IF($G$4=\"3ème\", $D$4,IF($G$5=\"3ème\",$D$5,IF($G$6=\"3ème\",$D$6,IF($G$7=\"3ème\",$D$7,\"\"))))","v":0}]
["4ème",null,{"$f":"IF($G$4=\"4ème\", $B$4,IF($G$5=\"4ème\",$B$5,IF($G$6=\"4ème\",$B$6,IF($G$7=\"4ème\",$B$7,\"\"))))","v":0},null,{"$f":"IF($G$4=\"4ème\", $C$4,IF($G$5=\"4ème\",$C$5,IF($G$6=\"4ème\",$C$6,IF($G$7=\"4ème\",$C$7,\"\"))))","v":0},null,{"$f":"IF($G$4=\"4ème\", $D$4,IF($G$5=\"4ème\",$D$5,IF($G$6=\"4ème\",$D$6,IF($G$7=\"4ème\",$D$7,\"\"))))","v":0}]

{"sheet":"Poule 8","index":8,"n_rows":24,"n_cols":7,"rows_kept":24,"cut":false,"hidden":false,"merged":[[12,0,12,2],[13,0,13,6],[0,0,0,2],[0,3,0,4],[10,0,10,2],[11,0,11,2],[1,0,1,2],[1,3,1,6],[7,0,7,6],[8,0,8,2],[8,3,8,4],[9,0,9,2],[20,0,20,1],[20,2,20,3],[20,4,20,5],[14,0,14,2],[14,3,14,4],[15,0,15,2],[18,4,18,6],[19,0,19,1],[19,2,19,3],[19,4,19,5],[16,0,16,2],[17,0,17,2],[18,0,18,3],[23,0,23,1],[23,2,23,3],[23,4,23,5],[21,0,21,1],[21,2,21,3],[21,4,21,5],[22,0,22,1],[22,2,22,3],[22,4,22,5]]}
[{"$f":"Engagés!C1","v":"TENNIS DE TABLE"},null,null,{"$f":"Engagés!E3","v":"MF Promo"}]
["POULE 8"]
[null,"NOM","Prénom","Sigle","Vict","Def","Classement"]
[8,{"$f":"VLOOKUP($A4,Engagés!$A$1:$E$380,3,FALSE)","v":"GALLAND"},{"$f":"VLOOKUP($A4,Engagés!$A$1:$E$380,4,FALSE)","v":"CLEMENCE"},{"$f":"VLOOKUP($A4,Engagés!$A$1:$E$380,5,FALSE)","v":"75-4-PCHP"},null,null,"3ème"]
[9,{"$f":"VLOOKUP($A5,Engagés!$A$1:$E$380,3,FALSE)","v":"GARREC"},{"$f":"VLOOKUP($A5,Engagés!$A$1:$E$380,4,FALSE)","v":"JULIE"},{"$f":"VLOOKUP($A5,Engagés!$A$1:$E$380,5,FALSE)","v":"75-2-SLHP"},null,null,"1er"]
[24,{"$f":"VLOOKUP($A6,Engagés!$A$1:$E$380,3,FALSE)","v":"ZOGHBI DE MEDLEGE GUILANI"},{"$f":"VLOOKUP($A6,Engagés!$A$1:$E$380,4,FALSE)","v":"HENRYETTE"},{"$f":"VLOOKUP($A6,Engagés!$A$1:$E$380,5,FALSE)","v":"75-4-LMAP"},null,null,"2ème"]
[25,{"$f":"VLOOKUP($A7,Engagés!$A$1:$E$380,3,FALSE)","v":0},{"$f":"VLOOKUP($A7,Engagés!$A$1:$E$380,4,FALSE)","v":0},{"$f":"VLOOKUP($A7,Engagés!$A$1:$E$380,5,FALSE)","v":0},null,null,"4ème"]
["Si poule de 4 joueurs alors…"]
["Déroulement",null,null,"Joueurs A contre Joueur B",null,"Vainqueur","Score"]
["Match 1",null,null,{"$f":"B4","v":"GALLAND"},{"$f":"B7","v":0},0]
["Match 2",null,null,{"$f":"B5","v":"GARREC"},{"$f":"B6","v":"ZOGHBI DE MEDLEGE GUILANI"},0]
["Finale vainqueur Match 1 contre vainqueur Match 2",null,null,{"$f":"IF(F10=\"\",\"\",F10)","v":0},{"$f":"IF(F11=\"\",\"\",F11)","v":0},0]
["Petite finale entre les deux perdants des matchs 1 et 2",null,null,null,null,0]
["Si poule de 3 joueurs alors…"]
["Déroulement",null,null,"Joueurs A contre Joueur B",null,"Vainqueur","Score"]
["Match 1",null,null,{"$f":"B4","v":"GALLAND"},{"$f":"B6","v":"ZOGHBI DE MEDLEGE GUILANI"}]
["Match 2",null,null,{"$f":"B5","v":"GARREC"},{"$f":"B6","v":"ZOGHBI DE MEDLEGE GUILANI"}]
["Match 3",null,null,{"$f":"B4","v":"GALLAND"},{"$f":"B5","v":"GARREC"}]
["CLASSEMENT",null,null,null,{"$f":"A2","v":"POULE 8"}]
[null,null,"NOM",null,"PRENOM",null,"SIGLE"]
["1er",null,{"$f":"IF($G$4=\"1er\", $B$4,IF($G$5=\"1er\",$B$5,IF($G$6=\"1er\",$B$6,IF($G$7=\"1er\",$B$7,\"\"))))","v":"GARREC"},null,{"$f":"IF($G$4=\"1er\", $C$4,IF($G$5=\"1er\",$C$5,IF($G$6=\"1er\",$C$6,IF($G$7=\"1er\",$C$7,\"\"))))","v":"JULIE"},null,{"$f":"IF($G$4=\"1er\", $D$4,IF($G$5=\"1er\",$D$5,IF($G$6=\"1er\",$D$6,IF($G$7=\"1er\",$D$7,\"\"))))","v":"75-2-SLHP"}]
["2ème",null,{"$f":"IF($G$4=\"2ème\", $B$4,IF($G$5=\"2ème\",$B$5,IF($G$6=\"2ème\",$B$6,IF($G$7=\"2ème\",$B$7,\"\"))))","v":"ZOGHBI DE MEDLEGE GUILANI"},null,{"$f":"IF($G$4=\"2ème\", $C$4,IF($G$5=\"2ème\",$C$5,IF($G$6=\"2ème\",$C$6,IF($G$7=\"2ème\",$C$7,\"\"))))","v":"HENRYETTE"},null,{"$f":"IF($G$4=\"2ème\", $D$4,IF($G$5=\"2ème\",$D$5,IF($G$6=\"2ème\",$D$6,IF($G$7=\"2ème\",$D$7,\"\"))))","v":"75-4-LMAP"}]
["3ème",null,{"$f":"IF($G$4=\"3ème\", $B$4,IF($G$5=\"3ème\",$B$5,IF($G$6=\"3ème\",$B$6,IF($G$7=\"3ème\",$B$7,\"\"))))","v":"GALLAND"},null,{"$f":"IF($G$4=\"3ème\", $C$4,IF($G$5=\"3ème\",$C$5,IF($G$6=\"3ème\",$C$6,IF($G$7=\"3ème\",$C$7,\"\"))))","v":"CLEMENCE"},null,{"$f":"IF($G$4=\"3ème\", $D$4,IF($G$5=\"3ème\",$D$5,IF($G$6=\"3ème\",$D$6,IF($G$7=\"3ème\",$D$7,\"\"))))","v":"75-4-PCHP"}]
["4ème",null,{"$f":"IF($G$4=\"4ème\", $B$4,IF($G$5=\"4ème\",$B$5,IF($G$6=\"4ème\",$B$6,IF($G$7=\"4ème\",$B$7,\"\"))))","v":0},null,{"$f":"IF($G$4=\"4ème\", $C$4,IF($G$5=\"4ème\",$C$5,IF($G$6=\"4ème\",$C$6,IF($G$7=\"4ème\",$C$7,\"\"))))","v":0},null,{"$f":"IF($G$4=\"4ème\", $D$4,IF($G$5=\"4ème\",$D$5,IF($G$6=\"4ème\",$D$6,IF($G$7=\"4ème\",$D$7,\"\"))))","v":0}]

{"sheet":"Résultats de poule","index":9,"n_rows":10,"n_cols":16,"rows_kept":10,"cut":false,"hidden":false,"merged":[[0,0,0,3],[0,4,0,7],[0,8,0,11],[0,12,0,15],[5,0,5,3],[5,4,5,7],[5,8,5,11],[5,12,5,15]]}
["Poule 1",null,null,null,"Poule 2",null,null,null,"Poule 3",null,null,null,"Poule 4"]
["1er",{"$f":"'Poule 1'!$C21","v":"GROB"},{"$f":"'Poule 1'!$E21","v":"CAMILLE"},{"$f":"'Poule 1'!$G21","v":"75-4-FENP"},"1er",{"$f":"'Poule 2'!$C21","v":"DE BATTISTA"},{"$f":"'Poule 2'!$E21","v":"TIPHAINE"},{"$f":"'Poule 2'!$G21","v":"75-4-STAP"},"1er",{"$f":"'Poule 3'!$C21","v":"DE POULPIQUET DU HALGOUET"},{"$f":"'Poule 3'!$E21","v":"SOLINE"},{"$f":"'Poule 3'!$G21","v":"75-4-STAP"},"1er",{"$f":"'Poule 4'!$C21","v":"JEAN"},{"$f":"'Poule 4'!$E21","v":"ALICE"},{"$f":"'Poule 4'!$G21","v":"75-4-FENP"}]
["2ème",{"$f":"'Poule 1'!$C22","v":"OYHARNART--FAYET"},{"$f":"'Poule 1'!$E22","v":"HORTENSE"},{"$f":"'Poule 1'!$G22","v":"75-4-LMAP"},"2ème",{"$f":"'Poule 2'!$C22","v":"DENIS"},{"$f":"'Poule 2'!$E22","v":"PRUNE"},{"$f":"'Poule 2'!$G22","v":"75-4-LMAP"},"2ème",{"$f":"'Poule 3'!$C22","v":"ASHIKHMIN"},{"$f":"'Poule 3'!$E22","v":"DOUNIA"},{"$f":"'Poule 3'!$G22","v":"75-4-LMAP"},"2ème",{"$f":"'Poule 4'!$C22","v":"MAHU"},{"$f":"'Poule 4'!$E22","v":"ELOISE"},{"$f":"'Poule 4'!$G22","v":"75-2-SLHP"}]
["3ème",{"$f":"'Poule 1'!$C23","v":"MATHIAN"},{"$f":"'Poule 1'!$E23","v":"RAPHAELLE"},{"$f":"'Poule 1'!$G23","v":"75-2-SUPA"},"3ème",{"$f":"'Poule 2'!$C23","v":"THOREL"},{"$f":"'Poule 2'!$E23","v":"ZELIE"},{"$f":"'Poule 2'!$G23","v":"75-4-FENP"},"3ème",{"$f":"'Poule 3'!$C23","v":0},{"$f":"'Poule 3'!$E23","v":0},{"$f":"'Poule 3'!$G23","v":0},"3ème",{"$f":"'Poule 4'!$C23","v":"SALOME"},{"$f":"'Poule 4'!$E23","v":"JOSEPHINE"},{"$f":"'Poule 4'!$G23","v":"75-4-LMAP"}]
["4ème",{"$f":"'Poule 1'!$C24","v":0},{"$f":"'Poule 1'!$E24","v":0},{"$f":"'Poule 1'!$G24","v":0},"4ème",{"$f":"'Poule 2'!$C24","v":0},{"$f":"'Poule 2'!$E24","v":0},{"$f":"'Poule 2'!$G24","v":0},"4ème",{"$f":"'Poule 3'!$C24","v":0},{"$f":"'Poule 3'!$E24","v":0},{"$f":"'Poule 3'!$G24","v":0},"4ème",{"$f":"'Poule 4'!$C24","v":0},{"$f":"'Poule 4'!$E24","v":0},{"$f":"'Poule 4'!$G24","v":0}]
["Poule 5",null,null,null,"Poule 6",null,null,null,"Poule 7",null,null,null,"Poule 8"]
["1er",{"$f":"'Poule 5'!$C21","v":"BIZARD"},{"$f":"'Poule 5'!$E21","v":"DARYA"},{"$f":"'Poule 5'!$G21","v":"75-4-LMAP"},"1er",{"$f":"'Poule 6'!$C21","v":"ROY-REMY"},{"$f":"'Poule 6'!$E21","v":"VALENTINE"},{"$f":"'Poule 6'!$G21","v":"75-4-LMAP"},"1er",{"$f":"'Poule 7'!$C21","v":"ILLOUZ"},{"$f":"'Poule 7'!$E21","v":"LEANA"},{"$f":"'Poule 7'!$G21","v":"75-4-LMAP"},"1er",{"$f":"'Poule 8'!$C21","v":"GARREC"},{"$f":"'Poule 8'!$E21","v":"JULIE"},{"$f":"'Poule 8'!$G21","v":"75-2-SLHP"}]
["2ème",{"$f":"'Poule 5'!$C22","v":"ANDRIOT"},{"$f":"'Poule 5'!$E22","v":"ALICE"},{"$f":"'Poule 5'!$G22","v":"75-4-LMAP"},"2ème",{"$f":"'Poule 6'!$C22","v":"BONNIN"},{"$f":"'Poule 6'!$E22","v":"ELEONORE"},{"$f":"'Poule 6'!$G22","v":"75-4-BLOP"},"2ème",{"$f":"'Poule 7'!$C22","v":"BRUNELAT"},{"$f":"'Poule 7'!$E22","v":"CAMILLE"},{"$f":"'Poule 7'!$G22","v":"75-2-SUPA"},"2ème",{"$f":"'Poule 8'!$C22","v":"ZOGHBI DE MEDLEGE GUILANI"},{"$f":"'Poule 8'!$E22","v":"HENRYETTE"},{"$f":"'Poule 8'!$G22","v":"75-4-LMAP"}]
["3ème",{"$f":"'Poule 5'!$C23","v":0},{"$f":"'Poule 5'!$E23","v":0},{"$f":"'Poule 5'!$G23","v":0},"3ème",{"$f":"'Poule 6'!$C23","v":"RISSE-RAUD"},{"$f":"'Poule 6'!$E23","v":"MAHAUT"},{"$f":"'Poule 6'!$G23","v":"75-4-LMAP"},"3ème",{"$f":"'Poule 7'!$C23","v":0},{"$f":"'Poule 7'!$E23","v":0},{"$f":"'Poule 7'!$G23","v":0},"3ème",{"$f":"'Poule 8'!$C23","v":"GALLAND"},{"$f":"'Poule 8'!$E23","v":"CLEMENCE"},{"$f":"'Poule 8'!$G23","v":"75-4-PCHP"}]
["4ème",{"$f":"'Poule 5'!$C24","v":0},{"$f":"'Poule 5'!$E24","v":0},{"$f":"'Poule 5'!$G24","v":0},"4ème",{"$f":"'Poule 6'!$C24","v":0},{"$f":"'Poule 6'!$E24","v":0},{"$f":"'Poule 6'!$G24","v":0},"4ème",{"$f":"'Poule 7'!$C24","v":0},{"$f":"'Poule 7'!$E24","v":0},{"$f":"'Poule 7'!$G24","v":0},"4ème",{"$f":"'Poule 8'!$C24","v":0},{"$f":"'Poule 8'!$E24","v":0},{"$f":"'Poule 8'!$G24","v":0}]

{"sheet":"Tableau","index":10,"n_rows":92,"n_cols":34,"rows_kept":92,"cut":false,"hidden":false,"merged":[[8,10,8,11],[50,20,50,21],[16,10,16,11],[23,10,23,11],[33,10,33,11],[40,10,40,11],[48,10,48,11],[10,20,10,21],[30,32,30,33],[0,16,0,19],[15,29,15,30],[0,0,0,14],[31,29,31,30],[10,1,10,2],[1,4,1,5],[0,20,0,33],[16,26,16,27],[23,23,23,24],[3,20,3,21],[18,20,18,21],[29,4,29,5],[25,20,25,21],[1,10,1,11],[9,23,9,24],[55,10,55,11],[33,4,33,5],[42,1,42,2],[59,29,59,30],[55,23,55,24],[47,29,47,30],[35,20,35,21],[42,20,42,21],[41,23,41,24],[48,26,48,27],[57,20,57,21]]}
["REPECHAGES ET MATCHS DE CLASSEMENT",null,null,null,null,null,null,null,null,null,null,null,null,null,null,null,"1er tour de tableau",null,null,null,"TABLEAU PRINCIPAL"]
[]
[]
[null,null,null,null,null,null,null,null,null,null,null,null,null,null,null,null,"1er poule 1",{"$f":"'Résultats de poule'!B2","v":"GROB"},{"$f":"'Résultats de poule'!D2","v":"75-4-FENP"},"V","1/8 de finale 1"]
[null,null,null,null,null,null,null,null,null,null,null,null,"P",{"$f":"IF(T4=\"\",\"\",IF(T4=\"p\",S4,S5))","v":0},{"$f":"IF(T4=\"\",\"\",IF(T4=\"p\",R4,R5))","v":0},null,"4ème poule 8",{"$f":"'Résultats de poule'!N10","v":0},{"$f":"'Résultats de poule'!P10","v":0},"P",{"$f":"IF(T4=\"\",\"\",IF(T4=\"v\",R4,R5))","v":"GROB"},{"$f":"IF(T4=\"\",\"\",IF(T4=\"v\",S4,S5))","v":"75-4-FENP"},"V"]
[null,null,null,null,null,null,null,null,null,"V",{"$f":"IF(M5=\"\",\"\",IF(M5=\"v\",N5,N7))","v":0},{"$f":"IF(M5=\"\",\"\",IF(M5=\"v\",O5,O7))","v":0},null,null,null,null,null,null,null,null,null,null,null,{"$f":"IF(W5=\"\",\"\",IF(W5=\"v\",U5,U7))","v":"GROB"},{"$f":"IF(W5=\"\",\"\",IF(W5=\"v\",V5,V7))","v":"75-4-FENP"},"V"]
[null,null,null,null,null,null,null,null,null,null,null,null,"V",{"$f":"IF(T7=\"\",\"\",IF(T7=\"p\",S7,S8))","v":0},{"$f":"IF(T7=\"\",\"\",IF(T7=\"p\",R7,R8))","v":0},null,"3ème poule 3",{"$f":"'Résultats de poule'!J4","v":0},{"$f":"'Résultats de poule'!L4","v":0},"P",{"$f":"IF(T7=\"\",\"\",IF(T7=\"v\",R7,R8))","v":"BONNIN"},{"$f":"IF(T7=\"\",\"\",IF(T7=\"v\",S7,S8))","v":"75-4-BLOP"},"P"]
[null,null,null,null,null,null,null,null,null,null,null,null,null,null,null,null,"2ème poule 6",{"$f":"'Résultats de poule'!F8","v":"BONNIN"},{"$f":"'Résultats de poule'!H8","v":"75-4-BLOP"},"V"]
[null,null,null,null,null,null,"P",{"$f":"IF(J6=\"\",\"\",IF(J6=\"v\",K6,K13))","v":0},{"$f":"IF(J6=\"\",\"\",IF(J6=\"v\",L6,L13))","v":0}]
[null,null,null,null,null,null,null,null,null,null,null,null,null,null,null,null,null,null,null,null,null,null,null,"1/4 finale 1",null,null,{"$f":"IF(Z6=\"\",\"\",IF(Z6=\"v\",X6,X13))","v":"GROB"},{"$f":"IF(Z6=\"\",\"\",IF(Z6=\"v\",Y6,Y13))","v":"75-4-FENP"},"V"]
[null,null,null,null,null,null,null,null,null,null,null,null,null,null,null,null,"2ème poule 4",{"$f":"'Résultats de poule'!N3","v":"MAHU"},{"$f":"'Résultats de poule'!P3","v":"75-2-SLHP"},"V","1/8 de finale 2"]
[null,null,null,null,null,null,null,null,null,null,null,null,"V",{"$f":"IF(T11=\"\",\"\",IF(T11=\"p\",S11,S12))","v":0},{"$f":"IF(T11=\"\",\"\",IF(T11=\"p\",R11,R12))","v":0},null,"3ème poule 5",{"$f":"'Résultats de poule'!B9","v":0},{"$f":"'Résultats de poule'!D9","v":0},"P",{"$f":"IF(T11=\"\",\"\",IF(T11=\"v\",R11,R12))","v":"MAHU"},{"$f":"IF(T11=\"\",\"\",IF(T11=\"v\",S11,S12))","v":"75-2-SLHP"},"P"]
[null,null,null,null,null,null,null,null,null,"P",{"$f":"IF(M12=\"\",\"\",IF(M12=\"v\",N12,N14))","v":0},{"$f":"IF(M12=\"\",\"\",IF(M12=\"v\",O12,O14))","v":0},null,null,null,null,null,null,null,null,null,null,null,{"$f":"IF(W12=\"\",\"\",IF(W12=\"v\",U12,U14))","v":"ILLOUZ"},{"$f":"IF(W12=\"\",\"\",IF(W12=\"v\",V12,V14))","v":"75-4-LMAP"},"P"]
[null,null,null,null,null,null,null,null,null,null,null,null,"P",{"$f":"IF(T14=\"\",\"\",IF(T14=\"p\",S14,S15))","v":0},{"$f":"IF(T14=\"\",\"\",IF(T14=\"p\",R14,R15))","v":0},null,"4ème poule 2",{"$f":"'Résultats de poule'!F5","v":0},{"$f":"'Résultats de poule'!H5","v":0},"P",{"$f":"IF(T14=\"\",\"\",IF(T14=\"v\",R14,R15))","v":"ILLOUZ"},{"$f":"IF(T14=\"\",\"\",IF(T14=\"v\",S14,S15))","v":"75-4-LMAP"},"V"]
[null,null,null,null,null,null,null,null,null,null,null,null,null,null,null,null,"1er poule 7",{"$f":"'Résultats de poule'!J7","v":"ILLOUZ"},{"$f":"'Résultats de poule'!L7","v":"75-4-LMAP"},"V"]
[null,null,null,"V",{"$f":"IF(G9=\"\",\"\",IF(G9=\"v\",H9,H24))","v":"75-4-FENP"},{"$f":"IF(G9=\"\",\"\",IF(G9=\"v\",I9,I24))","v":"THOREL"}]
[null,null,null,null,null,null,null,null,null,null,null,null,null,null,null,null,null,null,null,null,null,null,null,null,null,null,"1/2 finale A",null,null,{"$f":"IF(AC10=\"\",\"\",IF(AC10=\"v\",AA10,AA24))","v":"GROB"},{"$f":"IF(AC10=\"\",\"\",IF(AC10=\"v\",AB10,AB24))","v":"75-4-FENP"},"P"]
[]
[null,null,null,null,null,null,null,null,null,null,null,null,null,null,null,null,"1er poule 6",{"$f":"'Résultats de poule'!F7","v":"ROY-REMY"},{"$f":"'Résultats de poule'!H7","v":"75-4-LMAP"},"V","1/8 de finale 3"]
[null,null,null,null,null,null,null,null,null,null,null,null,"P",{"$f":"IF(T19=\"\",\"\",IF(T19=\"p\",S19,S20))","v":0},{"$f":"IF(T19=\"\",\"\",IF(T19=\"p\",R19,R20))","v":0},null,"4ème poule 3",{"$f":"'Résultats de poule'!J5","v":0},{"$f":"'Résultats de poule'!L5","v":0},"P",{"$f":"IF(T19=\"\",\"\",IF(T19=\"v\",R19,R20))","v":"ROY-REMY"},{"$f":"IF(T19=\"\",\"\",IF(T19=\"v\",S19,S20))","v":"75-4-LMAP"},"V"]
[null,null,null,null,null,null,null,null,null,"P",{"$f":"IF(M20=\"\",\"\",IF(M20=\"v\",N20,N22))","v":"75-4-PCHP"},{"$f":"IF(M20=\"\",\"\",IF(M20=\"v\",O20,O22))","v":"GALLAND"},null,null,null,null,null,null,null,null,null,null,null,{"$f":"IF(W20=\"\",\"\",IF(W20=\"v\",U20,U22))","v":"ROY-REMY"},{"$f":"IF(W20=\"\",\"\",IF(W20=\"v\",V20,V22))","v":"75-4-LMAP"},"V"]
[null,null,null,null,null,null,null,null,null,null,null,null,"V",{"$f":"IF(T22=\"\",\"\",IF(T22=\"p\",S22,S23))","v":"75-4-PCHP"},{"$f":"IF(T22=\"\",\"\",IF(T22=\"p\",R22,R23))","v":"GALLAND"},null,"3ème poule 8",{"$f":"'Résultats de poule'!N9","v":"GALLAND"},{"$f":"'Résultats de poule'!P9","v":"75-4-PCHP"},"P",{"$f":"IF(T22=\"\",\"\",IF(T22=\"v\",R22,R23))","v":"OYHARNART--FAYET"},{"$f":"IF(T22=\"\",\"\",IF(T22=\"v\",S22,S23))","v":"75-4-LMAP"},"P"]
[null,null,null,null,null,null,null,null,null,null,null,null,null,null,null,null,"2ème poule 1",{"$f":"'Résultats de poule'!B3","v":"OYHARNART--FAYET"},{"$f":"'Résultats de poule'!D3","v":"75-4-LMAP"},"V"]
[null,null,null,null,null,null,"V",{"$f":"IF(J21=\"\",\"\",IF(J21=\"v\",K21,K28))","v":"75-4-FENP"},{"$f":"IF(J21=\"\",\"\",IF(J21=\"v\",L21,L28))","v":"THOREL"},null,null,null,null,null,null,null,null,null,null,null,null,null,null,"1/4 finale 2",null,null,{"$f":"IF(Z21=\"\",\"\",IF(Z21=\"v\",X21,X28))","v":"ROY-REMY"},{"$f":"IF(Z21=\"\",\"\",IF(Z21=\"v\",Y21,Y28))","v":"75-4-LMAP"},"P"]
[]
[null,null,null,null,null,null,null,null,null,null,null,null,null,null,null,null,"2ème poule 7",{"$f":"'Résultats de poule'!J8","v":"BRUNELAT"},{"$f":"'Résultats de poule'!L8","v":"75-2-SUPA"},"V","1/8 de finale 4"]
[null,null,null,null,null,null,null,null,null,null,null,null,"V",{"$f":"IF(T26=\"\",\"\",IF(T26=\"p\",S26,S27))","v":"75-4-FENP"},{"$f":"IF(T26=\"\",\"\",IF(T26=\"p\",R26,R27))","v":"THOREL"},null,"3ème poule 2",{"$f":"'Résultats de poule'!F4","v":"THOREL"},{"$f":"'Résultats de poule'!H4","v":"75-4-FENP"},"P",{"$f":"IF(T26=\"\",\"\",IF(T26=\"v\",R26,R27))","v":"BRUNELAT"},{"$f":"IF(T26=\"\",\"\",IF(T26=\"v\",S26,S27))","v":"75-2-SUPA"},"P"]
[null,null,null,null,null,null,null,null,null,"V",{"$f":"IF(M27=\"\",\"\",IF(M27=\"v\",N27,N29))","v":"75-4-FENP"},{"$f":"IF(M27=\"\",\"\",IF(M27=\"v\",O27,O29))","v":"THOREL"},null,null,null,null,null,null,null,null,null,null,null,{"$f":"IF(W27=\"\",\"\",IF(W27=\"v\",U27,U29))","v":"JEAN"},{"$f":"IF(W27=\"\",\"\",IF(W27=\"v\",V27,V29))","v":"75-4-FENP"},"P"]
[null,null,null,null,null,null,null,null,null,null,null,null,"P",{"$f":"IF(T29=\"\",\"\",IF(T29=\"p\",S29,S30))","v":0},{"$f":"IF(T29=\"\",\"\",IF(T29=\"p\",R29,R30))","v":0},null,"4ème poule 5",{"$f":"'Résultats de poule'!B10","v":0},{"$f":"'Résultats de poule'!D10","v":0},"P",{"$f":"IF(T29=\"\",\"\",IF(T29=\"v\",R29,R30))","v":"JEAN"},{"$f":"IF(T29=\"\",\"\",IF(T29=\"v\",S29,S30))","v":"75-4-FENP"},"V"]
[null,null,null,null,null,null,null,null,null,null,null,null,null,null,null,null,"1er poule 4",{"$f":"'Résultats de poule'!N2","v":"JEAN"},{"$f":"'Résultats de poule'!P2","v":"75-4-FENP"},"V"]
[null,"17ème",null,null,null,null,null,null,null,null,null,null,null,null,null,null,null,null,null,null,null,null,null,null,null,null,null,null,null,null,null,null,"VAINQUEUR"]
[null,{"$f":"IF(D16=\"\",\"\",IF(D16=\"v\",E16,E48))","v":"75-4-FENP"},{"$f":"IF(D16=\"\",\"\",IF(D16=\"v\",F16,F48))","v":"THOREL"},null,null,null,null,null,null,null,null,null,null,null,null,null,null,null,null,null,null,null,null,null,null,null,null,null,null,"FINALE",null,null,{"$f":"IF(AF17=\"\",\"\",IF(AF17=\"v\",AD17,AD49))","v":"DE BATTISTA"},{"$f":"IF(AF17=\"\",\"\",IF(AF17=\"v\",AE17,AE49))","v":"75-4-STAP"}]
[]
[]
[]
[null,null,null,null,null,null,null,null,null,null,null,null,null,null,null,null,"1er poule 3",{"$f":"'Résultats de poule'!J2","v":"DE POULPIQUET DU HALGOUET"},{"$f":"'Résultats de poule'!L2","v":"75-4-STAP"},"V","1/8 de finale 5"]
[null,null,null,null,null,null,null,null,null,null,null,null,"P",{"$f":"IF(T36=\"\",\"\",IF(T36=\"p\",S36,S37))","v":0},{"$f":"IF(T36=\"\",\"\",IF(T36=\"p\",R36,R37))","v":0},null,"4ème poule 6",{"$f":"'Résultats de poule'!F10","v":0},{"$f":"'Résultats de poule'!H10","v":0},"P",{"$f":"IF(T36=\"\",\"\",IF(T36=\"v\",R36,R37))","v":"DE POULPIQUET DU HALGOUET"},{"$f":"IF(T36=\"\",\"\",IF(T36=\"v\",S36,S37))","v":"75-4-STAP"},"V"]
[null,null,null,null,null,null,null,null,null,"V",{"$f":"IF(M37=\"\",\"\",IF(M37=\"v\",N37,N39))","v":"75-4-LMAP"},{"$f":"IF(M37=\"\",\"\",IF(M37=\"v\",O37,O39))","v":"ZOGHBI DE MEDLEGE GUILANI"},null,null,null,null,null,null,null,null,null,null,null,{"$f":"IF(W37=\"\",\"\",IF(W37=\"v\",U37,U39))","v":"DE POULPIQUET DU HALGOUET"},{"$f":"IF(W37=\"\",\"\",IF(W37=\"v\",V37,V39))","v":"75-4-STAP"},"V"]
[null,null,null,null,null,null,null,null,null,null,null,null,"V",{"$f":"IF(T39=\"\",\"\",IF(T39=\"p\",S39,S40))","v":"75-4-LMAP"},{"$f":"IF(T39=\"\",\"\",IF(T39=\"p\",R39,R40))","v":"ZOGHBI DE MEDLEGE GUILANI"},null,"3ème poule 1",{"$f":"'Résultats de poule'!B4","v":"MATHIAN"},{"$f":"'Résultats de poule'!D4","v":"75-2-SUPA"},"V",{"$f":"IF(T39=\"\",\"\",IF(T39=\"v\",R39,R40))","v":"MATHIAN"},{"$f":"IF(T39=\"\",\"\",IF(T39=\"v\",S39,S40))","v":"75-2-SUPA"},"P"]
[null,null,null,null,null,null,null,null,null,null,null,null,null,null,null,null,"2ème poule 8",{"$f":"'Résultats de poule'!N8","v":"ZOGHBI DE MEDLEGE GUILANI"},{"$f":"'Résultats de poule'!P8","v":"75-4-LMAP"},"P"]
[null,null,null,null,null,null,"P",{"$f":"IF(J38=\"\",\"\",IF(J38=\"v\",K38,K45))","v":"75-4-LMAP"},{"$f":"IF(J38=\"\",\"\",IF(J38=\"v\",L38,L45))","v":"ZOGHBI DE MEDLEGE GUILANI"}]
[null,null,null,null,null,null,null,null,null,null,null,null,null,null,null,null,null,null,null,null,null,null,null,"1/4 finale 3",null,null,{"$f":"IF(Z38=\"\",\"\",IF(Z38=\"v\",X38,X45))","v":"DE POULPIQUET DU HALGOUET"},{"$f":"IF(Z38=\"\",\"\",IF(Z38=\"v\",Y38,Y45))","v":"75-4-STAP"},"P"]
[null,null,null,null,null,null,null,null,null,null,null,null,null,null,null,null,"2ème poule 2",{"$f":"'Résultats de poule'!F3","v":"DENIS"},{"$f":"'Résultats de poule'!H3","v":"75-4-LMAP"},"V","1/8 de finale 6"]
[null,null,null,null,null,null,null,null,null,null,null,null,"V",{"$f":"IF(T43=\"\",\"\",IF(T43=\"p\",S43,S44))","v":0},{"$f":"IF(T43=\"\",\"\",IF(T43=\"p\",R43,R44))","v":0},null,"3ème poule 7",{"$f":"'Résultats de poule'!J9","v":0},{"$f":"'Résultats de poule'!L9","v":0},"P",{"$f":"IF(T43=\"\",\"\",IF(T43=\"v\",R43,R44))","v":"DENIS"},{"$f":"IF(T43=\"\",\"\",IF(T43=\"v\",S43,S44))","v":"75-4-LMAP"},"P"]
[null,null,null,null,null,null,null,null,null,"P",{"$f":"IF(M44=\"\",\"\",IF(M44=\"v\",N44,N46))","v":0},{"$f":"IF(M44=\"\",\"\",IF(M44=\"v\",O44,O46))","v":0},null,null,null,null,null,null,null,null,null,null,null,{"$f":"IF(W44=\"\",\"\",IF(W44=\"v\",U44,U46))","v":"BIZARD"},{"$f":"IF(W44=\"\",\"\",IF(W44=\"v\",V44,V46))","v":"75-4-LMAP"},"P"]
[null,null,null,null,null,null,null,null,null,null,null,null,"P",{"$f":"IF(T46=\"\",\"\",IF(T46=\"p\",S46,S47))","v":0},{"$f":"IF(T46=\"\",\"\",IF(T46=\"p\",R46,R47))","v":0},null,"4ème poule 4",{"$f":"'Résultats de poule'!N5","v":0},{"$f":"'Résultats de poule'!P5","v":0},"P",{"$f":"IF(T46=\"\",\"\",IF(T46=\"v\",R46,R47))","v":"BIZARD"},{"$f":"IF(T46=\"\",\"\",IF(T46=\"v\",S46,S47))","v":"75-4-LMAP"},"V"]
[null,null,null,null,null,null,null,null,null,null,null,null,null,null,null,null,"1er poule 5",{"$f":"'Résultats de poule'!B7","v":"BIZARD"},{"$f":"'Résultats de poule'!D7","v":"75-4-LMAP"},"V"]
[null,null,null,"P",{"$f":"IF(G41=\"\",\"\",IF(G41=\"v\",H41,H56))","v":"75-4-LMAP"},{"$f":"IF(G41=\"\",\"\",IF(G41=\"v\",I41,I56))","v":"SALOME"}]
[null,null,null,null,null,null,null,null,null,null,null,null,null,null,null,null,null,null,null,null,null,null,null,null,null,null,"1/2 finale B",null,null,{"$f":"IF(AC42=\"\",\"\",IF(AC42=\"v\",AA42,AA56))","v":"DE BATTISTA"},{"$f":"IF(AC42=\"\",\"\",IF(AC42=\"v\",AB42,AB56))","v":"75-4-STAP"},"V"]
[]
[null,null,null,null,null,null,null,null,null,null,null,null,null,null,null,null,"1er poule 8",{"$f":"'Résultats de poule'!N7","v":"GARREC"},{"$f":"'Résultats de poule'!P7","v":"75-2-SLHP"},"V","1/8 de finale 7"]
[null,null,null,null,null,null,null,null,null,null,null,null,"P",{"$f":"IF(T51=\"\",\"\",IF(T51=\"p\",S51,S52))","v":0},{"$f":"IF(T51=\"\",\"\",IF(T51=\"p\",R51,R52))","v":0},null,"4ème poule 1",{"$f":"'Résultats de poule'!B5","v":0},{"$f":"'Résultats de poule'!D5","v":0},"P",{"$f":"IF(T51=\"\",\"\",IF(T51=\"v\",R51,R52))","v":"GARREC"},{"$f":"IF(T51=\"\",\"\",IF(T51=\"v\",S51,S52))","v":"75-2-SLHP"},"P"]
[null,null,null,null,null,null,null,null,null,"P",{"$f":"IF(M52=\"\",\"\",IF(M52=\"v\",N52,N54))","v":"75-4-LMAP"},{"$f":"IF(M52=\"\",\"\",IF(M52=\"v\",O52,O54))","v":"RISSE-RAUD"},null,null,null,null,null,null,null,null,null,null,null,{"$f":"IF(W52=\"\",\"\",IF(W52=\"v\",U52,U54))","v":"ASHIKHMIN"},{"$f":"IF(W52=\"\",\"\",IF(W52=\"v\",V52,V54))","v":"75-4-LMAP"},"P"]
[null,null,null,null,null,null,null,null,null,null,null,null,"V",{"$f":"IF(T54=\"\",\"\",IF(T54=\"p\",S54,S55))","v":"75-4-LMAP"},{"$f":"IF(T54=\"\",\"\",IF(T54=\"p\",R54,R55))","v":"RISSE-RAUD"},null,"3ème poule 6",{"$f":"'Résultats de poule'!F9","v":"RISSE-RAUD"},{"$f":"'Résultats de poule'!H9","v":"75-4-LMAP"},"P",{"$f":"IF(T54=\"\",\"\",IF(T54=\"v\",R54,R55))","v":"ASHIKHMIN"},{"$f":"IF(T54=\"\",\"\",IF(T54=\"v\",S54,S55))","v":"75-4-LMAP"},"V"]
[null,null,null,null,null,null,null,null,null,null,null,null,null,null,null,null,"2ème poule 3",{"$f":"'Résultats de poule'!J3","v":"ASHIKHMIN"},{"$f":"'Résultats de poule'!L3","v":"75-4-LMAP"},"V"]
[null,null,null,null,null,null,"V",{"$f":"IF(J53=\"\",\"\",IF(J53=\"v\",K53,K60))","v":"75-4-LMAP"},{"$f":"IF(J53=\"\",\"\",IF(J53=\"v\",L53,L60))","v":"SALOME"},null,null,null,null,null,null,null,null,null,null,null,null,null,null,"1/4 finale 4",null,null,{"$f":"IF(Z53=\"\",\"\",IF(Z53=\"v\",X53,X60))","v":"DE BATTISTA"},{"$f":"IF(Z53=\"\",\"\",IF(Z53=\"v\",Y53,Y60))","v":"75-4-STAP"},"V"]
[]
[null,null,null,null,null,null,null,null,null,null,null,null,null,null,null,null,"2ème poule 5",{"$f":"'Résultats de poule'!B8","v":"ANDRIOT"},{"$f":"'Résultats de poule'!D8","v":"75-4-LMAP"},"V","1/8 de finale 8"]
[null,null,null,null,null,null,null,null,null,null,null,null,"V",{"$f":"IF(T58=\"\",\"\",IF(T58=\"p\",S58,S59))","v":"75-4-LMAP"},{"$f":"IF(T58=\"\",\"\",IF(T58=\"p\",R58,R59))","v":"SALOME"},null,"3ème poule 4",{"$f":"'Résultats de poule'!N4","v":"SALOME"},{"$f":"'Résultats de poule'!P4","v":"75-4-LMAP"},"P",{"$f":"IF(T58=\"\",\"\",IF(T58=\"v\",R58,R59))","v":"ANDRIOT"},{"$f":"IF(T58=\"\",\"\",IF(T58=\"v\",S58,S59))","v":"75-4-LMAP"},"P"]
[null,"19ème",null,"P",{"$f":"IF(G9=\"\",\"\",IF(G9=\"p\",H9,H24))","v":0},{"$f":"IF(G9=\"\",\"\",IF(G9=\"p\",I9,I24))","v":0},null,null,null,"V",{"$f":"IF(M59=\"\",\"\",IF(M59=\"v\",N59,N61))","v":"75-4-LMAP"},{"$f":"IF(M59=\"\",\"\",IF(M59=\"v\",O59,O61))","v":"SALOME"},null,null,null,null,null,null,null,null,null,null,null,{"$f":"IF(W59=\"\",\"\",IF(W59=\"v\",U59,U61))","v":"DE BATTISTA"},{"$f":"IF(W59=\"\",\"\",IF(W59=\"v\",V59,V61))","v":"75-4-STAP"},"V",null,null,null,"Place de 3ème/4ème"]
[null,{"$f":"IF(D60=\"\",\"\",IF(D60=\"v\",E60,E62))","v":"75-4-LMAP"},{"$f":"IF(D60=\"\",\"\",IF(D60=\"v\",F60,F62))","v":"ZOGHBI DE MEDLEGE GUILANI"},null,null,null,null,null,null,null,null,null,"P",{"$f":"IF(T61=\"\",\"\",IF(T61=\"p\",S61,S62))","v":0},{"$f":"IF(T61=\"\",\"\",IF(T61=\"p\",R61,R62))","v":0},null,"4ème poule 7",{"$f":"'Résultats de poule'!J10","v":0},{"$f":"'Résultats de poule'!L10","v":0},"P",{"$f":"IF(T61=\"\",\"\",IF(T61=\"v\",R61,R62))","v":"DE BATTISTA"},{"$f":"IF(T61=\"\",\"\",IF(T61=\"v\",S61,S62))","v":"75-4-STAP"},"V",null,null,null,null,null,null,{"$f":"IF(AC10=\"\",\"\",IF(AC10=\"p\",AA10,AA24))","v":"ROY-REMY"},{"$f":"IF(AC10=\"\",\"\",IF(AC10=\"p\",AB10,AB24))","v":"75-4-LMAP"},"V"]
[null,null,null,"V",{"$f":"IF(G41=\"\",\"\",IF(G41=\"p\",H41,H56))","v":"75-4-LMAP"},{"$f":"IF(G41=\"\",\"\",IF(G41=\"p\",I41,I56))","v":"ZOGHBI DE MEDLEGE GUILANI"},null,null,null,null,null,null,null,null,null,null,"1er poule 2",{"$f":"'Résultats de poule'!F2","v":"DE BATTISTA"},{"$f":"'Résultats de poule'!H2","v":"75-4-STAP"},"V",null,null,null,null,null,null,null,null,null,null,null,null,{"$f":"IF(AF61=\"\",\"\",IF(AF61=\"v\",AD61,AD63))","v":"ROY-REMY"},{"$f":"IF(AF61=\"\",\"\",IF(AF61=\"v\",AE61,AE63))","v":"75-4-LMAP"}]
[null,null,null,null,null,null,null,null,null,null,null,null,null,null,null,null,null,null,null,null,null,null,null,null,null,null,null,null,null,{"$f":"IF(AC42=\"\",\"\",IF(AC42=\"p\",AA42,AA56))","v":"DE POULPIQUET DU HALGOUET"},{"$f":"IF(AC42=\"\",\"\",IF(AC42=\"p\",AB42,AB56))","v":"75-4-STAP"},"P"]
[]
[null,null,null,null,null,null,null,null,null,null,null,null,null,{"$f":"IF(M5=\"\",\"\",IF(M5=\"p\",N5,N7))","v":0},{"$f":"IF(M5=\"\",\"\",IF(M5=\"p\",O5,O7))","v":0},null,null,{"$f":"IF(W5=\"\",\"\",IF(W5=\"p\",U5,U7))","v":"BONNIN"},{"$f":"IF(W5=\"\",\"\",IF(W5=\"p\",V5,V7))","v":"75-4-BLOP"},"P"]
[null,null,null,null,null,null,null,null,null,null,{"$f":"IF(M65=\"\",\"\",IF(M65=\"v\",N65,N66))","v":""},{"$f":"IF(M65=\"\",\"\",IF(M65=\"v\",O65,O66))","v":""},null,{"$f":"IF(M12=\"\",\"\",IF(M12=\"p\",N12,N14))","v":0},{"$f":"IF(M12=\"\",\"\",IF(M12=\"p\",O12,O14))","v":0},null,null,{"$f":"IF(W12=\"\",\"\",IF(W12=\"p\",U12,U14))","v":"MAHU"},{"$f":"IF(W12=\"\",\"\",IF(W12=\"p\",V12,V14))","v":"75-2-SLHP"},"V",{"$f":"IF(T65=\"\",\"\",IF(T65=\"v\",R65,R66))","v":"MAHU"},{"$f":"IF(T65=\"\",\"\",IF(T65=\"v\",S65,S66))","v":"75-2-SLHP"},"P"]
[null,null,null,null,null,null,null,{"$f":"IF(J66=\"\",\"\",IF(J66=\"v\",K66,K68))","v":""},{"$f":"IF(J66=\"\",\"\",IF(J66=\"v\",L66,L68))","v":""},null,null,null,null,null,null,null,null,null,null,null,null,null,null,{"$f":"IF(W66=\"\",\"\",IF(W66=\"v\",U66,U68))","v":"OYHARNART--FAYET"},{"$f":"IF(W66=\"\",\"\",IF(W66=\"v\",V66,V68))","v":"75-4-LMAP"},"V"]
[null,null,null,null,null,null,null,null,null,null,{"$f":"IF(M68=\"\",\"\",IF(M68=\"v\",N68,N69))","v":""},{"$f":"IF(M68=\"\",\"\",IF(M68=\"v\",O68,O69))","v":""},null,{"$f":"IF(M20=\"\",\"\",IF(M20=\"p\",N20,N22))","v":0},{"$f":"IF(M20=\"\",\"\",IF(M20=\"p\",O20,O22))","v":0},null,null,{"$f":"IF(W20=\"\",\"\",IF(W20=\"p\",U20,U22))","v":"OYHARNART--FAYET"},{"$f":"IF(W20=\"\",\"\",IF(W20=\"p\",V20,V22))","v":"75-4-LMAP"},"V",{"$f":"IF(T68=\"\",\"\",IF(T68=\"v\",R68,R69))","v":"OYHARNART--FAYET"},{"$f":"IF(T68=\"\",\"\",IF(T68=\"v\",S68,S69))","v":"75-4-LMAP"},"V"]
[null,null,null,null,"25ème",null,null,null,null,null,null,null,null,{"$f":"IF(M27=\"\",\"\",IF(M27=\"p\",N27,N29))","v":0},{"$f":"IF(M27=\"\",\"\",IF(M27=\"p\",O27,O29))","v":0},null,null,{"$f":"IF(W27=\"\",\"\",IF(W27=\"p\",U27,U29))","v":"BRUNELAT"},{"$f":"IF(W27=\"\",\"\",IF(W27=\"p\",V27,V29))","v":"75-2-SUPA"},"P",null,null,null,null,null,null,null,"9ème"]
[null,null,null,null,{"$f":"IF(G67=\"\",\"\",IF(G67=\"v\",H67,H73))","v":""},{"$f":"IF(G67=\"\",\"\",IF(G67=\"v\",I67,I73))","v":""},null,null,null,null,null,null,null,null,null,null,null,null,null,null,null,null,null,null,null,null,{"$f":"IF(Z67=\"\",\"\",IF(Z67=\"v\",X67,X73))","v":"OYHARNART--FAYET"},{"$f":"IF(Z67=\"\",\"\",IF(Z67=\"v\",Y67,Y73))","v":"75-4-LMAP"}]
[null,null,null,null,null,null,null,null,null,null,null,null,null,{"$f":"IF(M37=\"\",\"\",IF(M37=\"p\",N37,N39))","v":0},{"$f":"IF(M37=\"\",\"\",IF(M37=\"p\",O37,O39))","v":0},null,null,{"$f":"IF(W37=\"\",\"\",IF(W37=\"p\",U37,U39))","v":"MATHIAN"},{"$f":"IF(W37=\"\",\"\",IF(W37=\"p\",V37,V39))","v":"75-2-SUPA"},"P"]
[null,null,null,null,null,null,null,null,null,null,{"$f":"IF(M71=\"\",\"\",IF(M71=\"v\",N71,N72))","v":""},{"$f":"IF(M71=\"\",\"\",IF(M71=\"v\",O71,O72))","v":""},null,{"$f":"IF(M44=\"\",\"\",IF(M44=\"p\",N44,N46))","v":0},{"$f":"IF(M44=\"\",\"\",IF(M44=\"p\",O44,O46))","v":0},null,null,{"$f":"IF(W44=\"\",\"\",IF(W44=\"p\",U44,U46))","v":"DENIS"},{"$f":"IF(W44=\"\",\"\",IF(W44=\"p\",V44,V46))","v":"75-4-LMAP"},"V",{"$f":"IF(T71=\"\",\"\",IF(T71=\"v\",R71,R72))","v":"DENIS"},{"$f":"IF(T71=\"\",\"\",IF(T71=\"v\",S71,S72))","v":"75-4-LMAP"},"P"]
[null,null,null,null,null,null,null,{"$f":"IF(J72=\"\",\"\",IF(J72=\"v\",K72,K74))","v":""},{"$f":"IF(J72=\"\",\"\",IF(J72=\"v\",L72,L74))","v":""},null,null,null,null,null,null,null,null,null,null,null,null,null,null,{"$f":"IF(W72=\"\",\"\",IF(W72=\"v\",U72,U74))","v":"GARREC"},{"$f":"IF(W72=\"\",\"\",IF(W72=\"v\",V72,V74))","v":"75-2-SLHP"},"P"]
[null,null,null,null,null,null,null,null,null,null,{"$f":"IF(M74=\"\",\"\",IF(M74=\"v\",N74,N75))","v":""},{"$f":"IF(M74=\"\",\"\",IF(M74=\"v\",O74,O75))","v":""},null,{"$f":"IF(M52=\"\",\"\",IF(M52=\"p\",N52,N54))","v":0},{"$f":"IF(M52=\"\",\"\",IF(M52=\"p\",O52,O54))","v":0},null,null,{"$f":"IF(W52=\"\",\"\",IF(W52=\"p\",U52,U54))","v":"GARREC"},{"$f":"IF(W52=\"\",\"\",IF(W52=\"p\",V52,V54))","v":"75-2-SLHP"},"V",{"$f":"IF(T74=\"\",\"\",IF(T74=\"v\",R74,R75))","v":"GARREC"},{"$f":"IF(T74=\"\",\"\",IF(T74=\"v\",S74,S75))","v":"75-2-SLHP"},"V"]
[null,null,null,null,null,null,null,null,null,null,null,null,null,{"$f":"IF(M59=\"\",\"\",IF(M59=\"p\",N59,N61))","v":0},{"$f":"IF(M59=\"\",\"\",IF(M59=\"p\",O59,O61))","v":0},null,null,{"$f":"IF(W59=\"\",\"\",IF(W59=\"p\",U59,U61))","v":"ANDRIOT"},{"$f":"IF(W59=\"\",\"\",IF(W59=\"p\",V59,V61))","v":"75-4-LMAP"},"P",null,null,null,null,null,null,{"$f":"IF(Z6=\"\",\"\",IF(Z6=\"p\",X6,X13))","v":"ILLOUZ"},{"$f":"IF(Z6=\"\",\"\",IF(Z6=\"p\",Y6,Y13))","v":"75-4-LMAP"},"P"]
[null,null,null,null,null,null,null,null,null,null,null,null,null,null,null,null,null,null,null,null,null,null,null,null,null,null,null,null,null,{"$f":"IF(AC75=\"\",\"\",IF(AC75=\"v\",AA75,AA77))","v":"JEAN"},{"$f":"IF(AC75=\"\",\"\",IF(AC75=\"v\",AB75,AB77))","v":"75-4-FENP"},"V"]
[null,null,null,null,null,null,null,null,null,null,null,null,null,{"$f":"IF(M65=\"\",\"\",IF(M65=\"p\",N65,N66))","v":""},{"$f":"IF(M65=\"\",\"\",IF(M65=\"p\",O65,O66))","v":""},null,null,{"$f":"IF(T65=\"\",\"\",IF(T65=\"p\",R65,R66))","v":"BONNIN"},{"$f":"IF(T65=\"\",\"\",IF(T65=\"p\",S65,S66))","v":"75-4-BLOP"},"V",null,null,null,null,null,null,{"$f":"IF(Z21=\"\",\"\",IF(Z21=\"p\",X21,X28))","v":"JEAN"},{"$f":"IF(Z21=\"\",\"\",IF(Z21=\"p\",Y21,Y28))","v":"75-4-FENP"},"V"]
[null,null,null,null,null,null,null,"29ème",null,null,{"$f":"IF(M77=\"\",\"\",IF(M77=\"v\",N77,N78))","v":""},{"$f":"IF(M77=\"\",\"\",IF(M77=\"v\",O77,O78))","v":""},null,{"$f":"IF(M68=\"\",\"\",IF(M68=\"p\",N68,N69))","v":""},{"$f":"IF(M68=\"\",\"\",IF(M68=\"p\",O68,O69))","v":""},null,null,{"$f":"IF(T68=\"\",\"\",IF(T68=\"p\",R68,R69))","v":"BRUNELAT"},{"$f":"IF(T68=\"\",\"\",IF(T68=\"p\",S68,S69))","v":"75-2-SUPA"},"P",{"$f":"IF(T77=\"\",\"\",IF(T77=\"v\",R77,R78))","v":"BONNIN"},{"$f":"IF(T77=\"\",\"\",IF(T77=\"v\",S77,S78))","v":"75-4-BLOP"},"V",null,"13ème",null,null,null,null,null,null,null,null,"5ème"]
[null,null,null,null,null,null,null,{"$f":"IF(J78=\"\",\"\",IF(J78=\"v\",K78,K80))","v":""},{"$f":"IF(J78=\"\",\"\",IF(J78=\"v\",L78,L80))","v":""},null,null,null,null,null,null,null,null,null,null,null,null,null,null,{"$f":"IF(W78=\"\",\"\",IF(W78=\"v\",U78,U80))","v":"BONNIN"},{"$f":"IF(W78=\"\",\"\",IF(W78=\"v\",V78,V80))","v":"75-4-BLOP"},null,null,null,null,null,null,null,{"$f":"IF(AF76=\"\",\"\",IF(AF76=\"v\",AD76,AD82))","v":"JEAN"},{"$f":"IF(AF76=\"\",\"\",IF(AF76=\"v\",AE76,AE82))","v":"75-4-FENP"}]
[null,null,null,null,null,null,null,null,null,null,{"$f":"IF(M80=\"\",\"\",IF(M80=\"v\",N80,N81))","v":""},{"$f":"IF(M80=\"\",\"\",IF(M80=\"v\",O80,O81))","v":""},null,{"$f":"IF(M71=\"\",\"\",IF(M71=\"p\",N71,N72))","v":""},{"$f":"IF(M71=\"\",\"\",IF(M71=\"p\",O71,O72))","v":""},null,null,{"$f":"IF(T71=\"\",\"\",IF(T71=\"p\",R71,R72))","v":"MATHIAN"},{"$f":"IF(T71=\"\",\"\",IF(T71=\"p\",S71,S72))","v":"75-2-SUPA"},"V",{"$f":"IF(T80=\"\",\"\",IF(T80=\"v\",R80,R81))","v":"MATHIAN"},{"$f":"IF(T80=\"\",\"\",IF(T80=\"v\",S80,S81))","v":"75-2-SUPA"},"P"]
[null,null,null,null,null,null,null,null,null,null,null,null,null,{"$f":"IF(M74=\"\",\"\",IF(M74=\"p\",N74,N75))","v":""},{"$f":"IF(M74=\"\",\"\",IF(M74=\"p\",O74,O75))","v":""},null,null,{"$f":"IF(T74=\"\",\"\",IF(T74=\"p\",R74,R75))","v":"ANDRIOT"},{"$f":"IF(T74=\"\",\"\",IF(T74=\"p\",S74,S75))","v":"75-4-LMAP"},"P",null,null,null,null,null,null,{"$f":"IF(Z38=\"\",\"\",IF(Z38=\"p\",X38,X45))","v":"BIZARD"},{"$f":"IF(Z38=\"\",\"\",IF(Z38=\"p\",Y38,Y45))","v":"75-4-LMAP"},"P"]
[null,null,null,null,null,null,null,null,null,null,"27ème",null,null,null,null,null,null,null,null,null,null,"11ème",null,null,null,null,null,null,null,{"$f":"IF(AC81=\"\",\"\",IF(AC81=\"v\",AA81,AA83))","v":"ASHIKHMIN"},{"$f":"IF(AC81=\"\",\"\",IF(AC81=\"v\",AB81,AB83))","v":"75-4-LMAP"},"P"]
[null,null,null,null,null,null,null,null,null,null,{"$f":"IF(M83=\"\",\"\",IF(M83=\"v\",N83,N84))","v":""},{"$f":"IF(M83=\"\",\"\",IF(M83=\"v\",O83,O84))","v":""},null,{"$f":"IF(J66=\"\",\"\",IF(J66=\"p\",K66,K68))","v":""},{"$f":"IF(J66=\"\",\"\",IF(J66=\"p\",L66,L68))","v":""},null,null,{"$f":"IF(W66=\"\",\"\",IF(W66=\"p\",U66,U68))","v":"MAHU"},{"$f":"IF(W66=\"\",\"\",IF(W66=\"p\",V66,V68))","v":"75-2-SLHP"},"P",{"$f":"IF(T83=\"\",\"\",IF(T83=\"v\",R83,R84))","v":"DENIS"},{"$f":"IF(T83=\"\",\"\",IF(T83=\"v\",S83,S84))","v":"75-4-LMAP"},null,null,null,null,{"$f":"IF(Z53=\"\",\"\",IF(Z53=\"p\",X53,X60))","v":"ASHIKHMIN"},{"$f":"IF(Z53=\"\",\"\",IF(Z53=\"p\",Y53,Y60))","v":"75-4-LMAP"},"V"]
[null,null,null,null,null,null,null,null,null,null,null,null,null,{"$f":"IF(J72=\"\",\"\",IF(J72=\"p\",K72,K74))","v":""},{"$f":"IF(J72=\"\",\"\",IF(J72=\"p\",L72,L74))","v":""},null,null,{"$f":"IF(W72=\"\",\"\",IF(W72=\"p\",U72,U74))","v":"DENIS"},{"$f":"IF(W72=\"\",\"\",IF(W72=\"p\",V72,V74))","v":"75-4-LMAP"},"V"]
[null,null,null,null,null,null,"P",{"$f":"IF(J6=\"\",\"\",IF(J6=\"p\",K6,K13))","v":0},{"$f":"IF(J6=\"\",\"\",IF(J6=\"p\",L6,L13))","v":0},null,null,null,null,null,null,null,null,null,null,null,null,null,null,null,null,null,{"$f":"IF(AC75=\"\",\"\",IF(AC75=\"p\",AA75,AA77))","v":"ILLOUZ"},{"$f":"IF(AC75=\"\",\"\",IF(AC75=\"p\",AB75,AB77))","v":"75-4-LMAP"},"P",null,"7ème"]
[null,"21ème",null,"V",{"$f":"IF(G85=\"\",\"\",IF(G85=\"v\",H85,H86))","v":"75-4-PCHP"},{"$f":"IF(G85=\"\",\"\",IF(G85=\"v\",I85,I86))","v":"GALLAND"},"V",{"$f":"IF(J21=\"\",\"\",IF(J21=\"p\",K21,K28))","v":"75-4-PCHP"},{"$f":"IF(J21=\"\",\"\",IF(J21=\"p\",L21,L28))","v":"GALLAND"},null,"31ème",null,null,null,null,null,null,null,null,null,null,"15ème",null,null,null,null,null,null,null,{"$f":"IF(AC85=\"\",\"\",IF(AC85=\"v\",AA85,AA87))","v":"BIZARD"},{"$f":"IF(AC85=\"\",\"\",IF(AC85=\"v\",AB85,AB87))","v":"75-4-LMAP"}]
[null,{"$f":"IF(D86=\"\",\"\",IF(D86=\"v\",E86,E88))","v":"75-4-PCHP"},{"$f":"IF(D86=\"\",\"\",IF(D86=\"v\",F86,F88))","v":"GALLAND"},null,null,null,null,null,null,null,{"$f":"IF(M87=\"\",\"\",IF(M87=\"v\",N87,N88))","v":""},{"$f":"IF(M87=\"\",\"\",IF(M87=\"v\",O87,O88))","v":""},null,{"$f":"IF(M77=\"\",\"\",IF(M77=\"p\",N77,N78))","v":""},{"$f":"IF(M77=\"\",\"\",IF(M77=\"p\",O77,O78))","v":""},null,null,{"$f":"IF(T77=\"\",\"\",IF(T77=\"p\",R77,R78))","v":"BRUNELAT"},{"$f":"IF(T77=\"\",\"\",IF(T77=\"p\",S77,S78))","v":"75-2-SUPA"},"V",{"$f":"IF(T87=\"\",\"\",IF(T87=\"v\",R87,R88))","v":"BRUNELAT"},{"$f":"IF(T87=\"\",\"\",IF(T87=\"v\",S87,S88))","v":"75-2-SUPA"},null,null,null,null,{"$f":"IF(AC81=\"\",\"\",IF(AC81=\"p\",AA81,AA83))","v":"BIZARD"},{"$f":"IF(AC81=\"\",\"\",IF(AC81=\"p\",AB81,AB83))","v":"75-4-LMAP"},"V"]
[null,null,null,"P",{"$f":"IF(G88=\"\",\"\",IF(G88=\"v\",H88,H89))","v":"75-4-LMAP"},{"$f":"IF(G88=\"\",\"\",IF(G88=\"v\",I88,I89))","v":"RISSE-RAUD"},"P",{"$f":"IF(J38=\"\",\"\",IF(J38=\"p\",K38,K45))","v":0},{"$f":"IF(J38=\"\",\"\",IF(J38=\"p\",L38,L45))","v":0},null,null,null,null,{"$f":"IF(M80=\"\",\"\",IF(M80=\"p\",N80,N81))","v":""},{"$f":"IF(M80=\"\",\"\",IF(M80=\"p\",O80,O81))","v":""},null,null,{"$f":"IF(T80=\"\",\"\",IF(T80=\"p\",R80,R81))","v":"ANDRIOT"},{"$f":"IF(T80=\"\",\"\",IF(T80=\"p\",S80,S81))","v":"75-4-LMAP"},"P"]
[null,null,null,null,null,null,"V",{"$f":"IF(J53=\"\",\"\",IF(J53=\"p\",K53,K60))","v":"75-4-LMAP"},{"$f":"IF(J53=\"\",\"\",IF(J53=\"p\",L53,L60))","v":"RISSE-RAUD"}]
[null,"23ème"]
[null,{"$f":"IF(D91=\"\",\"\",IF(D91=\"v\",E91,E92))","v":""},{"$f":"IF(D91=\"\",\"\",IF(D91=\"v\",F91,F92))","v":""},null,{"$f":"IF(G85=\"\",\"\",IF(G85=\"p\",H85,H86))","v":0},{"$f":"IF(G85=\"\",\"\",IF(G85=\"p\",I85,I86))","v":0}]
[null,null,null,null,{"$f":"IF(G88=\"\",\"\",IF(G88=\"p\",H88,H89))","v":0},{"$f":"IF(G88=\"\",\"\",IF(G88=\"p\",I88,I89))","v":0}]

{"sheet":"Classement","index":11,"n_rows":35,"n_cols":3,"rows_kept":35,"cut":false,"hidden":false,"merged":[[1,0,1,2],[0,0,0,2]]}
[{"$f":"IF(Engagés!A1=\"\",\"\",Engagés!A1)","v":"FINALES Comité de Paris "}]
[{"$f":"IF(Engagés!E3=\"\",\"\",Engagés!E3)","v":"MF Promo"}]
["CLASSEMENT","NOMS","Etablissement"]
["1er",{"$f":"Tableau!AG32","v":"DE BATTISTA"},{"$f":"Tableau!AH32","v":"75-4-STAP"}]
["2ème",{"$f":"IF(Tableau!$AF$17=\"\",\"\",IF(Tableau!$AF$17=\"p\",Tableau!$AD$17,Tableau!$AD$49))","v":"GROB"},{"$f":"IF(Tableau!$AF$17=\"\",\"\",IF(Tableau!$AF$17=\"p\",Tableau!$AE$17,Tableau!$AE$49))","v":"75-4-FENP"}]
["3ème",{"$f":"Tableau!AG62","v":"ROY-REMY"},{"$f":"Tableau!AH62","v":"75-4-LMAP"}]
["4ème",{"$f":"IF(Tableau!AF61=\"\",\"\",IF(Tableau!$AF$61=\"p\",Tableau!$AD$61,Tableau!$AD$63))","v":"DE POULPIQUET DU HALGOUET"},{"$f":"IF(Tableau!AF61=\"\",\"\",IF(Tableau!$AF$61=\"p\",Tableau!$AE$61,Tableau!$AE$63))","v":"75-4-STAP"}]
["5ème",{"$f":"Tableau!AG79","v":"JEAN"},{"$f":"Tableau!AH79","v":"75-4-FENP"}]
["6ème",{"$f":"IF(Tableau!AF76=\"\",\"\",IF(Tableau!$AF$76=\"p\",Tableau!$AD$76,Tableau!$AD$82))","v":"ASHIKHMIN"},{"$f":"IF(Tableau!$AF$76=\"\",\"\",IF(Tableau!$AF$76=\"p\",Tableau!$AE$76,Tableau!$AE$82))","v":"75-4-LMAP"}]
["7ème",{"$f":"Tableau!AD86","v":"BIZARD"},{"$f":"Tableau!AE86","v":"75-4-LMAP"}]
["8ème",{"$f":"IF(Tableau!$AC$85=\"\",\"\",IF(Tableau!$AC$85=\"p\",Tableau!$AA$85,Tableau!$AA$87))","v":"ILLOUZ"},{"$f":"IF(Tableau!$AC$85=\"\",\"\",IF(Tableau!$AC$85=\"p\",Tableau!$AB$85,Tableau!$AB$87))","v":"75-4-LMAP"}]
["9ème",{"$f":"Tableau!AA70","v":"OYHARNART--FAYET"},{"$f":"Tableau!AB70","v":"75-4-LMAP"}]
["10ème",{"$f":"IF(Tableau!$Z$67=\"\",\"\",IF(Tableau!$Z$67=\"p\",Tableau!$X$67,Tableau!$X$73))","v":"GARREC"},{"$f":"IF(Tableau!$Z$67=\"\",\"\",IF(Tableau!$Z$67=\"p\",Tableau!$Y$67,Tableau!$Y$73))","v":"75-2-SLHP"}]
["11ème",{"$f":"Tableau!U83","v":"DENIS"},{"$f":"Tableau!V83","v":"75-4-LMAP"}]
["12ème",{"$f":"IF(Tableau!$T$83=\"\",\"\",IF(Tableau!$T$83=\"p\",Tableau!$R$83,Tableau!$R$84))","v":"MAHU"},{"$f":"IF(Tableau!$T$83=\"\",\"\",IF(Tableau!$T$83=\"p\",Tableau!$S$83,Tableau!$S$84))","v":"75-2-SLHP"}]
["13ème",{"$f":"Tableau!X79","v":"BONNIN"},{"$f":"Tableau!Y79","v":"75-4-BLOP"}]
["14ème",{"$f":"IF(Tableau!$W$78=\"\",\"\",IF(Tableau!$W$78=\"p\",Tableau!$U$78,Tableau!$U$80))","v":"MATHIAN"},{"$f":"IF(Tableau!$W$78=\"\",\"\",IF(Tableau!$W$78=\"p\",Tableau!$V$78,Tableau!$V$80))","v":"75-2-SUPA"}]
["15ème",{"$f":"Tableau!U87","v":"BRUNELAT"},{"$f":"Tableau!V87","v":"75-2-SUPA"}]
["16ème",{"$f":"IF(Tableau!$T$87=\"\",\"\",IF(Tableau!$T$87=\"p\",Tableau!$R$87,Tableau!$R$88))","v":"ANDRIOT"},{"$f":"IF(Tableau!$T$87=\"\",\"\",IF(Tableau!$T$87=\"p\",Tableau!$S$87,Tableau!$S$88))","v":"75-4-LMAP"}]
["17ème",{"$f":"Tableau!C32","v":"THOREL"},{"$f":"Tableau!B32","v":"75-4-FENP"}]
["18ème",{"$f":"IF(Tableau!$D$16=\"\",\"\",IF(Tableau!$D$16=\"p\",Tableau!$F$60,Tableau!$F$48))","v":"SALOME"},{"$f":"IF(Tableau!$D$16=\"\",\"\",IF(Tableau!$D$16=\"p\",Tableau!$E$16,Tableau!$E$48))","v":"75-4-LMAP"}]
["19ème",{"$f":"Tableau!C61","v":"ZOGHBI DE MEDLEGE GUILANI"},{"$f":"Tableau!B61","v":"75-4-LMAP"}]
["20ème",{"$f":"IF(Tableau!D60=\"\",\"\",IF(Tableau!$D$60=\"p\",Tableau!$F$60,Tableau!$F$62))","v":0},{"$f":"IF(Tableau!D60=\"\",\"\",IF(Tableau!$D$60=\"p\",Tableau!$E$60,Tableau!$E$62))","v":0}]
["21ème",{"$f":"Tableau!C87","v":"GALLAND"},{"$f":"Tableau!B87","v":"75-4-PCHP"}]
["22ème",{"$f":"IF(Tableau!$D$86=\"\",\"\",IF(Tableau!$D$86=\"p\",Tableau!$F$86,Tableau!$F$88))","v":"RISSE-RAUD"},{"$f":"IF(Tableau!$D$86=\"\",\"\",IF(Tableau!$D$86=\"p\",Tableau!$E$86,Tableau!$E$88))","v":"75-4-LMAP"}]
["23ème",{"$f":"Tableau!C91","v":""},{"$f":"Tableau!B91","v":""}]
["24ème",{"$f":"IF(Tableau!$D$91=\"\",\"\",IF(Tableau!$D$91=\"p\",Tableau!$F$91,Tableau!$F$92))","v":""},{"$f":"IF(Tableau!$D$91=\"\",\"\",IF(Tableau!$D$91=\"p\",Tableau!$E$91,Tableau!$E$92))","v":""}]
["25ème",{"$f":"Tableau!F70","v":""},{"$f":"Tableau!E70","v":""}]
["26ème",{"$f":"IF(Tableau!$G$67=\"\",\"\",IF(Tableau!$G$67=\"p\",Tableau!$I$67,Tableau!$I$73))","v":""},{"$f":"IF(Tableau!$G$67=\"\",\"\",IF(Tableau!$G$67=\"p\",Tableau!$H$73,Tableau!$H$67))","v":""}]
["27ème",{"$f":"Tableau!L83","v":""},{"$f":"Tableau!K83","v":""}]
["28ème",{"$f":"IF(Tableau!$M$83=\"\",\"\",IF(Tableau!$M$83=\"p\",Tableau!$O$83,Tableau!$O$84))","v":""},{"$f":"IF(Tableau!$M$83=\"\",\"\",IF(Tableau!$M$83=\"p\",Tableau!$N$83,Tableau!$N$84))","v":""}]
["29ème",{"$f":"Tableau!I79","v":""},{"$f":"Tableau!H79","v":""}]
["30ème",{"$f":"IF(Tableau!$J$78=\"\",\"\",IF(Tableau!$J$78=\"p\",Tableau!$L$78,Tableau!$L$80))","v":""},{"$f":"IF(Tableau!$J$78=\"\",\"\",IF(Tableau!$J$78=\"p\",Tableau!$K$78,Tableau!$K$80))","v":""}]
["31ème",{"$f":"Tableau!L87","v":""},{"$f":"Tableau!K87","v":""}]
["32ème",{"$f":"IF(Tableau!$M$87=\"\",\"\",IF(Tableau!$M$87=\"p\",Tableau!$O$87,Tableau!$O$88))","v":""},{"$f":"IF(Tableau!$M$87=\"\",\"\",IF(Tableau!$M$87=\"p\",Tableau!$N$87,Tableau!$N$88))","v":""}]

{"sheet":"Feuille de match","index":12,"n_rows":49,"n_cols":10,"rows_kept":49,"cut":false,"hidden":false,"merged":[[0,0,0,3],[0,7,0,9],[1,2,13,2],[1,8,13,8],[2,0,2,1],[2,3,2,4],[2,6,2,7],[2,9,2,10],[4,0,4,1],[4,3,4,4],[4,6,4,7],[4,9,4,10],[5,0,5,1],[5,3,5,4],[5,6,5,7],[5,9,5,10],[7,0,7,1],[7,3,7,4],[7,6,7,7],[7,9,7,10],[8,0,8,1],[8,3,8,4],[8,6,8,7],[8,9,8,10],[21,6,21,7],[21,9,21,10],[14,0,15,0],[14,1,15,3],[14,6,15,6],[14,7,15,9],[17,1,17,3],[17,7,17,9],[22,0,22,1],[22,3,22,4],[22,6,22,7],[22,9,22,10],[24,0,24,1],[24,3,24,4],[24,6,24,7],[24,9,24,10],[18,2,30,2],[18,8,30,8],[19,0,19,1],[19,3,19,4],[19,6,19,7],[19,9,19,10],[21,0,21,1],[21,3,21,4],[25,0,25,1],[25,3,25,4],[25,6,25,7],[25,9,25,10],[31,0,32,0],[31,1,32,3],[31,6,32,6],[31,7,32,9],[34,1,34,3],[34,7,34,9],[35,2,47,2],[35,8,47,8],[36,0,36,1],[36,3,36,4],[36,6,36,7],[36,9,36,10],[38,0,38,1],[38,3,38,4],[38,6,38,7],[38,9,38,10],[39,0,39,1],[39,3,39,4],[39,6,39,7],[39,9,39,10],[48,0,49,0],[48,1,49,3],[48,6,49,6],[48,7,49,9],[41,0,41,1],[41,3,41,4],[41,6,41,7],[41,9,41,10],[42,0,42,1],[42,3,42,4],[42,6,42,7],[42,9,42,10]]}
["Tennis de Table",null,null,null,{"$f":"Engagés!$E$3","v":"MF Promo"},null,null,"Tennis de Table"]
[]
["Catégorie",null,null,{"$f":"Engagés!$E$3","v":"MF Promo"},null,null,"Catégorie",null,null,{"$f":"Engagés!$E$3","v":"MF Promo"}]
[]
["NOM",null,null,"NOM",null,null,"NOM",null,null,"NOM"]
[]
[]
["SIGLE",null,null,"SIGLE",null,null,"SIGLE",null,null,"SIGLE"]
[]
[]
["1er set",null,null,null,null,null,"1er set"]
["2ème set",null,null,null,null,null,"2ème set"]
["3ème set",null,null,null,null,null,"3ème set"]
[]
["Vainqueur",null,null,null,null,null,"Vainqueur"]
[]
[]
[null,"Tennis de Table",null,null,null,null,null,"Tennis de Table"]
[]
["Catégorie",null,null,{"$f":"Engagés!$E$3","v":"MF Promo"},null,null,"Catégorie",null,null,{"$f":"Engagés!$E$3","v":"MF Promo"}]
[]
["NOM",null,null,"NOM",null,null,"NOM",null,null,"NOM"]
[]
[]
["SIGLE",null,null,"SIGLE",null,null,"SIGLE",null,null,"SIGLE"]
[]
[]
["1er set",null,null,null,null,null,"1er set"]
["2ème set",null,null,null,null,null,"2ème set"]
["3ème set",null,null,null,null,null,"3ème set"]
[]
["Vainqueur",null,null,null,null,null,"Vainqueur"]
[]
[]
[null,"Tennis de Table",null,null,null,null,null,"Tennis de Table"]
[]
["Catégorie",null,null,{"$f":"Engagés!$E$3","v":"MF Promo"},null,null,"Catégorie",null,null,{"$f":"Engagés!$E$3","v":"MF Promo"}]
[]
["NOM",null,null,"NOM",null,null,"NOM",null,null,"NOM"]
[]
[]
["SIGLE",null,null,"SIGLE",null,null,"SIGLE",null,null,"SIGLE"]
[]
[]
["1er set",null,null,null,null,null,"1er set"]
["2ème set",null,null,null,null,null,"2ème set"]
["3ème set",null,null,null,null,null,"3ème set"]
[]
["Vainqueur",null,null,null,null,null,"Vainqueur"]

{"sheet":"Feuilles","index":13,"n_rows":37,"n_cols":13,"rows_kept":37,"cut":false,"hidden":false,"merged":[[36,7,36,12],[27,7,28,12],[30,0,30,3],[30,4,30,5],[30,7,30,10],[30,11,30,12],[32,0,32,1],[32,7,32,8],[33,0,33,1],[33,7,33,8],[34,0,34,1],[34,7,34,8],[35,0,35,1],[35,7,35,8],[26,7,26,12],[16,7,16,12],[17,0,18,5],[17,7,18,12],[20,0,20,3],[20,4,20,5],[20,7,20,10],[20,11,20,12],[22,7,22,8],[23,0,23,1],[23,7,23,8],[24,7,24,8],[25,7,25,8],[0,4,0,5],[0,0,0,3],[0,7,0,10],[0,11,0,12],[10,0,10,3],[10,4,10,5],[10,7,10,10],[10,11,10,12],[2,7,2,8],[3,7,3,8],[4,7,4,8],[5,7,5,8],[6,7,6,12],[4,0,4,1],[5,0,5,1],[3,0,3,1],[37,7,38,12],[25,0,25,1],[22,0,22,1],[24,0,24,1],[7,0,8,5],[12,0,12,1],[16,0,16,5],[27,0,28,5],[15,0,15,1],[15,7,15,8],[7,7,8,12],[12,7,12,8],[13,0,13,1],[13,7,13,8],[14,0,14,1],[14,7,14,8],[2,0,2,1],[37,0,38,5],[6,0,6,5],[26,0,26,5],[36,0,36,5]]}
["Tennis de Table",null,null,null,{"$f":"Engagés!$E$3","v":"MF Promo"},null,null,"Tennis de Table",null,null,null,{"$f":"Engagés!$E$3","v":"MF Promo"}]
[]
["JOUEUR 1",null,"SIGLE","SET 1","SET 2","SET 3",null,"JOUEUR 1",null,"SIGLE","SET 1","SET 2","SET 3"]
[]
["JOUEUR 2",null,"SIGLE","SET 1","SET 2","SET 3",null,"JOUEUR 2",null,"SIGLE","SET 1","SET 2","SET 3"]
[]
["Vainqueur",null,null,null,null,null,null,"Vainqueur"]
[]
[]
[]
["Tennis de Table",null,null,null,{"$f":"Engagés!$E$3","v":"MF Promo"},null,null,"Tennis de Table",null,null,null,{"$f":"Engagés!$E$3","v":"MF Promo"}]
[]
["JOUEUR 1",null,"SIGLE","SET 1","SET 2","SET 3",null,"JOUEUR 1",null,"SIGLE","SET 1","SET 2","SET 3"]
[]
["JOUEUR 2",null,"SIGLE","SET 1","SET 2","SET 3",null,"JOUEUR 2",null,"SIGLE","SET 1","SET 2","SET 3"]
[]
["Vainqueur",null,null,null,null,null,null,"Vainqueur"]
[]
[]
[]
["Tennis de Table",null,null,null,{"$f":"Engagés!$E$3","v":"MF Promo"},null,null,"Tennis de Table",null,null,null,{"$f":"Engagés!$E$3","v":"MF Promo"}]
[]
["JOUEUR 1",null,"SIGLE","SET 1","SET 2","SET 3",null,"JOUEUR 1",null,"SIGLE","SET 1","SET 2","SET 3"]
[]
["JOUEUR 2",null,"SIGLE","SET 1","SET 2","SET 3",null,"JOUEUR 2",null,"SIGLE","SET 1","SET 2","SET 3"]
[]
["Vainqueur",null,null,null,null,null,null,"Vainqueur"]
[]
[]
[]
["Tennis de Table",null,null,null,{"$f":"Engagés!$E$3","v":"MF Promo"},null,null,"Tennis de Table",null,null,null,{"$f":"Engagés!$E$3","v":"MF Promo"}]
[]
["JOUEUR 1",null,"SIGLE","SET 1","SET 2","SET 3",null,"JOUEUR 1",null,"SIGLE","SET 1","SET 2","SET 3"]
[]
["JOUEUR 2",null,"SIGLE","SET 1","SET 2","SET 3",null,"JOUEUR 2",null,"SIGLE","SET 1","SET 2","SET 3"]
[]
["Vainqueur",null,null,null,null,null,null,"Vainqueur"]