{"text_format":"1","workbook":"xlsx","n_sheets":14,"sheets":["Engagés","Poule 1","Poule 2","Poule 3","Poule 4","Poule 5","Poule 6","Poule 7","Poule 8","Résultats de poule","Tableau","Classement","Feuille de match","Feuilles"],"not_rendered":{"charts":0,"images":82,"macros":1,"external_links":0,"defined_names":1,"comments":0,"pivot_tables":0},"unopened":[],"bounds":{"document_bytes":16777216,"sheet_cells":100000,"rows_first":2000,"rows_last":500,"rows_between":2000,"halvings":0,"cell_chars":16384,"cell_head_chars":4096},"cells_cut":0,"cells_raw":0,"read":"whole","date_system":"1900"}

{"sheet":"Engagés","index":0,"n_rows":37,"n_cols":14,"rows_kept":37,"cut":false,"hidden":false,"merged":[[17,6,17,9],[17,10,17,13],[23,6,23,9],[23,10,23,13],[0,0,2,1],[5,10,5,13],[5,6,5,9],[11,6,11,9],[11,10,11,13],[0,2,2,2]]}
["FINALES Comité de Paris ",null,"TENNIS DE TABLE","DATE :","8 fev"]
[null,null,null,"LIEU :","Stanislas"]
[null,null,null,"CATEGORIE :","MF Promo"]
["Tête de série","ETABLISSEMENT","NOM","PRENOM","SIGLE"]
[]
[1,"FENELON STE MARIE","GROB","CAMILLE","75-4-FENP",null,"Poule 1",null,null,null,"Poule 2"]
[2,"STANISLAS","DE BATTISTA","TIPHAINE","75-4-STAP",null,1,{"$f":"VLOOKUP($G7,$A$1:$E$37,3,FALSE)","v":"GROB"},{"$f":"VLOOKUP($G7,$A$1:$E$37,4,FALSE)","v":"CAMILLE"},{"$f":"VLOOKUP($G7,$A$1:$E$37,5,FALSE)","v":"75-4-FENP"},2,{"$f":"VLOOKUP($K7,$A$1:$E$37,3,FALSE)","v":"DE BATTISTA"},{"$f":"VLOOKUP($K7,$A$1:$E$37,4,FALSE)","v":"TIPHAINE"},{"$f":"VLOOKUP($K7,$A$1:$E$37,5,FALSE)","v":"75-4-STAP"}]
[3,"STANISLAS","DE POULPIQUET DU HALGOUET","SOLINE","75-4-STAP",null,16,{"$f":"VLOOKUP($G8,$A$1:$E$37,3,FALSE)","v":"OYHARNART--FAYET"},{"$f":"VLOOKUP($G8,$A$1:$E$37,4,FALSE)","v":"HORTENSE"},{"$f":"VLOOKUP($G8,$A$1:$E$37,5,FALSE)","v":"75-4-LMAP"},15,{"$f":"VLOOKUP($K8,$A$1:$E$37,3,FALSE)","v":"THOREL"},{"$f":"VLOOKUP($K8,$A$1:$E$37,4,FALSE)","v":"ZELIE"},{"$f":"VLOOKUP($K8,$A$1:$E$37,5,FALSE)","v":"75-4-FENP"}]
{"$rows_left_out":30}
{"sheet":"Poule 1","index":1,"n_rows":24,"n_cols":7,"rows_kept":24,"cut":false,"hidden":false,"merged":[[0,0,0,2],[0,3,0,4],[22,0,22,1],[20,2,20,3],[23,4,23,5],[22,4,22,5],[13,0,13,6],[14,3,14,4],[23,2,23,3],[21,0,21,1],[23,0,23,1],[21,2,21,3],[19,4,19,5],[20,4,20,5],[7,0,7,6],[8,3,8,4],[8,0,8,2],[9,0,9,2],[10,0,10,2],[1,0,1,2],[1,3,1,6],[22,2,22,3],[20,0,20,1],[18,4,18,6],[11,0,11,2],[12,0,12,2],[14,0,14,2],[17,0,17,2],[18,0,18,3],[21,4,21,5],[19,0,19,1],[15,0,15,2],[16,0,16,2],[19,2,19,3]]}
[{"$f":"Engagés!C1","v":"TENNIS DE TABLE"},null,null,{"$f":"Engagés!E3","v":"MF Promo"}]
["POULE 1"]
[null,"NOM","Prénom","Sigle","Vict","Def","Classement"]
[1,{"$f":"VLOOKUP($A4,Engagés!$A$1:$E$380,3,FALSE)","v":"GROB"},{"$f":"VLOOKUP($A4,Engagés!$A$1:$E$380,4,FALSE)","v":"CAMILLE"},{"$f":"VLOOKUP($A4,Engagés!$A$1:$E$380,5,FALSE)","v":"75-4-FENP"},null,null,"1er"]
[16,{"$f":"VLOOKUP($A5,Engagés!$A$1:$E$380,3,FALSE)","v":"OYHARNART--FAYET"},{"$f":"VLOOKUP($A5,Engagés!$A$1:$E$380,4,FALSE)","v":"HORTENSE"},{"$f":"VLOOKUP($A5,Engagés!$A$1:$E$380,5,FALSE)","v":"75-4-LMAP"},null,null,"2ème"]
[17,{"$f":"VLOOKUP($A6,Engagés!$A$1:$E$380,3,FALSE)","v":"MATHIAN"},{"$f":"VLOOKUP($A6,Engagés!$A$1:$E$380,4,FALSE)","v":"RAPHAELLE"},{"$f":"VLOOKUP($A6,Engagés!$A$1:$E$380,5,FALSE)","v":"75-2-SUPA"},null,null,"3ème"]
[32,{"$f":"VLOOKUP($A7,Engagés!$A$1:$E$380,3,FALSE)","v":0},{"$f":"VLOOKUP($A7,Engagés!$A$1:$E$380,4,FALSE)","v":0},{"$f":"VLOOKUP($A7,Engagés!$A$1:$E$380,5,FALSE)","v":0},null,null,"4ème"]
["Si poule de 4 joueurs alors…"]
{"$rows_left_out":17}
{"sheet":"Poule 2","index":2,"n_rows":24,"n_cols":7,"rows_kept":24,"cut":false,"hidden":false,"merged":[[0,3,0,4],[15,0,15,2],[16,0,16,2],[1,0,1,2],[1,3,1,6],[7,0,7,6],[8,0,8,2],[8,3,8,4],[9,0,9,2],[10,0,10,2],[11,0,11,2],[12,0,12,2],[13,0,13,6],[14,0,14,2],[14,3,14,4],[0,0,0,2],[17,0,17,2],[18,0,18,3],[18,4,18,6],[20,0,20,1],[20,2,20,3],[20,4,20,5],[19,0,19,1],[19,2,19,3],[19,4,19,5],[23,0,23,1],[23,2,23,3],[23,4,23,5],[21,0,21,1],[21,2,21,3],[21,4,21,5],[22,0,22,1],[22,2,22,3],[22,4,22,5]]}
[{"$f":"Engagés!C1","v":"TENNIS DE TABLE"},null,null,{"$f":"Engagés!E3","v":"MF Promo"}]
["POULE 2"]
[null,"NOM","Prénom","Sigle","Vict","Def","Classement"]
[2,{"$f":"VLOOKUP($A4,Engagés!$A$1:$E$380,3,FALSE)","v":"DE BATTISTA"},{"$f":"VLOOKUP($A4,Engagés!$A$1:$E$380,4,FALSE)","v":"TIPHAINE"},{"$f":"VLOOKUP($A4,Engagés!$A$1:$E$380,5,FALSE)","v":"75-4-STAP"},null,null,"1er"]
[15,{"$f":"VLOOKUP($A5,Engagés!$A$1:$E$380,3,FALSE)","v":"THOREL"},{"$f":"VLOOKUP($A5,Engagés!$A$1:$E$380,4,FALSE)","v":"ZELIE"},{"$f":"VLOOKUP($A5,Engagés!$A$1:$E$380,5,FALSE)","v":"75-4-FENP"},null,null,"3ème"]
[18,{"$f":"VLOOKUP($A6,Engagés!$A$1:$E$380,3,FALSE)","v":"DENIS"},{"$f":"VLOOKUP($A6,Engagés!$A$1:$E$380,4,FALSE)","v":"PRUNE"},{"$f":"VLOOKUP($A6,Engagés!$A$1:$E$380,5,FALSE)","v":"75-4-LMAP"},null,null,"2ème"]
[31,{"$f":"VLOOKUP($A7,Engagés!$A$1:$E$380,3,FALSE)","v":0},{"$f":"VLOOKUP($A7,Engagés!$A$1:$E$380,4,FALSE)","v":0},{"$f":"VLOOKUP($A7,Engagés!$A$1:$E$380,5,FALSE)","v":0},null,null,"4ème"]
["Si poule de 4 joueurs alors…"]
{"$rows_left_out":17}
{"sheet":"Poule 3","index":3,"n_rows":24,"n_cols":7,"rows_kept":24,"cut":false,"hidden":false,"merged":[[0,3,0,4],[15,0,15,2],[16,0,16,2],[1,0,1,2],[1,3,1,6],[7,0,7,6],[8,0,8,2],[8,3,8,4],[9,0,9,2],[10,0,10,2],[11,0,11,2],[12,0,12,2],[13,0,13,6],[14,0,14,2],[14,3,14,4],[0,0,0,2],[17,0,17,2],[18,0,18,3],[18,4,18,6],[20,0,20,1],[20,2,20,3],[20,4,20,5],[19,0,19,1],[19,2,19,3],[19,4,19,5],[23,0,23,1],[23,2,23,3],[23,4,23,5],[21,0,21,1],[21,2,21,3],[21,4,21,5],[22,0,22,1],[22,2,22,3],[22,4,22,5]]}
[{"$f":"Engagés!C1","v":"TENNIS DE TABLE"},null,null,{"$f":"Engagés!E3","v":"MF Promo"}]
["POULE 3"]
[null,"NOM","Prénom","Sigle","Vict","Def","Classement"]
[3,{"$f":"VLOOKUP($A4,Engagés!$A$1:$E$380,3,FALSE)","v":"DE POULPIQUET DU HALGOUET"},{"$f":"VLOOKUP($A4,Engagés!$A$1:$E$380,4,FALSE)","v":"SOLINE"},{"$f":"VLOOKUP($A4,Engagés!$A$1:$E$380,5,FALSE)","v":"75-4-STAP"},null,null,"1er"]
[14,{"$f":"VLOOKUP($A5,Engagés!$A$1:$E$380,3,FALSE)","v":"ASHIKHMIN"},{"$f":"VLOOKUP($A5,Engagés!$A$1:$E$380,4,FALSE)","v":"DOUNIA"},{"$f":"VLOOKUP($A5,Engagés!$A$1:$E$380,5,FALSE)","v":"75-4-LMAP"},null,null,"2ème"]
[19,{"$f":"VLOOKUP($A6,Engagés!$A$1:$E$380,3,FALSE)","v":0},{"$f":"VLOOKUP($A6,Engagés!$A$1:$E$380,4,FALSE)","v":0},{"$f":"VLOOKUP($A6,Engagés!$A$1:$E$380,5,FALSE)","v":0},null,null,"3ème"]
[30,{"$f":"VLOOKUP($A7,Engagés!$A$1:$E$380,3,FALSE)","v":0},{"$f":"VLOOKUP($A7,Engagés!$A$1:$E$380,4,FALSE)","v":0},{"$f":"VLOOKUP($A7,Engagés!$A$1:$E$380,5,FALSE)","v":0},null,null,"4ème"]
["Si poule de 4 joueurs alors…"]
{"$rows_left_out":17}
{"sheet":"Poule 4","index":4,"n_rows":24,"n_cols":7,"rows_kept":24,"cut":false,"hidden":false,"merged":[[0,3,0,4],[15,0,15,2],[16,0,16,2],[1,0,1,2],[1,3,1,6],[7,0,7,6],[8,0,8,2],[8,3,8,4],[9,0,9,2],[10,0,10,2],[11,0,11,2],[12,0,12,2],[13,0,13,6],[14,0,14,2],[14,3,14,4],[0,0,0,2],[17,0,17,2],[18,0,18,3],[18,4,18,6],[20,0,20,1],[20,2,20,3],[20,4,20,5],[19,0,19,1],[19,2,19,3],[19,4,19,5],[23,0,23,1],[23,2,23,3],[23,4,23,5],[21,0,21,1],[21,2,21,3],[21,4,21,5],[22,0,22,1],[22,2,22,3],[22,4,22,5]]}
[{"$f":"Engagés!C1","v":"TENNIS DE TABLE"},null,null,{"$f":"Engagés!E3","v":"MF Promo"}]
["POULE 4"]
[null,"NOM","Prénom","Sigle","Vict","Def","Classement"]
[4,{"$f":"VLOOKUP($A4,Engagés!$A$1:$E$380,3,FALSE)","v":"JEAN"},{"$f":"VLOOKUP($A4,Engagés!$A$1:$E$380,4,FALSE)","v":"ALICE"},{"$f":"VLOOKUP($A4,Engagés!$A$1:$E$380,5,FALSE)","v":"75-4-FENP"},null,null,"1er"]
[13,{"$f":"VLOOKUP($A5,Engagés!$A$1:$E$380,3,FALSE)","v":"MAHU"},{"$f":"VLOOKUP($A5,Engagés!$A$1:$E$380,4,FALSE)","v":"ELOISE"},{"$f":"VLOOKUP($A5,Engagés!$A$1:$E$380,5,FALSE)","v":"75-2-SLHP"},null,null,"2ème"]
[20,{"$f":"VLOOKUP($A6,Engagés!$A$1:$E$380,3,FALSE)","v":"SALOME"},{"$f":"VLOOKUP($A6,Engagés!$A$1:$E$380,4,FALSE)","v":"JOSEPHINE"},{"$f":"VLOOKUP($A6,Engagés!$A$1:$E$380,5,FALSE)","v":"75-4-LMAP"},null,null,"3ème"]
[29,{"$f":"VLOOKUP($A7,Engagés!$A$1:$E$380,3,FALSE)","v":0},{"$f":"VLOOKUP($A7,Engagés!$A$1:$E$380,4,FALSE)","v":0},{"$f":"VLOOKUP($A7,Engagés!$A$1:$E$380,5,FALSE)","v":0},null,null,"4ème"]
["Si poule de 4 joueurs alors…"]
{"$rows_left_out":17}
{"sheet":"Poule 5","index":5,"n_rows":24,"n_cols":7,"rows_kept":24,"cut":false,"hidden":false,"merged":[[12,0,12,2],[13,0,13,6],[0,0,0,2],[0,3,0,4],[10,0,10,2],[11,0,11,2],[1,0,1,2],[1,3,1,6],[7,0,7,6],[8,0,8,2],[8,3,8,4],[9,0,9,2],[20,0,20,1],[20,2,20,3],[20,4,20,5],[14,0,14,2],[14,3,14,4],[15,0,15,2],[18,4,18,6],[19,0,19,1],[19,2,19,3],[19,4,19,5],[16,0,16,2],[17,0,17,2],[18,0,18,3],[23,0,23,1],[23,2,23,3],[23,4,23,5],[21,0,21,1],[21,2,21,3],[21,4,21,5],[22,0,22,1],[22,2,22,3],[22,4,22,5]]}
[{"$f":"Engagés!C1","v":"TENNIS DE TABLE"},null,null,{"$f":"Engagés!E3","v":"MF Promo"}]
["POULE 5"]
[null,"NOM","Prénom","Sigle","Vict","Def","Classement"]
[5,{"$f":"VLOOKUP($A4,Engagés!$A$1:$E$380,3,FALSE)","v":"BIZARD"},{"$f":"VLOOKUP($A4,Engagés!$A$1:$E$380,4,FALSE)","v":"DARYA"},{"$f":"VLOOKUP($A4,Engagés!$A$1:$E$380,5,FALSE)","v":"75-4-LMAP"},null,null,"1er"]
[12,{"$f":"VLOOKUP($A5,Engagés!$A$1:$E$380,3,FALSE)","v":0},{"$f":"VLOOKUP($A5,Engagés!$A$1:$E$380,4,FALSE)","v":0},{"$f":"VLOOKUP($A5,Engagés!$A$1:$E$380,5,FALSE)","v":0},null,null,"3ème"]
[21,{"$f":"VLOOKUP($A6,Engagés!$A$1:$E$380,3,FALSE)","v":"ANDRIOT"},{"$f":"VLOOKUP($A6,Engagés!$A$1:$E$380,4,FALSE)","v":"ALICE"},{"$f":"VLOOKUP($A6,Engagés!$A$1:$E$380,5,FALSE)","v":"75-4-LMAP"},null,null,"2ème"]
[28,{"$f":"VLOOKUP($A7,Engagés!$A$1:$E$380,3,FALSE)","v":0},{"$f":"VLOOKUP($A7,Engagés!$A$1:$E$380,4,FALSE)","v":0},{"$f":"VLOOKUP($A7,Engagés!$A$1:$E$380,5,FALSE)","v":0},null,null,"4ème"]
["Si poule de 4 joueurs alors…"]
{"$rows_left_out":17}
{"sheet":"Poule 6","index":6,"n_rows":24,"n_cols":7,"rows_kept":24,"cut":false,"hidden":false,"merged":[[12,0,12,2],[13,0,13,6],[0,0,0,2],[0,3,0,4],[10,0,10,2],[11,0,11,2],[1,0,1,2],[1,3,1,6],[7,0,7,6],[8,0,8,2],[8,3,8,4],[9,0,9,2],[20,0,20,1],[20,2,20,3],[20,4,20,5],[14,0,14,2],[14,3,14,4],[15,0,15,2],[18,4,18,6],[19,0,19,1],[19,2,19,3],[19,4,19,5],[16,0,16,2],[17,0,17,2],[18,0,18,3],[23,0,23,1],[23,2,23,3],[23,4,23,5],[21,0,21,1],[21,2,21,3],[21,4,21,5],[22,0,22,1],[22,2,22,3],[22,4,22,5]]}
[{"$f":"Engagés!C1","v":"TENNIS DE TABLE"},null,null,{"$f":"Engagés!E3","v":"MF Promo"}]
["POULE 6"]
[null,"NOM","Prénom","Sigle","Vict","Def","Classement"]
[6,{"$f":"VLOOKUP($A4,Engagés!$A$1:$E$380,3,FALSE)","v":"ROY-REMY"},{"$f":"VLOOKUP($A4,Engagés!$A$1:$E$380,4,FALSE)","v":"VALENTINE"},{"$f":"VLOOKUP($A4,Engagés!$A$1:$E$380,5,FALSE)","v":"75-4-LMAP"},null,null,"1er"]
[11,{"$f":"VLOOKUP($A5,Engagés!$A$1:$E$380,3,FALSE)","v":"BONNIN"},{"$f":"VLOOKUP($A5,Engagés!$A$1:$E$380,4,FALSE)","v":"ELEONORE"},{"$f":"VLOOKUP($A5,Engagés!$A$1:$E$380,5,FALSE)","v":"75-4-BLOP"},null,null,"2ème"]
[22,{"$f":"VLOOKUP($A6,Engagés!$A$1:$E$380,3,FALSE)","v":"RISSE-RAUD"},{"$f":"VLOOKUP($A6,Engagés!$A$1:$E$380,4,FALSE)","v":"MAHAUT"},{"$f":"VLOOKUP($A6,Engagés!$A$1:$E$380,5,FALSE)","v":"75-4-LMAP"},null,null,"3ème"]
[27,{"$f":"VLOOKUP($A7,Engagés!$A$1:$E$380,3,FALSE)","v":0},{"$f":"VLOOKUP($A7,Engagés!$A$1:$E$380,4,FALSE)","v":0},{"$f":"VLOOKUP($A7,Engagés!$A$1:$E$380,5,FALSE)","v":0},null,null,"4ème"]
["Si poule de 4 joueurs alors…"]
{"$rows_left_out":17}
{"sheet":"Poule 7","index":7,"n_rows":24,"n_cols":7,"rows_kept":24,"cut":false,"hidden":false,"merged":[[12,0,12,2],[13,0,13,6],[0,0,0,2],[0,3,0,4],[10,0,10,2],[11,0,11,2],[1,0,1,2],[1,3,1,6],[7,0,7,6],[8,0,8,2],[8,3,8,4],[9,0,9,2],[20,0,20,1],[20,2,20,3],[20,4,20,5],[14,0,14,2],[14,3,14,4],[15,0,15,2],[18,4,18,6],[19,0,19,1],[19,2,19,3],[19,4,19,5],[16,0,16,2],[17,0,17,2],[18,0,18,3],[23,0,23,1],[23,2,23,3],[23,4,23,5],[21,0,21,1],[21,2,21,3],[21,4,21,5],[22,0,22,1],[22,2,22,3],[22,4,22,5]]}
[{"$f":"Engagés!C1","v":"TENNIS DE TABLE"},null,null,{"$f":"Engagés!E3","v":"MF Promo"}]
["POULE 7"]
[null,"NOM","Prénom","Sigle","Vict","Def","Classement"]
[7,{"$f":"VLOOKUP($A4,Engagés!$A$1:$E$380,3,FALSE)","v":"BRUNELAT"},{"$f":"VLOOKUP($A4,Engagés!$A$1:$E$380,4,FALSE)","v":"CAMILLE"},{"$f":"VLOOKUP($A4,Engagés!$A$1:$E$380,5,FALSE)","v":"75-2-SUPA"},null,null,"2ème"]
[10,{"$f":"VLOOKUP($A5,Engagés!$A$1:$E$380,3,FALSE)","v":"ILLOUZ"},{"$f":"VLOOKUP($A5,Engagés!$A$1:$E$380,4,FALSE)","v":"LEANA"},{"$f":"VLOOKUP($A5,Engagés!$A$1:$E$380,5,FALSE)","v":"75-4-LMAP"},null,null,"1er"]
[23,{"$f":"VLOOKUP($A6,Engagés!$A$1:$E$380,3,FALSE)","v":0},{"$f":"VLOOKUP($A6,Engagés!$A$1:$E$380,4,FALSE)","v":0},{"$f":"VLOOKUP($A6,Engagés!$A$1:$E$380,5,FALSE)","v":0},null,null,"3ème"]
[26,{"$f":"VLOOKUP($A7,Engagés!$A$1:$E$380,3,FALSE)","v":0},{"$f":"VLOOKUP($A7,Engagés!$A$1:$E$380,4,FALSE)","v":0},{"$f":"VLOOKUP($A7,Engagés!$A$1:$E$380,5,FALSE)","v":0},null,null,"4ème"]
["Si poule de 4 joueurs alors…"]
{"$rows_left_out":17}
{"sheet":"Poule 8","index":8,"n_rows":24,"n_cols":7,"rows_kept":24,"cut":false,"hidden":false,"merged":[[12,0,12,2],[13,0,13,6],[0,0,0,2],[0,3,0,4],[10,0,10,2],[11,0,11,2],[1,0,1,2],[1,3,1,6],[7,0,7,6],[8,0,8,2],[8,3,8,4],[9,0,9,2],[20,0,20,1],[20,2,20,3],[20,4,20,5],[14,0,14,2],[14,3,14,4],[15,0,15,2],[18,4,18,6],[19,0,19,1],[19,2,19,3],[19,4,19,5],[16,0,16,2],[17,0,17,2],[18,0,18,3],[23,0,23,1],[23,2,23,3],[23,4,23,5],[21,0,21,1],[21,2,21,3],[21,4,21,5],[22,0,22,1],[22,2,22,3],[22,4,22,5]]}
[{"$f":"Engagés!C1","v":"TENNIS DE TABLE"},null,null,{"$f":"Engagés!E3","v":"MF Promo"}]
["POULE 8"]
[null,"NOM","Prénom","Sigle","Vict","Def","Classement"]
[8,{"$f":"VLOOKUP($A4,Engagés!$A$1:$E$380,3,FALSE)","v":"GALLAND"},{"$f":"VLOOKUP($A4,Engagés!$A$1:$E$380,4,FALSE)","v":"CLEMENCE"},{"$f":"VLOOKUP($A4,Engagés!$A$1:$E$380,5,FALSE)","v":"75-4-PCHP"},null,null,"3ème"]
[9,{"$f":"VLOOKUP($A5,Engagés!$A$1:$E$380,3,FALSE)","v":"GARREC"},{"$f":"VLOOKUP($A5,Engagés!$A$1:$E$380,4,FALSE)","v":"JULIE"},{"$f":"VLOOKUP($A5,Engagés!$A$1:$E$380,5,FALSE)","v":"75-2-SLHP"},null,null,"1er"]
[24,{"$f":"VLOOKUP($A6,Engagés!$A$1:$E$380,3,FALSE)","v":"ZOGHBI DE MEDLEGE GUILANI"},{"$f":"VLOOKUP($A6,Engagés!$A$1:$E$380,4,FALSE)","v":"HENRYETTE"},{"$f":"VLOOKUP($A6,Engagés!$A$1:$E$380,5,FALSE)","v":"75-4-LMAP"},null,null,"2ème"]
[25,{"$f":"VLOOKUP($A7,Engagés!$A$1:$E$380,3,FALSE)","v":0},{"$f":"VLOOKUP($A7,Engagés!$A$1:$E$380,4,FALSE)","v":0},{"$f":"VLOOKUP($A7,Engagés!$A$1:$E$380,5,FALSE)","v":0},null,null,"4ème"]
["Si poule de 4 joueurs alors…"]
{"$rows_left_out":17}
{"sheet":"Résultats de poule","index":9,"n_rows":10,"n_cols":16,"rows_kept":10,"cut":false,"hidden":false,"merged":[[0,0,0,3],[0,4,0,7],[0,8,0,11],[0,12,0,15],[5,0,5,3],[5,4,5,7],[5,8,5,11],[5,12,5,15]]}
["Poule 1",null,null,null,"Poule 2",null,null,null,"Poule 3",null,null,null,"Poule 4"]
["1er",{"$f":"'Poule 1'!$C21","v":"GROB"},{"$f":"'Poule 1'!$E21","v":"CAMILLE"},{"$f":"'Poule 1'!$G21","v":"75-4-FENP"},"1er",{"$f":"'Poule 2'!$C21","v":"DE BATTISTA"},{"$f":"'Poule 2'!$E21","v":"TIPHAINE"},{"$f":"'Poule 2'!$G21","v":"75-4-STAP"},"1er",{"$f":"'Poule 3'!$C21","v":"DE POULPIQUET DU HALGOUET"},{"$f":"'Poule 3'!$E21","v":"SOLINE"},{"$f":"'Poule 3'!$G21","v":"75-4-STAP"},"1er",{"$f":"'Poule 4'!$C21","v":"JEAN"},{"$f":"'Poule 4'!$E21","v":"ALICE"},{"$f":"'Poule 4'!$G21","v":"75-4-FENP"}]
["2ème",{"$f":"'Poule 1'!$C22","v":"OYHARNART--FAYET"},{"$f":"'Poule 1'!$E22","v":"HORTENSE"},{"$f":"'Poule 1'!$G22","v":"75-4-LMAP"},"2ème",{"$f":"'Poule 2'!$C22","v":"DENIS"},{"$f":"'Poule 2'!$E22","v":"PRUNE"},{"$f":"'Poule 2'!$G22","v":"75-4-LMAP"},"2ème",{"$f":"'Poule 3'!$C22","v":"ASHIKHMIN"},{"$f":"'Poule 3'!$E22","v":"DOUNIA"},{"$f":"'Poule 3'!$G22","v":"75-4-LMAP"},"2ème",{"$f":"'Poule 4'!$C22","v":"MAHU"},{"$f":"'Poule 4'!$E22","v":"ELOISE"},{"$f":"'Poule 4'!$G22","v":"75-2-SLHP"}]
["3ème",{"$f":"'Poule 1'!$C23","v":"MATHIAN"},{"$f":"'Poule 1'!$E23","v":"RAPHAELLE"},{"$f":"'Poule 1'!$G23","v":"75-2-SUPA"},"3ème",{"$f":"'Poule 2'!$C23","v":"THOREL"},{"$f":"'Poule 2'!$E23","v":"ZELIE"},{"$f":"'Poule 2'!$G23","v":"75-4-FENP"},"3ème",{"$f":"'Poule 3'!$C23","v":0},{"$f":"'Poule 3'!$E23","v":0},{"$f":"'Poule 3'!$G23","v":0},"3ème",{"$f":"'Poule 4'!$C23","v":"SALOME"},{"$f":"'Poule 4'!$E23","v":"JOSEPHINE"},{"$f":"'Poule 4'!$G23","v":"75-4-LMAP"}]
["4ème",{"$f":"'Poule 1'!$C24","v":0},{"$f":"'Poule 1'!$E24","v":0},{"$f":"'Poule 1'!$G24","v":0},"4ème",{"$f":"'Poule 2'!$C24","v":0},{"$f":"'Poule 2'!$E24","v":0},{"$f":"'Poule 2'!$G24","v":0},"4ème",{"$f":"'Poule 3'!$C24","v":0},{"$f":"'Poule 3'!$E24","v":0},{"$f":"'Poule 3'!$G24","v":0},"4ème",{"$f":"'Poule 4'!$C24","v":0},{"$f":"'Poule 4'!$E24","v":0},{"$f":"'Poule 4'!$G24","v":0}]
["Poule 5",null,null,null,"Poule 6",null,null,null,"Poule 7",null,null,null,"Poule 8"]
["1er",{"$f":"'Poule 5'!$C21","v":"BIZARD"},{"$f":"'Poule 5'!$E21","v":"DARYA"},{"$f":"'Poule 5'!$G21","v":"75-4-LMAP"},"1er",{"$f":"'Poule 6'!$C21","v":"ROY-REMY"},{"$f":"'Poule 6'!$E21","v":"VALENTINE"},{"$f":"'Poule 6'!$G21","v":"75-4-LMAP"},"1er",{"$f":"'Poule 7'!$C21","v":"ILLOUZ"},{"$f":"'Poule 7'!$E21","v":"LEANA"},{"$f":"'Poule 7'!$G21","v":"75-4-LMAP"},"1er",{"$f":"'Poule 8'!$C21","v":"GARREC"},{"$f":"'Poule 8'!$E21","v":"JULIE"},{"$f":"'Poule 8'!$G21","v":"75-2-SLHP"}]
["2ème",{"$f":"'Poule 5'!$C22","v":"ANDRIOT"},{"$f":"'Poule 5'!$E22","v":"ALICE"},{"$f":"'Poule 5'!$G22","v":"75-4-LMAP"},"2ème",{"$f":"'Poule 6'!$C22","v":"BONNIN"},{"$f":"'Poule 6'!$E22","v":"ELEONORE"},{"$f":"'Poule 6'!$G22","v":"75-4-BLOP"},"2ème",{"$f":"'Poule 7'!$C22","v":"BRUNELAT"},{"$f":"'Poule 7'!$E22","v":"CAMILLE"},{"$f":"'Poule 7'!$G22","v":"75-2-SUPA"},"2ème",{"$f":"'Poule 8'!$C22","v":"ZOGHBI DE MEDLEGE GUILANI"},{"$f":"'Poule 8'!$E22","v":"HENRYETTE"},{"$f":"'Poule 8'!$G22","v":"75-4-LMAP"}]
{"$rows_left_out":3}
{"sheet":"Tableau","index":10,"n_rows":92,"n_cols":34,"rows_kept":92,"cut":false,"hidden":false,"merged":[[8,10,8,11],[50,20,50,21],[16,10,16,11],[23,10,23,11],[33,10,33,11],[40,10,40,11],[48,10,48,11],[10,20,10,21],[30,32,30,33],[0,16,0,19],[15,29,15,30],[0,0,0,14],[31,29,31,30],[10,1,10,2],[1,4,1,5],[0,20,0,33],[16,26,16,27],[23,23,23,24],[3,20,3,21],[18,20,18,21],[29,4,29,5],[25,20,25,21],[1,10,1,11],[9,23,9,24],[55,10,55,11],[33,4,33,5],[42,1,42,2],[59,29,59,30],[55,23,55,24],[47,29,47,30],[35,20,35,21],[42,20,42,21],[41,23,41,24],[48,26,48,27],[57,20,57,21]]}
["REPECHAGES ET MATCHS DE CLASSEMENT",null,null,null,null,null,null,null,null,null,null,null,null,null,null,null,"1er tour de tableau",null,null,null,"TABLEAU PRINCIPAL"]
[]
[]
[null,null,null,null,null,null,null,null,null,null,null,null,null,null,null,null,"1er poule 1",{"$f":"'Résultats de poule'!B2","v":"GROB"},{"$f":"'Résultats de poule'!D2","v":"75-4-FENP"},"V","1/8 de finale 1"]
[null,null,null,null,null,null,null,null,null,null,null,null,"P",{"$f":"IF(T4=\"\",\"\",IF(T4=\"p\",S4,S5))","v":0},{"$f":"IF(T4=\"\",\"\",IF(T4=\"p\",R4,R5))","v":0},null,"4ème poule 8",{"$f":"'Résultats de poule'!N10","v":0},{"$f":"'Résultats de poule'!P10","v":0},"P",{"$f":"IF(T4=\"\",\"\",IF(T4=\"v\",R4,R5))","v":"GROB"},{"$f":"IF(T4=\"\",\"\",IF(T4=\"v\",S4,S5))","v":"75-4-FENP"},"V"]
[null,null,null,null,null,null,null,null,null,"V",{"$f":"IF(M5=\"\",\"\",IF(M5=\"v\",N5,N7))","v":0},{"$f":"IF(M5=\"\",\"\",IF(M5=\"v\",O5,O7))","v":0},null,null,null,null,null,null,null,null,null,null,null,{"$f":"IF(W5=\"\",\"\",IF(W5=\"v\",U5,U7))","v":"GROB"},{"$f":"IF(W5=\"\",\"\",IF(W5=\"v\",V5,V7))","v":"75-4-FENP"},"V"]
[null,null,null,null,null,null,null,null,null,null,null,null,"V",{"$f":"IF(T7=\"\",\"\",IF(T7=\"p\",S7,S8))","v":0},{"$f":"IF(T7=\"\",\"\",IF(T7=\"p\",R7,R8))","v":0},null,"3ème poule 3",{"$f":"'Résultats de poule'!J4","v":0},{"$f":"'Résultats de poule'!L4","v":0},"P",{"$f":"IF(T7=\"\",\"\",IF(T7=\"v\",R7,R8))","v":"BONNIN"},{"$f":"IF(T7=\"\",\"\",IF(T7=\"v\",S7,S8))","v":"75-4-BLOP"},"P"]
[null,null,null,null,null,null,null,null,null,null,null,null,null,null,null,null,"2ème poule 6",{"$f":"'Résultats de poule'!F8","v":"BONNIN"},{"$f":"'Résultats de poule'!H8","v":"75-4-BLOP"},"V"]
{"$rows_left_out":85}
{"sheet":"Classement","index":11,"n_rows":35,"n_cols":3,"rows_kept":35,"cut":false,"hidden":false,"merged":[[1,0,1,2],[0,0,0,2]]}
[{"$f":"IF(Engagés!A1=\"\",\"\",Engagés!A1)","v":"FINALES Comité de Paris "}]
[{"$f":"IF(Engagés!E3=\"\",\"\",Engagés!E3)","v":"MF Promo"}]
["CLASSEMENT","NOMS","Etablissement"]
["1er",{"$f":"Tableau!AG32","v":"DE BATTISTA"},{"$f":"Tableau!AH32","v":"75-4-STAP"}]
["2ème",{"$f":"IF(Tableau!$AF$17=\"\",\"\",IF(Tableau!$AF$17=\"p\",Tableau!$AD$17,Tableau!$AD$49))","v":"GROB"},{"$f":"IF(Tableau!$AF$17=\"\",\"\",IF(Tableau!$AF$17=\"p\",Tableau!$AE$17,Tableau!$AE$49))","v":"75-4-FENP"}]
["3ème",{"$f":"Tableau!AG62","v":"ROY-REMY"},{"$f":"Tableau!AH62","v":"75-4-LMAP"}]
["4ème",{"$f":"IF(Tableau!AF61=\"\",\"\",IF(Tableau!$AF$61=\"p\",Tableau!$AD$61,Tableau!$AD$63))","v":"DE POULPIQUET DU HALGOUET"},{"$f":"IF(Tableau!AF61=\"\",\"\",IF(Tableau!$AF$61=\"p\",Tableau!$AE$61,Tableau!$AE$63))","v":"75-4-STAP"}]
["5ème",{"$f":"Tableau!AG79","v":"JEAN"},{"$f":"Tableau!AH79","v":"75-4-FENP"}]
{"$rows_left_out":28}
{"sheet":"Feuille de match","index":12,"n_rows":49,"n_cols":10,"rows_kept":49,"cut":false,"hidden":false,"merged":[[0,0,0,3],[0,7,0,9],[1,2,13,2],[1,8,13,8],[2,0,2,1],[2,3,2,4],[2,6,2,7],[2,9,2,10],[4,0,4,1],[4,3,4,4],[4,6,4,7],[4,9,4,10],[5,0,5,1],[5,3,5,4],[5,6,5,7],[5,9,5,10],[7,0,7,1],[7,3,7,4],[7,6,7,7],[7,9,7,10],[8,0,8,1],[8,3,8,4],[8,6,8,7],[8,9,8,10],[21,6,21,7],[21,9,21,10],[14,0,15,0],[14,1,15,3],[14,6,15,6],[14,7,15,9],[17,1,17,3],[17,7,17,9],[22,0,22,1],[22,3,22,4],[22,6,22,7],[22,9,22,10],[24,0,24,1],[24,3,24,4],[24,6,24,7],[24,9,24,10],[18,2,30,2],[18,8,30,8],[19,0,19,1],[19,3,19,4],[19,6,19,7],[19,9,19,10],[21,0,21,1],[21,3,21,4],[25,0,25,1],[25,3,25,4],[25,6,25,7],[25,9,25,10],[31,0,32,0],[31,1,32,3],[31,6,32,6],[31,7,32,9],[34,1,34,3],[34,7,34,9],[35,2,47,2],[35,8,47,8],[36,0,36,1],[36,3,36,4],[36,6,36,7],[36,9,36,10],[38,0,38,1],[38,3,38,4],[38,6,38,7],[38,9,38,10],[39,0,39,1],[39,3,39,4],[39,6,39,7],[39,9,39,10],[48,0,49,0],[48,1,49,3],[48,6,49,6],[48,7,49,9],[41,0,41,1],[41,3,41,4],[41,6,41,7],[41,9,41,10],[42,0,42,1],[42,3,42,4],[42,6,42,7],[42,9,42,10]]}
["Tennis de Table",null,null,null,{"$f":"Engagés!$E$3","v":"MF Promo"},null,null,"Tennis de Table"]
[]
["Catégorie",null,null,{"$f":"Engagés!$E$3","v":"MF Promo"},null,null,"Catégorie",null,null,{"$f":"Engagés!$E$3","v":"MF Promo"}]
[]
["NOM",null,null,"NOM",null,null,"NOM",null,null,"NOM"]
[]
[]
["SIGLE",null,null,"SIGLE",null,null,"SIGLE",null,null,"SIGLE"]
{"$rows_left_out":42}
{"sheet":"Feuilles","index":13,"n_rows":37,"n_cols":13,"rows_kept":37,"cut":false,"hidden":false,"merged":[[36,7,36,12],[27,7,28,12],[30,0,30,3],[30,4,30,5],[30,7,30,10],[30,11,30,12],[32,0,32,1],[32,7,32,8],[33,0,33,1],[33,7,33,8],[34,0,34,1],[34,7,34,8],[35,0,35,1],[35,7,35,8],[26,7,26,12],[16,7,16,12],[17,0,18,5],[17,7,18,12],[20,0,20,3],[20,4,20,5],[20,7,20,10],[20,11,20,12],[22,7,22,8],[23,0,23,1],[23,7,23,8],[24,7,24,8],[25,7,25,8],[0,4,0,5],[0,0,0,3],[0,7,0,10],[0,11,0,12],[10,0,10,3],[10,4,10,5],[10,7,10,10],[10,11,10,12],[2,7,2,8],[3,7,3,8],[4,7,4,8],[5,7,5,8],[6,7,6,12],[4,0,4,1],[5,0,5,1],[3,0,3,1],[37,7,38,12],[25,0,25,1],[22,0,22,1],[24,0,24,1],[7,0,8,5],[12,0,12,1],[16,0,16,5],[27,0,28,5],[15,0,15,1],[15,7,15,8],[7,7,8,12],[12,7,12,8],[13,0,13,1],[13,7,13,8],[14,0,14,1],[14,7,14,8],[2,0,2,1],[37,0,38,5],[6,0,6,5],[26,0,26,5],[36,0,36,5]]}
["Tennis de Table",null,null,null,{"$f":"Engagés!$E$3","v":"MF Promo"},null,null,"Tennis de Table",null,null,null,{"$f":"Engagés!$E$3","v":"MF Promo"}]
[]
["JOUEUR 1",null,"SIGLE","SET 1","SET 2","SET 3",null,"JOUEUR 1",null,"SIGLE","SET 1","SET 2","SET 3"]
[]
["JOUEUR 2",null,"SIGLE","SET 1","SET 2","SET 3",null,"JOUEUR 2",null,"SIGLE","SET 1","SET 2","SET 3"]
[]
["Vainqueur",null,null,null,null,null,null,"Vainqueur"]
[]
{"$rows_left_out":29}