{"text_format":"1","workbook":"xlsx","n_sheets":9,"sheets":["Calendrier général","Calendrier BG","Cls BG","Calendrier MG","Cls MG 1","Classements","Indispos profs","Listing profs","Installations"],"not_rendered":{"charts":0,"images":0,"macros":0,"external_links":0,"defined_names":1,"comments":0,"pivot_tables":0},"unopened":[],"bounds":{"document_bytes":16777216,"sheet_cells":100000,"rows_first":2000,"rows_last":500,"rows_between":2000,"halvings":0,"cell_chars":16384,"cell_head_chars":4096},"cells_cut":0,"cells_raw":0,"read":"whole","date_system":"1900"}

{"sheet":"Calendrier général","index":0,"n_rows":110,"n_cols":19,"rows_kept":110,"cut":false,"hidden":false,"merged":[[83,11,88,18],[89,10,93,10],[77,10,82,10],[77,0,82,0],[83,0,88,0],[83,10,88,10],[89,1,93,8],[89,0,93,0],[41,0,46,0],[41,1,46,8],[41,10,46,10],[41,11,46,18],[35,0,40,0],[35,1,40,8],[35,10,40,10],[35,11,40,18],[18,0,23,0],[18,1,23,8],[29,0,34,0],[29,1,34,8],[29,10,34,10],[24,0,28,0],[29,11,34,18],[24,4,26,4],[24,10,28,10],[24,14,25,14],[26,14,27,14],[27,4,28,4],[2,0,9,0],[2,4,4,4],[7,4,9,4],[10,0,17,0],[14,4,17,4],[12,14,15,14],[18,10,23,10],[18,11,23,18],[0,1,0,8],[1,6,1,7],[0,11,0,18],[1,16,1,17],[2,10,9,10],[2,14,4,14],[10,10,17,10],[53,11,58,18],[47,10,50,10],[53,0,58,0],[53,1,58,8],[53,10,58,10],[47,0,52,0],[94,10,98,10],[104,0,108,0],[104,1,108,8],[59,10,63,10],[64,10,70,10],[71,10,76,10],[59,0,63,0],[64,0,69,0],[71,0,76,0],[71,1,76,8],[94,0,98,0],[94,1,98,8],[109,10,113,10],[109,11,113,18],[99,10,103,10],[99,0,103,0],[99,1,103,8]]}
[null," CALENDRIER BENJAMINS ",null,null,null,null,null,null,null,null,null," CALENDRIER MINIMES"]
["Date","Match","Equipe A","Equipe B","Lieux","Horaires","Résultats",null,"Indisponibilités",null,"Date","Match","Equipe A","Equipe B","Lieux","Horaires","Résultats",null,"Indisponibilités"]
["2021-11-17",4,{"$f":"'Calendrier BG'!C3","v":"STMA 3 (F)"},{"$f":"'Calendrier BG'!D3","v":"STMA 2"},"STMA",null,{"$f":"'Calendrier BG'!G3","v":0},{"$f":"'Calendrier BG'!H3","v":2},null,null,"2021-11-17",1,{"$f":"'Calendrier MG'!C3","v":"STMA 2"},{"$f":"'Calendrier MG'!D3","v":"STMA 3 (F)"},"STMA",null,{"$f":"'Calendrier MG'!G3","v":2},{"$f":"'Calendrier MG'!H3","v":0}]
[null,40,{"$f":"'Calendrier BG'!C4","v":"STMA 3 (F)"},{"$f":"'Calendrier BG'!D4","v":"STMA 1"},null,null,{"$f":"'Calendrier BG'!G4","v":0},{"$f":"'Calendrier BG'!H4","v":2},null,null,null,28,{"$f":"'Calendrier MG'!C4","v":"STMA 1"},{"$f":"'Calendrier MG'!D4","v":"STMA 3 (F)"},null,null,{"$f":"'Calendrier MG'!G4","v":2},{"$f":"'Calendrier MG'!H4","v":0}]
[null,45,{"$f":"'Calendrier BG'!C5","v":"STMA 1"},{"$f":"'Calendrier BG'!D5","v":"STMA 2"},null,null,{"$f":"'Calendrier BG'!G5","v":2},{"$f":"'Calendrier BG'!H5","v":0},null,null,null,5,{"$f":"'Calendrier MG'!C5","v":"STMA 1"},{"$f":"'Calendrier MG'!D5","v":"STMA 2"},null,null,{"$f":"'Calendrier MG'!G5","v":2},{"$f":"'Calendrier MG'!H5","v":0}]
[null,36,{"$f":"'Calendrier BG'!C6","v":"JBS 2 (F)"},{"$f":"'Calendrier BG'!D6","v":"JBS 1"},"JBS",null,{"$f":"'Calendrier BG'!G6","v":0},{"$f":"'Calendrier BG'!H6","v":2},null,null,null,25,{"$f":"'Calendrier MG'!C6","v":"JBS 1"},{"$f":"'Calendrier MG'!D6","v":"JBS 2"},"JBS",null,{"$f":"'Calendrier MG'!G6","v":2},{"$f":"'Calendrier MG'!H6","v":0}]
[null,30,{"$f":"'Calendrier BG'!C7","v":"NDF 2 (F)"},{"$f":"'Calendrier BG'!D7","v":"NDF 1"},"NDF",null,{"$f":"'Calendrier BG'!G7","v":0},{"$f":"'Calendrier BG'!H7","v":2},null,null,null,15,{"$f":"'Calendrier MG'!C7","v":"NDF 2 (F)"},{"$f":"'Calendrier MG'!D7","v":"NDF 1"},"NDF",null,{"$f":"'Calendrier MG'!G7","v":2},{"$f":"'Calendrier MG'!H7","v":0}]
[null,7,{"$f":"'Calendrier BG'!C8","v":"SVI 1"},{"$f":"'Calendrier BG'!D8","v":"SVI 2"},"SVI",null,{"$f":"'Calendrier BG'!G8","v":2},{"$f":"'Calendrier BG'!H8","v":0},null,null,null,null,null,null,null,null,{"$f":"'Calendrier MG'!G8","v":""},{"$f":"'Calendrier MG'!H8","v":""}]
[null,26,{"$f":"'Calendrier BG'!C9","v":"SVI 3"},{"$f":"'Calendrier BG'!D9","v":"SVI 2"},null,null,{"$f":"'Calendrier BG'!G9","v":1},{"$f":"'Calendrier BG'!H9","v":2},null,null,null,null,null,null,null,null,{"$f":"'Calendrier MG'!G9","v":""},{"$f":"'Calendrier MG'!H9","v":""}]
[null,37,{"$f":"'Calendrier BG'!C10","v":"SVI 3"},{"$f":"'Calendrier BG'!D10","v":"SVI 1"},null,null,{"$f":"'Calendrier BG'!G10","v":0},{"$f":"'Calendrier BG'!H10","v":2}]
["2021-11-24",2,{"$f":"'Calendrier BG'!C11","v":"SVI 3"},{"$f":"'Calendrier BG'!D11","v":"NDF 2 (F)"},"SVI T2","14h",{"$f":"'Calendrier BG'!G11","v":0},{"$f":"'Calendrier BG'!H11","v":2},null,null,"2021-11-24",8,{"$f":"'Calendrier MG'!C11","v":"SVI"},{"$f":"'Calendrier MG'!D11","v":"NDF 2 (F)"},"SVI T1","14h",{"$f":"'Calendrier MG'!G11","v":0},{"$f":"'Calendrier MG'!H11","v":2}]
[null,15,{"$f":"'Calendrier BG'!C12","v":"SVI 2"},{"$f":"'Calendrier BG'!D12","v":"NDF 1"},"SVI T2","14h30",{"$f":"'Calendrier BG'!G12","v":0},{"$f":"'Calendrier BG'!H12","v":2}]
[null,19,{"$f":"'Calendrier BG'!C13","v":"NDF 1"},{"$f":"'Calendrier BG'!D13","v":"SVI 1"},"SVI T1","15h",{"$f":"'Calendrier BG'!G13","v":1},{"$f":"'Calendrier BG'!H13","v":2},null,null,null,6,{"$f":"'Calendrier MG'!C13","v":"STMA 3 (F)"},{"$f":"'Calendrier MG'!D13","v":"JBS 1"},"JBS T2","14h",{"$f":"'Calendrier MG'!G13","v":0},{"$f":"'Calendrier MG'!H13","v":2}]
[null,38,{"$f":"'Calendrier BG'!C14","v":"NDF 2 (F)"},{"$f":"'Calendrier BG'!D14","v":"SVI 2"},"SVI T2","15h",{"$f":"'Calendrier BG'!G14","v":2},{"$f":"'Calendrier BG'!H14","v":0},null,null,null,9,{"$f":"'Calendrier MG'!C14","v":"JBS 1"},{"$f":"'Calendrier MG'!D14","v":"STMA 1"},null,"14h30",{"$f":"'Calendrier MG'!G14","v":1},{"$f":"'Calendrier MG'!H14","v":2}]
[null,10,{"$f":"'Calendrier BG'!C15","v":"STMA 3 (F)"},{"$f":"'Calendrier BG'!D15","v":"JBS 2 (F)"},"JBS T1","14h",{"$f":"'Calendrier BG'!G15","v":0},{"$f":"'Calendrier BG'!H15","v":2},null,null,null,16,{"$f":"'Calendrier MG'!C15","v":"STMA 3 (F)"},{"$f":"'Calendrier MG'!D15","v":"JBS 2"},null,"15h",{"$f":"'Calendrier MG'!G15","v":2},{"$f":"'Calendrier MG'!H15","v":1}]
[null,16,{"$f":"'Calendrier BG'!C16","v":"STMA 2"},{"$f":"'Calendrier BG'!D16","v":"JBS 2 (F)"},null,"14h30",{"$f":"'Calendrier BG'!G16","v":2},{"$f":"'Calendrier BG'!H16","v":1},null,null,null,22,{"$f":"'Calendrier MG'!C16","v":"STMA 2"},{"$f":"'Calendrier MG'!D16","v":"JBS 2"},null,"15h30",{"$f":"'Calendrier MG'!G16","v":0},{"$f":"'Calendrier MG'!H16","v":2}]
[null,17,{"$f":"'Calendrier BG'!C17","v":"STMA 1"},{"$f":"'Calendrier BG'!D17","v":"JBS 1"},null,"15h",{"$f":"'Calendrier BG'!G17","v":0},{"$f":"'Calendrier BG'!H17","v":2}]
[null,27,{"$f":"'Calendrier BG'!C18","v":"STMA 2"},{"$f":"'Calendrier BG'!D18","v":"JBS 1"},null,"15h30",{"$f":"'Calendrier BG'!G18","v":1},{"$f":"'Calendrier BG'!H18","v":2}]
["2021-12-01","ENTRAINEMENTS",null,null,null,null,null,null,null,null,"2021-12-01","ENTRAINEMENTS"]
[]
[]
[]
[]
[]
["2021-12-08",1,{"$f":"'Calendrier BG'!C25","v":"STMA 1"},{"$f":"'Calendrier BG'!D25","v":"SVI 1"},"STMA T1","14h",{"$f":"'Calendrier BG'!G25","v":2},{"$f":"'Calendrier BG'!H25","v":1},null,null,"2021-12-08",14,{"$f":"'Calendrier MG'!C25","v":"SVI"},{"$f":"'Calendrier MG'!D25","v":"STMA 1"},"STMA T2","14h",{"$f":"'Calendrier MG'!G25","v":0},{"$f":"'Calendrier MG'!H25","v":2}]
[null,18,{"$f":"'Calendrier BG'!C26","v":"SVI 3"},{"$f":"'Calendrier BG'!D26","v":"STMA 3 (F)"},null,"14h30",{"$f":"'Calendrier BG'!G26","v":2},{"$f":"'Calendrier BG'!H26","v":0},null,null,null,17,{"$f":"'Calendrier MG'!C26","v":"STMA 2"},{"$f":"'Calendrier MG'!D26","v":"SVI"},null,"14h30",{"$f":"'Calendrier MG'!G26","v":1},{"$f":"'Calendrier MG'!H26","v":2}]
[null,21,{"$f":"'Calendrier BG'!C27","v":"SVI 2"},{"$f":"'Calendrier BG'!D27","v":"STMA 2"},null,"15h",{"$f":"'Calendrier BG'!G27","v":0},{"$f":"'Calendrier BG'!H27","v":2},null,null,null,3,{"$f":"'Calendrier MG'!C27","v":"NDF 2 (F)"},{"$f":"'Calendrier MG'!D27","v":"JBS 1"},"JBS T2","14h",{"$f":"'Calendrier MG'!G27","v":1},{"$f":"'Calendrier MG'!H27","v":2}]
[null,20,{"$f":"'Calendrier BG'!C28","v":"JBS 2 (F)"},{"$f":"'Calendrier BG'!D28","v":"NDF 2 (F)"},"JBS T1","14h",{"$f":"'Calendrier BG'!G28","v":0},{"$f":"'Calendrier BG'!H28","v":2},null,null,null,7,{"$f":"'Calendrier MG'!C28","v":"NDF 1"},{"$f":"'Calendrier MG'!D28","v":"JBS 2"},null,"14h30",{"$f":"'Calendrier MG'!G28","v":2},{"$f":"'Calendrier MG'!H28","v":0}]
[null,9,{"$f":"'Calendrier BG'!C29","v":"JBS 1"},{"$f":"'Calendrier BG'!D29","v":"NDF 1"},null,"14h30",{"$f":"'Calendrier BG'!G29","v":2},{"$f":"'Calendrier BG'!H29","v":1}]
["2021-12-15","ENTRAINEMENTS",null,null,null,null,null,null,null,null,"2021-12-15","ENTRAINEMENTS"]
[]
[]
[]
[]
[]
["2021-01-05","ENTRAINEMENTS",null,null,null,null,null,null,null,null,"2021-01-05","ENTRAINEMENTS"]
[]
[]
[]
[]
[]
["2022-02-02","ENTRAINEMENTS",null,null,null,null,null,null,null,null,"2021-01-05","ENTRAINEMENTS"]
[]
[]
[]
[]
[]
["2022-02-09",3,{"$f":"'Calendrier BG'!C48","v":"JBS 1"},{"$f":"'Calendrier BG'!D48","v":"SVI 2"},"SVI T2","14h",{"$f":"'Calendrier BG'!G48","v":2},{"$f":"'Calendrier BG'!H48","v":0},null,null,"2022-02-09",4,{"$f":"'Calendrier MG'!C48","v":"JBS 2"},{"$f":"'Calendrier MG'!D48","v":"SVI"},"SVI T1","14h",{"$f":"'Calendrier MG'!G48","v":2},{"$f":"'Calendrier MG'!H48","v":0}]
[null,6,{"$f":"'Calendrier BG'!C49","v":"JBS 2 (F)"},{"$f":"'Calendrier BG'!D49","v":"SVI 3"},"SVI T2","14h30",{"$f":"'Calendrier BG'!G49","v":2},{"$f":"'Calendrier BG'!H49","v":0},null,null,null,21,{"$f":"'Calendrier MG'!C49","v":"JBS 1"},{"$f":"'Calendrier MG'!D49","v":"SVI"},"SVI T1","14h30",{"$f":"'Calendrier MG'!G49","v":2},{"$f":"'Calendrier MG'!H49","v":0}]
[null,5,{"$f":"'Calendrier BG'!C50","v":"NDF 1"},{"$f":"'Calendrier BG'!D50","v":"STMA 1"},"STMA T1","14h30",{"$f":"'Calendrier BG'!G50","v":2},{"$f":"'Calendrier BG'!H50","v":1},null,null,null,23,{"$f":"'Calendrier MG'!C50","v":"STMA 3 (F)"},{"$f":"'Calendrier MG'!D50","v":"NDF 1"},"STMA T1","15h",{"$f":"'Calendrier MG'!G50","v":0},{"$f":"'Calendrier MG'!H50","v":2}]
[null,8,{"$f":"'Calendrier BG'!C51","v":"NDF 2 (F)"},{"$f":"'Calendrier BG'!D51","v":"STMA 2"},"STMA T2","14h30",{"$f":"'Calendrier BG'!G51","v":2},{"$f":"'Calendrier BG'!H51","v":1},null,null,null,27,{"$f":"'Calendrier MG'!C51","v":"NDF 2 (F)"},{"$f":"'Calendrier MG'!D51","v":"STMA 2"},"STMA T2","15h",{"$f":"'Calendrier MG'!G51","v":2},{"$f":"'Calendrier MG'!H51","v":0}]
[null,34,{"$f":"'Calendrier BG'!C52","v":"STMA 1"},{"$f":"'Calendrier BG'!D52","v":"NDF 2 (F)"},"STMA T1","15h30",{"$f":"'Calendrier BG'!G52","v":2},{"$f":"'Calendrier BG'!H52","v":0}]
[null,35,{"$f":"'Calendrier BG'!C53","v":"NDF 1"},{"$f":"'Calendrier BG'!D53","v":"STMA 3 (F)"},"STMA T2","15h30",{"$f":"'Calendrier BG'!G53","v":2},{"$f":"'Calendrier BG'!H53","v":0}]
["2022-02-16","ENTRAINEMENTS",null,null,null,null,null,null,null,null,"2022-02-16","ENTRAINEMENTS"]
[]
[]
[]
[]
[]
["2022-03-09",11,{"$f":"'Calendrier BG'!C60","v":"SVI 2"},{"$f":"'Calendrier BG'!D60","v":"STMA 1"},{"$f":"'Calendrier BG'!E60","v":"STMA T3"},{"$f":"'Calendrier BG'!F60","v":"14h30"},{"$f":"'Calendrier BG'!G60","v":0},{"$f":"'Calendrier BG'!H60","v":2},null,null,"2022-03-09",2,{"$f":"'Calendrier MG'!C58","v":"STMA 1"},{"$f":"'Calendrier MG'!D58","v":"NDF 1"},{"$f":"'Calendrier MG'!E58","v":"STMA T1"},{"$f":"'Calendrier MG'!F58","v":"14h30"},{"$f":"'Calendrier MG'!G58","v":2},{"$f":"'Calendrier MG'!H58","v":0}]
[null,22,{"$f":"'Calendrier BG'!C61","v":"STMA 1"},{"$f":"'Calendrier BG'!D61","v":"SVI 3"},{"$f":"'Calendrier BG'!E61","v":"STMA T2"},{"$f":"'Calendrier BG'!F61","v":"15h"},{"$f":"'Calendrier BG'!G61","v":2},{"$f":"'Calendrier BG'!H61","v":0},null,null,null,20,{"$f":"'Calendrier MG'!C59","v":"STMA 3 (F)"},{"$f":"'Calendrier MG'!D59","v":"NDF 2 (F)"},{"$f":"'Calendrier MG'!E59","v":"STMA T2"},{"$f":"'Calendrier MG'!F59","v":"14h30"},{"$f":"'Calendrier MG'!G59","v":0},{"$f":"'Calendrier MG'!H59","v":2}]
[null,null,null,null,null,null,{"$f":"IFERROR(VLOOKUP($B62,'Cls BG'!$A$1:$G$48,4,FALSE),\"\")","v":""},{"$f":"IFERROR(VLOOKUP($B62,'Cls BG'!$A$1:$G$48,5,FALSE),\"\")","v":""},null,null,null,11,{"$f":"'Calendrier MG'!C60","v":"SVI"},{"$f":"'Calendrier MG'!D60","v":"STMA 3 (F)"},{"$f":"'Calendrier MG'!E60","v":"STMA T1"},{"$f":"'Calendrier MG'!F60","v":"15h"},{"$f":"'Calendrier MG'!G60","v":2},{"$f":"'Calendrier MG'!H60","v":0}]
[null,null,null,null,null,null,{"$f":"IFERROR(VLOOKUP($B63,'Cls BG'!$A$1:$G$48,4,FALSE),\"\")","v":""},{"$f":"IFERROR(VLOOKUP($B63,'Cls BG'!$A$1:$G$48,5,FALSE),\"\")","v":""},null,null,null,10,{"$f":"'Calendrier MG'!C61","v":"NDF 1"},{"$f":"'Calendrier MG'!D61","v":"STMA 2"},{"$f":"'Calendrier MG'!E61","v":"STMA T1"},{"$f":"'Calendrier MG'!F61","v":"15h30"},{"$f":"'Calendrier MG'!G61","v":2},{"$f":"'Calendrier MG'!H61","v":1}]
[null,null,null,null,null,null,{"$f":"IFERROR(VLOOKUP($B64,'Cls BG'!$A$1:$G$48,4,FALSE),\"\")","v":""},{"$f":"IFERROR(VLOOKUP($B64,'Cls BG'!$A$1:$G$48,5,FALSE),\"\")","v":""},null,null,null,24,{"$f":"'Calendrier MG'!C62","v":"STMA 1"},{"$f":"'Calendrier MG'!D62","v":"NDF 2 (F)"},null,null,{"$f":"'Calendrier MG'!G62","v":2},{"$f":"'Calendrier MG'!H62","v":0}]
["2022-03-16",41,{"$f":"'Calendrier BG'!C65","v":"SVI 1"},{"$f":"'Calendrier BG'!D65","v":"JBS 2 (F)"},{"$f":"'Calendrier BG'!E65","v":"JBS T1"},{"$f":"'Calendrier BG'!F65","v":"14h"},{"$f":"'Calendrier BG'!G65","v":2},{"$f":"'Calendrier BG'!H65","v":1},null,null,"2022-03-16",32,{"$f":"'Calendrier MG'!C63","v":"SVI"},{"$f":"'Calendrier MG'!D63","v":"JBS 2"},{"$f":"'Calendrier MG'!E63","v":"JBS T2"},{"$f":"'Calendrier MG'!F63","v":"14h"},{"$f":"'Calendrier MG'!G63","v":2},{"$f":"'Calendrier MG'!H63","v":1}]
[null,31,{"$f":"'Calendrier BG'!C66","v":"JBS 1"},{"$f":"'Calendrier BG'!D66","v":"SVI 3"},{"$f":"'Calendrier BG'!E66","v":"JBS T1"},{"$f":"'Calendrier BG'!F66","v":"14h30"},{"$f":"'Calendrier BG'!G66","v":2},{"$f":"'Calendrier BG'!H66","v":0},null,null,null,49,{"$f":"'Calendrier MG'!C64","v":"SVI"},{"$f":"'Calendrier MG'!D64","v":"JBS 1"},{"$f":"'Calendrier MG'!E64","v":"JBS T2"},{"$f":"'Calendrier MG'!F64","v":"14h30"},{"$f":"'Calendrier MG'!G64","v":0},{"$f":"'Calendrier MG'!H64","v":2}]
[null,32,{"$f":"'Calendrier BG'!C67","v":"SVI 2"},{"$f":"'Calendrier BG'!D67","v":"JBS 2 (F)"},{"$f":"'Calendrier BG'!E67","v":"JBS T1"},{"$f":"'Calendrier BG'!F67","v":"15h"},{"$f":"'Calendrier BG'!G67","v":1},{"$f":"'Calendrier BG'!H67","v":2},null,null,null,48,{"$f":"'Calendrier MG'!C65","v":"NDF 2 (F)"},{"$f":"'Calendrier MG'!D65","v":"STMA 3 (F)"},{"$f":"'Calendrier MG'!E65","v":"STMA T3"},{"$f":"'Calendrier MG'!F65","v":"14h30"},{"$f":"'Calendrier MG'!G65","v":2},{"$f":"'Calendrier MG'!H65","v":0}]
[null,13,{"$f":"'Calendrier BG'!C68","v":"SVI 1"},{"$f":"'Calendrier BG'!D68","v":"JBS 1"},{"$f":"'Calendrier BG'!E68","v":"JBS T2"},{"$f":"'Calendrier BG'!F68","v":"15h"},{"$f":"'Calendrier BG'!G68","v":0},{"$f":"'Calendrier BG'!H68","v":2},null,null,null,51,{"$f":"'Calendrier MG'!C66","v":"NDF 1"},{"$f":"'Calendrier MG'!D66","v":"STMA 3 (F)"},{"$f":"'Calendrier MG'!E66","v":"STMA T3"},{"$f":"'Calendrier MG'!F66","v":"15h"},{"$f":"'Calendrier MG'!G66","v":2},{"$f":"'Calendrier MG'!H66","v":1}]
[null,14,{"$f":"'Calendrier BG'!C69","v":"NDF 2 (F)"},{"$f":"'Calendrier BG'!D69","v":"STMA 3 (F)"},{"$f":"'Calendrier BG'!E69","v":"STMA T1"},{"$f":"'Calendrier BG'!F69","v":"14h30"},{"$f":"'Calendrier BG'!G69","v":2},{"$f":"'Calendrier BG'!H69","v":0},null,null,null,55,{"$f":"'Calendrier MG'!C67","v":"STMA 2"},{"$f":"'Calendrier MG'!D67","v":"NDF 2 (F)"},{"$f":"'Calendrier MG'!E67","v":"STMA T1"},{"$f":"'Calendrier MG'!F67","v":"15h"},{"$f":"'Calendrier MG'!G67","v":2},{"$f":"'Calendrier MG'!H67","v":1}]
[null,39,{"$f":"'Calendrier BG'!C70","v":"STMA 2"},{"$f":"'Calendrier BG'!D70","v":"NDF 1"},{"$f":"'Calendrier BG'!E70","v":"STMA T2"},{"$f":"'Calendrier BG'!F70","v":"14h30"},{"$f":"'Calendrier BG'!G70","v":0},{"$f":"'Calendrier BG'!H70","v":2},null,null,null,52,{"$f":"'Calendrier MG'!C68","v":"NDF 2 (F)"},{"$f":"'Calendrier MG'!D68","v":"STMA 1"},{"$f":"'Calendrier MG'!E68","v":"STMA T2"},{"$f":"'Calendrier MG'!F68","v":"15h30"},{"$f":"'Calendrier MG'!G68","v":0},{"$f":"'Calendrier MG'!H68","v":2}]
[null,null,null,null,null,null,null,null,null,null,null,38,{"$f":"'Calendrier MG'!C69","v":"STMA 2"},{"$f":"'Calendrier MG'!D69","v":"NDF 1"},{"$f":"'Calendrier MG'!E69","v":"STMA T1"},{"$f":"'Calendrier MG'!F69","v":"15h30"},{"$f":"'Calendrier MG'!G69","v":1},{"$f":"'Calendrier MG'!H69","v":2}]
["2022-03-23","ENTRAINEMENTS",null,null,null,null,null,null,null,null,"2022-03-23",45,{"$f":"'Calendrier MG'!C70","v":"SVI"},{"$f":"'Calendrier MG'!D70","v":"STMA 2"},{"$f":"'Calendrier MG'!E70","v":"SVI T1"},{"$f":"'Calendrier MG'!F70","v":"14h"},{"$f":"'Calendrier MG'!G70","v":2},{"$f":"'Calendrier MG'!H70","v":1}]
[null,null,null,null,null,null,null,null,null,null,null,30,{"$f":"'Calendrier MG'!C71","v":"NDF 1"},{"$f":"'Calendrier MG'!D71","v":"STMA 1"},{"$f":"'Calendrier MG'!E71","v":"SVI T2"},{"$f":"'Calendrier MG'!F71","v":"14h"},{"$f":"'Calendrier MG'!G71","v":0},{"$f":"'Calendrier MG'!H71","v":2}]
[null,null,null,null,null,null,null,null,null,null,null,54,{"$f":"'Calendrier MG'!C72","v":"SVI"},{"$f":"'Calendrier MG'!D72","v":"NDF 1"},{"$f":"'Calendrier MG'!E72","v":"SVI T1"},{"$f":"'Calendrier MG'!F72","v":"14h30"},{"$f":"'Calendrier MG'!G72","v":2},{"$f":"'Calendrier MG'!H72","v":0}]
[null,null,null,null,null,null,null,null,null,null,null,33,{"$f":"'Calendrier MG'!C73","v":"STMA 2"},{"$f":"'Calendrier MG'!D73","v":"STMA 1"},{"$f":"'Calendrier MG'!E73","v":"SVI T2"},{"$f":"'Calendrier MG'!F73","v":"14h30"},{"$f":"'Calendrier MG'!G73","v":0},{"$f":"'Calendrier MG'!H73","v":2}]
[null,null,null,null,null,null,null,null,null,null,null,42,{"$f":"'Calendrier MG'!C74","v":"STMA 1"},{"$f":"'Calendrier MG'!D74","v":"SVI"},{"$f":"'Calendrier MG'!E74","v":"SVI T1"},{"$f":"'Calendrier MG'!F74","v":"15h"},{"$f":"'Calendrier MG'!G74","v":2},{"$f":"'Calendrier MG'!H74","v":0}]
[]
["2022-03-30",23,{"$f":"'Calendrier BG'!C77","v":"JBS 1"},{"$f":"'Calendrier BG'!D77","v":"STMA 3 (F)"},{"$f":"'Calendrier BG'!E77","v":"STMA T1"},{"$f":"'Calendrier BG'!F77","v":"14h30"},{"$f":"'Calendrier BG'!G77","v":2},{"$f":"'Calendrier BG'!H77","v":0},null,null,"2022-03-30",12,{"$f":"'Calendrier MG'!C76","v":"JBS 2"},{"$f":"'Calendrier MG'!D76","v":"NDF 1"},{"$f":"'Calendrier MG'!E76","v":"STMA T3"},{"$f":"'Calendrier MG'!F76","v":"14h30"},{"$f":"'Calendrier MG'!G76","v":0},{"$f":"'Calendrier MG'!H76","v":2}]
[null,24,{"$f":"'Calendrier BG'!C78","v":"NDF 1"},{"$f":"'Calendrier BG'!D78","v":"JBS 2 (F)"},{"$f":"'Calendrier BG'!E78","v":"STMA T2"},{"$f":"'Calendrier BG'!F78","v":"14h30"},{"$f":"'Calendrier BG'!G78","v":2},{"$f":"'Calendrier BG'!H78","v":0},null,null,null,13,{"$f":"'Calendrier MG'!C77","v":"JBS 1"},{"$f":"'Calendrier MG'!D77","v":"STMA 2"},{"$f":"'Calendrier MG'!E77","v":"STMA T3"},{"$f":"'Calendrier MG'!F77","v":"15h"},{"$f":"'Calendrier MG'!G77","v":2},{"$f":"'Calendrier MG'!H77","v":0}]
[null,28,{"$f":"'Calendrier BG'!C79","v":"JBS 2 (F)"},{"$f":"'Calendrier BG'!D79","v":"STMA 1"},{"$f":"'Calendrier BG'!E79","v":"STMA T1"},{"$f":"'Calendrier BG'!F79","v":"15h"},{"$f":"'Calendrier BG'!G79","v":1},{"$f":"'Calendrier BG'!H79","v":2},null,null,null,18,{"$f":"'Calendrier MG'!C78","v":"NDF 1"},{"$f":"'Calendrier MG'!D78","v":"JBS 1"},{"$f":"'Calendrier MG'!E78","v":"STMA T3"},{"$f":"'Calendrier MG'!F78","v":"15h30"},{"$f":"'Calendrier MG'!G78","v":0},{"$f":"'Calendrier MG'!H78","v":2}]
[null,42,{"$f":"'Calendrier BG'!C80","v":"JBS 1"},{"$f":"'Calendrier BG'!D80","v":"NDF 2 (F)"},{"$f":"'Calendrier BG'!E80","v":"STMA T2"},{"$f":"'Calendrier BG'!F80","v":"15h"},{"$f":"'Calendrier BG'!G80","v":2},{"$f":"'Calendrier BG'!H80","v":0},null,null,null,19,{"$f":"'Calendrier MG'!C79","v":"JBS 2"},{"$f":"'Calendrier MG'!D79","v":"STMA 1"},{"$f":"'Calendrier MG'!E79","v":"STMA T1"},{"$f":"'Calendrier MG'!F79","v":"15h30"},{"$f":"'Calendrier MG'!G79","v":0},{"$f":"'Calendrier MG'!H79","v":2}]
[null,null,null,null,null,null,{"$f":"IFERROR(VLOOKUP($B82,'Cls BG'!$A$1:$G$48,4,FALSE),\"\")","v":""},{"$f":"IFERROR(VLOOKUP($B82,'Cls BG'!$A$1:$G$48,5,FALSE),\"\")","v":""}]
[null,null,null,null,null,null,{"$f":"IFERROR(VLOOKUP($B83,'Cls BG'!$A$1:$G$48,4,FALSE),\"\")","v":""},{"$f":"IFERROR(VLOOKUP($B83,'Cls BG'!$A$1:$G$48,5,FALSE),\"\")","v":""}]
["2022-04-06",29,{"$f":"'Calendrier BG'!C83","v":"STMA 3 (F)"},{"$f":"'Calendrier BG'!D83","v":"SVI 1"},{"$f":"'Calendrier BG'!E83","v":"SVI T1"},{"$f":"'Calendrier BG'!F83","v":"14h"},{"$f":"'Calendrier BG'!G83","v":0},{"$f":"'Calendrier BG'!H83","v":2},null,null,"2022-04-06","ENTRAINEMENTS"]
[null,12,{"$f":"'Calendrier BG'!C84","v":"STMA 2"},{"$f":"'Calendrier BG'!D84","v":"SVI 3"},{"$f":"'Calendrier BG'!E84","v":"SVI T2"},{"$f":"'Calendrier BG'!F84","v":"14h"},{"$f":"'Calendrier BG'!G84","v":2},{"$f":"'Calendrier BG'!H84","v":1}]
[null,43,{"$f":"'Calendrier BG'!C85","v":"NDF 1"},{"$f":"'Calendrier BG'!D85","v":"SVI 3"},{"$f":"'Calendrier BG'!E85","v":"SVI T1"},{"$f":"'Calendrier BG'!F85","v":"14h30"},{"$f":"'Calendrier BG'!G85","v":2},{"$f":"'Calendrier BG'!H85","v":0}]
[null,25,{"$f":"'Calendrier BG'!C86","v":"SVI 1"},{"$f":"'Calendrier BG'!D86","v":"NDF 2 (F)"},{"$f":"'Calendrier BG'!E86","v":"SVI T2"},{"$f":"'Calendrier BG'!F86","v":"14h30"},{"$f":"'Calendrier BG'!G86","v":2},{"$f":"'Calendrier BG'!H86","v":0}]
[null,44,{"$f":"'Calendrier BG'!C87","v":"SVI 2"},{"$f":"'Calendrier BG'!D87","v":"STMA 3 (F)"},{"$f":"'Calendrier BG'!E87","v":"SVI T1"},{"$f":"'Calendrier BG'!F87","v":"15h"},{"$f":"'Calendrier BG'!G87","v":2},{"$f":"'Calendrier BG'!H87","v":0}]
[null,33,{"$f":"'Calendrier BG'!C88","v":"SVI 1"},{"$f":"'Calendrier BG'!D88","v":"STMA 2"},{"$f":"'Calendrier BG'!E88","v":"SVI T2"},{"$f":"'Calendrier BG'!F88","v":"15h"},{"$f":"'Calendrier BG'!G88","v":2},{"$f":"'Calendrier BG'!H88","v":0}]
["2022-04-13","ENTRAINEMENTS",null,null,null,null,null,null,null,null,"2022-04-13",31,{"$f":"'Calendrier MG'!C86","v":"JBS 1"},{"$f":"'Calendrier MG'!D86","v":"NDF 2 (F)"},"JBS T1","14h",{"$f":"'Calendrier MG'!G86","v":2},{"$f":"'Calendrier MG'!H86","v":0}]
[null,null,null,null,null,null,null,null,null,null,null,47,{"$f":"'Calendrier MG'!C87","v":"STMA 1"},{"$f":"'Calendrier MG'!D87","v":"JBS 2"},"JBS T2","14h",{"$f":"'Calendrier MG'!G87","v":2},{"$f":"'Calendrier MG'!H87","v":0}]
[null,null,null,null,null,null,null,null,null,null,null,37,{"$f":"'Calendrier MG'!C88","v":"STMA 1"},{"$f":"'Calendrier MG'!D88","v":"JBS 1"},"JBS T1","14h30",{"$f":"'Calendrier MG'!G88","v":0},{"$f":"'Calendrier MG'!H88","v":2}]
[null,null,null,null,null,null,null,null,null,null,null,12,{"$f":"'Calendrier MG'!C89","v":"JBS 2"},{"$f":"'Calendrier MG'!D89","v":"NDF 2 (F)"},"JBS T2","14h30",{"$f":"'Calendrier MG'!G89","v":0},{"$f":"'Calendrier MG'!H89","v":2}]
[null,null,null,null,null,null,null,null,null,null,null,46,{"$f":"'Calendrier MG'!C90","v":"JBS 1"},{"$f":"'Calendrier MG'!D90","v":"NDF 1"},"JBS T1","15h",{"$f":"'Calendrier MG'!G90","v":2},{"$f":"'Calendrier MG'!H90","v":0}]
["2022-04-20","ENTRAINEMENTS",null,null,null,null,null,null,null,null,"2022-04-20",54,{"$f":"'Calendrier MG'!C91","v":"NDF 1"},{"$f":"'Calendrier MG'!D91","v":"SVI"},"STMA T1","14h30",{"$f":"IFERROR(VLOOKUP($B95,'Cls MG 1'!$A$1:$G$59,4,FALSE),\"\")","v":""},{"$f":"IFERROR(VLOOKUP($B95,'Cls MG 1'!$A$1:$G$59,5,FALSE),\"\")","v":""}]
[null,null,null,null,null,null,null,null,null,null,null,29,{"$f":"'Calendrier MG'!C92","v":"STMA 3 (F)"},{"$f":"'Calendrier MG'!D92","v":"STMA 2"},"STMA T2","14h30",{"$f":"IFERROR(VLOOKUP($B96,'Cls MG 1'!$A$1:$G$59,4,FALSE),\"\")","v":""},{"$f":"IFERROR(VLOOKUP($B96,'Cls MG 1'!$A$1:$G$59,5,FALSE),\"\")","v":""}]
[null,null,null,null,null,null,null,null,null,null,null,43,{"$f":"'Calendrier MG'!C93","v":"NDF 1"},{"$f":"'Calendrier MG'!D93","v":"NDF 2 (F)"},"STMA T1","15h",{"$f":"IFERROR(VLOOKUP($B97,'Cls MG 1'!$A$1:$G$59,4,FALSE),\"\")","v":""},{"$f":"IFERROR(VLOOKUP($B97,'Cls MG 1'!$A$1:$G$59,5,FALSE),\"\")","v":""}]
[null,null,null,null,null,null,null,null,null,null,null,39,{"$f":"'Calendrier MG'!C94","v":"STMA 3 (F)"},{"$f":"'Calendrier MG'!D94","v":"SVI"},"STMA T2","15h",{"$f":"IFERROR(VLOOKUP($B98,'Cls MG 1'!$A$1:$G$59,4,FALSE),\"\")","v":""},{"$f":"IFERROR(VLOOKUP($B98,'Cls MG 1'!$A$1:$G$59,5,FALSE),\"\")","v":""}]
[null,null,null,null,null,null,null,null,null,null,null,36,{"$f":"'Calendrier MG'!C95","v":"NDF 2 (F)"},{"$f":"'Calendrier MG'!D95","v":"SVI"},"STMA T1","15h30",{"$f":"IFERROR(VLOOKUP($B99,'Cls MG 1'!$A$1:$G$59,4,FALSE),\"\")","v":""},{"$f":"IFERROR(VLOOKUP($B99,'Cls MG 1'!$A$1:$G$59,5,FALSE),\"\")","v":""}]
["2022-05-11","ENTRAINEMENTS",null,null,null,null,null,null,null,null,"2022-05-11",34,{"$f":"'Calendrier MG'!C96","v":"JBS 1"},{"$f":"'Calendrier MG'!D96","v":"STMA 3 (F)"},"JBS T1","14h",{"$f":"IFERROR(VLOOKUP($B101,'Cls MG 1'!$A$1:$G$59,4,FALSE),\"\")","v":""},{"$f":"IFERROR(VLOOKUP($B101,'Cls MG 1'!$A$1:$G$59,5,FALSE),\"\")","v":""}]
[null,null,null,null,null,null,null,null,null,null,null,40,{"$f":"'Calendrier MG'!C97","v":"NDF 2 (F)"},{"$f":"'Calendrier MG'!D97","v":"JBS 2"},"JBS T2","14h",{"$f":"IFERROR(VLOOKUP($B102,'Cls MG 1'!$A$1:$G$59,4,FALSE),\"\")","v":""},{"$f":"IFERROR(VLOOKUP($B102,'Cls MG 1'!$A$1:$G$59,5,FALSE),\"\")","v":""}]
[null,null,null,null,null,null,null,null,null,null,null,41,{"$f":"'Calendrier MG'!C98","v":"STMA 2"},{"$f":"'Calendrier MG'!D98","v":"JBS 1"},"JBS T1","14h30",{"$f":"IFERROR(VLOOKUP($B103,'Cls MG 1'!$A$1:$G$59,4,FALSE),\"\")","v":""},{"$f":"IFERROR(VLOOKUP($B103,'Cls MG 1'!$A$1:$G$59,5,FALSE),\"\")","v":""}]
[null,null,null,null,null,null,null,null,null,null,null,44,{"$f":"'Calendrier MG'!C99","v":"JBS 2"},{"$f":"'Calendrier MG'!D99","v":"STMA 3 (F)"},"JBS T2","14h30",{"$f":"IFERROR(VLOOKUP($B104,'Cls MG 1'!$A$1:$G$59,4,FALSE),\"\")","v":""},{"$f":"IFERROR(VLOOKUP($B104,'Cls MG 1'!$A$1:$G$59,5,FALSE),\"\")","v":""}]
[null,null,null,null,null,null,null,null,null,null,null,50,{"$f":"'Calendrier MG'!C100","v":"JBS 2"},{"$f":"'Calendrier MG'!D100","v":"STMA 2"},"JBS T1","15h",{"$f":"IFERROR(VLOOKUP($B105,'Cls MG 1'!$A$1:$G$59,4,FALSE),\"\")","v":""},{"$f":"IFERROR(VLOOKUP($B105,'Cls MG 1'!$A$1:$G$59,5,FALSE),\"\")","v":""}]
["2022-05-18","TOURNOI BG à STMA"]
[]
[]
[]
[]
[null,null,null,null,null,null,null,null,null,null,"2022-06-01","TOURNOI MG à JBS"]

{"sheet":"Calendrier BG","index":1,"n_rows":89,"n_cols":15,"rows_kept":89,"cut":false,"hidden":false,"merged":[[88,0,92,0],[88,1,92,8],[41,0,46,0],[41,1,46,8],[64,0,69,0],[47,0,52,0],[59,0,63,0],[53,0,58,0],[70,0,75,0],[76,0,81,0],[70,1,75,8],[82,0,87,0],[53,1,58,8],[2,0,9,0],[0,10,0,14],[1,10,1,11],[2,10,2,11],[0,1,0,8],[14,13,14,14],[1,6,1,7],[2,4,4,4],[7,4,9,4],[14,4,17,4],[10,0,17,0],[18,1,23,8],[35,0,40,0],[35,1,40,8],[18,0,23,0],[24,0,28,0],[29,0,34,0],[29,1,34,8],[24,4,26,4],[27,4,28,4]]}
[null," CALENDRIER BENJAMINS ",null,null,null,null,null,null,null,null,"POULES ET MATCHS BENJAMINS"]
["Date","Match","Equipe A","Equipe B","Lieux","Horaires","Résultats",null,"Indisponibilités",null,"DIVISION 1"]
["2021-11-17",4,{"$f":"VLOOKUP($B3,$K$15:$O$60,4)","v":"STMA 3 (F)"},{"$f":"VLOOKUP($B3,$K$15:$O$60,5)","v":"STMA 2"},"STMA",null,{"$f":"IFERROR(VLOOKUP($B3,'Cls BG'!$A$1:$G$48,4,FALSE),\"\")","v":0},{"$f":"IFERROR(VLOOKUP($B3,'Cls BG'!$A$1:$G$48,5,FALSE),\"\")","v":2},null,null,"Etablissements"]
[null,40,"STMA 3 (F)","STMA 1",null,null,{"$f":"IFERROR(VLOOKUP($B4,'Cls BG'!$A$1:$G$48,4,FALSE),\"\")","v":0},{"$f":"IFERROR(VLOOKUP($B4,'Cls BG'!$A$1:$G$48,5,FALSE),\"\")","v":2},null,null,1,"STMA 1"]
[null,45,"STMA 1","STMA 2",null,null,{"$f":"IFERROR(VLOOKUP($B5,'Cls BG'!$A$1:$G$48,4,FALSE),\"\")","v":2},{"$f":"IFERROR(VLOOKUP($B5,'Cls BG'!$A$1:$G$48,5,FALSE),\"\")","v":0},null,null,2,"JBS 1"]
[null,36,"JBS 2 (F)","JBS 1","JBS",null,{"$f":"IFERROR(VLOOKUP($B6,'Cls BG'!$A$1:$G$48,4,FALSE),\"\")","v":0},{"$f":"IFERROR(VLOOKUP($B6,'Cls BG'!$A$1:$G$48,5,FALSE),\"\")","v":2},null,null,3,"NDF 1"]
[null,30,"NDF 2 (F)","NDF 1","NDF",null,{"$f":"IFERROR(VLOOKUP($B7,'Cls BG'!$A$1:$G$48,4,FALSE),\"\")","v":0},{"$f":"IFERROR(VLOOKUP($B7,'Cls BG'!$A$1:$G$48,5,FALSE),\"\")","v":2},null,null,4,"SVI 1"]
[null,7,"SVI 1","SVI 2","SVI",null,{"$f":"IFERROR(VLOOKUP($B8,'Cls BG'!$A$1:$G$48,4,FALSE),\"\")","v":2},{"$f":"IFERROR(VLOOKUP($B8,'Cls BG'!$A$1:$G$48,5,FALSE),\"\")","v":0},null,null,5,"SVI 2"]
[null,26,"SVI 3","SVI 2",null,null,{"$f":"IFERROR(VLOOKUP($B9,'Cls BG'!$A$1:$G$48,4,FALSE),\"\")","v":1},{"$f":"IFERROR(VLOOKUP($B9,'Cls BG'!$A$1:$G$48,5,FALSE),\"\")","v":2},null,null,6,"SVI 3"]
[null,37,"SVI 3","SVI 1",null,null,{"$f":"IFERROR(VLOOKUP($B10,'Cls BG'!$A$1:$G$48,4,FALSE),\"\")","v":0},{"$f":"IFERROR(VLOOKUP($B10,'Cls BG'!$A$1:$G$48,5,FALSE),\"\")","v":2},null,null,7,"STMA 3 (F)"]
["2021-11-24",2,"SVI 3","NDF 2 (F)","SVI T2","14h",{"$f":"IFERROR(VLOOKUP($B11,'Cls BG'!$A$1:$G$48,4,FALSE),\"\")","v":0},{"$f":"IFERROR(VLOOKUP($B11,'Cls BG'!$A$1:$G$48,5,FALSE),\"\")","v":2},null,null,8,"JBS 2 (F)"]
[null,15,"SVI 2","NDF 1","SVI T2","14h30",{"$f":"IFERROR(VLOOKUP($B12,'Cls BG'!$A$1:$G$48,4,FALSE),\"\")","v":0},{"$f":"IFERROR(VLOOKUP($B12,'Cls BG'!$A$1:$G$48,5,FALSE),\"\")","v":2},null,null,9,"NDF 2 (F)"]
[null,19,"NDF 1","SVI 1","SVI T1","15h",{"$f":"IFERROR(VLOOKUP($B13,'Cls BG'!$A$1:$G$48,4,FALSE),\"\")","v":1},{"$f":"IFERROR(VLOOKUP($B13,'Cls BG'!$A$1:$G$48,5,FALSE),\"\")","v":2},null,null,10,"STMA 2"]
[null,38,"NDF 2 (F)","SVI 2","SVI T2","15h",{"$f":"IFERROR(VLOOKUP($B14,'Cls BG'!$A$1:$G$48,4,FALSE),\"\")","v":2},{"$f":"IFERROR(VLOOKUP($B14,'Cls BG'!$A$1:$G$48,5,FALSE),\"\")","v":0}]
[null,10,"STMA 3 (F)","JBS 2 (F)","JBS T1","14h",{"$f":"IFERROR(VLOOKUP($B15,'Cls BG'!$A$1:$G$48,4,FALSE),\"\")","v":0},{"$f":"IFERROR(VLOOKUP($B15,'Cls BG'!$A$1:$G$48,5,FALSE),\"\")","v":2},null,null,"N° Match","Equipe A","Equipe B","Match"]
[null,16,"STMA 2","JBS 2 (F)",null,"14h30",{"$f":"IFERROR(VLOOKUP($B16,'Cls BG'!$A$1:$G$48,4,FALSE),\"\")","v":2},{"$f":"IFERROR(VLOOKUP($B16,'Cls BG'!$A$1:$G$48,5,FALSE),\"\")","v":1},null,null,1,1,4,{"$f":"VLOOKUP(L16,$K$2:$L$13,2)","v":"STMA 1"},{"$f":"VLOOKUP(M16,$K$2:$L$13,2)","v":"SVI 1"}]
[null,17,"STMA 1","JBS 1",null,"15h",{"$f":"IFERROR(VLOOKUP($B17,'Cls BG'!$A$1:$G$48,4,FALSE),\"\")","v":0},{"$f":"IFERROR(VLOOKUP($B17,'Cls BG'!$A$1:$G$48,5,FALSE),\"\")","v":2},null,null,2,6,9,{"$f":"VLOOKUP(L17,$K$2:$L$13,2)","v":"SVI 3"},{"$f":"VLOOKUP(M17,$K$2:$L$13,2)","v":"NDF 2 (F)"}]
[null,27,"STMA 2","JBS 1",null,"15h30",{"$f":"IFERROR(VLOOKUP($B18,'Cls BG'!$A$1:$G$48,4,FALSE),\"\")","v":1},{"$f":"IFERROR(VLOOKUP($B18,'Cls BG'!$A$1:$G$48,5,FALSE),\"\")","v":2},null,null,3,2,5,"JBS 1","SVI 2"]
["2021-12-01","ENTRAINEMENTS",null,null,null,null,null,null,null,null,4,7,10,"STMA 3 (F)","STMA 2"]
[null,null,null,null,null,null,null,null,null,null,5,3,1,"NDF 1","STMA 1"]
[null,null,null,null,null,null,null,null,null,null,6,8,6,"JBS 2 (F)","SVI 3"]
[null,null,null,null,null,null,null,null,null,null,7,4,5,"SVI 1","SVI 2"]
[null,null,null,null,null,null,null,null,null,null,8,9,10,"NDF 2 (F)","STMA 2"]
[null,null,null,null,null,null,null,null,null,null,9,2,3,"JBS 1","NDF 1"]
["2021-12-08",1,{"$f":"VLOOKUP($B25,$K$15:$O$60,4)","v":"STMA 1"},{"$f":"VLOOKUP($B25,$K$15:$O$60,5)","v":"SVI 1"},"STMA T1","14h",{"$f":"IFERROR(VLOOKUP($B25,'Cls BG'!$A$1:$G$39,4,FALSE),\"\")","v":2},{"$f":"IFERROR(VLOOKUP($B25,'Cls BG'!$A$1:$G$39,5,FALSE),\"\")","v":1},null,null,10,7,8,"STMA 3 (F)","JBS 2 (F)"]
[null,18,{"$f":"VLOOKUP($B26,$K$15:$O$60,4)","v":"SVI 3"},{"$f":"VLOOKUP($B26,$K$15:$O$60,5)","v":"STMA 3 (F)"},null,"14h30",{"$f":"IFERROR(VLOOKUP($B26,'Cls BG'!$A$1:$G$39,4,FALSE),\"\")","v":2},{"$f":"IFERROR(VLOOKUP($B26,'Cls BG'!$A$1:$G$39,5,FALSE),\"\")","v":0},null,null,11,5,1,"SVI 2","STMA 1"]
[null,21,{"$f":"VLOOKUP($B27,$K$15:$O$60,4)","v":"SVI 2"},{"$f":"VLOOKUP($B27,$K$15:$O$60,5)","v":"STMA 2"},null,"15h",{"$f":"IFERROR(VLOOKUP($B27,'Cls BG'!$A$3:$G$33,4,FALSE),\"\")","v":0},{"$f":"IFERROR(VLOOKUP($B27,'Cls BG'!$A$3:$G$33,5,FALSE),\"\")","v":2},null,null,12,10,6,"STMA 2","SVI 3"]
[null,20,{"$f":"VLOOKUP($B28,$K$15:$O$60,4)","v":"JBS 2 (F)"},{"$f":"VLOOKUP($B28,$K$15:$O$60,5)","v":"NDF 2 (F)"},"JBS T1","14h",{"$f":"IFERROR(VLOOKUP($B28,'Cls BG'!$A$1:$G$39,4,FALSE),\"\")","v":0},{"$f":"IFERROR(VLOOKUP($B28,'Cls BG'!$A$1:$G$39,5,FALSE),\"\")","v":2},null,null,13,4,2,"SVI 1","JBS 1"]
[null,9,{"$f":"VLOOKUP($B29,$K$15:$O$60,4)","v":"JBS 1"},{"$f":"VLOOKUP($B29,$K$15:$O$60,5)","v":"NDF 1"},null,"14h30",{"$f":"IFERROR(VLOOKUP($B29,'Cls BG'!$A$1:$G$39,4,FALSE),\"\")","v":2},{"$f":"IFERROR(VLOOKUP($B29,'Cls BG'!$A$1:$G$39,5,FALSE),\"\")","v":1},null,null,14,9,7,"NDF 2 (F)","STMA 3 (F)"]
["2021-12-15","ENTRAINEMENTS",null,null,null,null,null,null,null,null,15,5,3,"SVI 2","NDF 1"]
[null,null,null,null,null,null,null,null,null,null,16,10,8,"STMA 2","JBS 2 (F)"]
[null,null,null,null,null,null,null,null,null,null,17,1,2,"STMA 1","JBS 1"]
[null,null,null,null,null,null,null,null,null,null,18,6,7,"SVI 3","STMA 3 (F)"]
[null,null,null,null,null,null,null,null,null,null,19,3,4,"NDF 1","SVI 1"]
[null,null,null,null,null,null,null,null,null,null,20,8,9,"JBS 2 (F)","NDF 2 (F)"]
["2021-01-05","ENTRAINEMENTS",null,null,null,null,null,null,null,null,21,5,10,"SVI 2","STMA 2"]
[null,null,null,null,null,null,null,null,null,null,22,1,6,"STMA 1","SVI 3"]
[null,null,null,null,null,null,null,null,null,null,23,2,7,"JBS 1","STMA 3 (F)"]
[null,null,null,null,null,null,null,null,null,null,24,3,8,"NDF 1","JBS 2 (F)"]
[null,null,null,null,null,null,null,null,null,null,25,4,9,"SVI 1","NDF 2 (F)"]
[null,null,null,null,null,null,null,null,null,null,26,6,5,"SVI 3","SVI 2"]
["2022-02-02","ENTRAINEMENTS",null,null,null,null,null,null,null,null,27,10,2,"STMA 2","JBS 1"]
[null,null,null,null,null,null,null,null,null,null,28,8,1,"JBS 2 (F)","STMA 1"]
[null,null,null,null,null,null,null,null,null,null,29,7,4,"STMA 3 (F)","SVI 1"]
[null,null,null,null,null,null,null,null,null,null,30,9,3,"NDF 2 (F)","NDF 1"]
[null,null,null,null,null,null,null,null,null,null,31,2,6,"JBS 1","SVI 3"]
[null,null,null,null,null,null,null,null,null,null,32,5,8,"SVI 2","JBS 2 (F)"]
["2022-02-09",3,{"$f":"VLOOKUP($B48,$K$15:$O$60,4)","v":"JBS 1"},{"$f":"VLOOKUP($B48,$K$15:$O$60,5)","v":"SVI 2"},"SVI T2","14h",{"$f":"IFERROR(VLOOKUP($B48,'Cls BG'!$A$1:$G$48,4,FALSE),\"\")","v":2},{"$f":"IFERROR(VLOOKUP($B48,'Cls BG'!$A$1:$G$48,5,FALSE),\"\")","v":0},null,null,33,4,10,"SVI 1","STMA 2"]
[null,6,"JBS 2 (F)","SVI 3","SVI T2","14h30",{"$f":"IFERROR(VLOOKUP($B49,'Cls BG'!$A$1:$G$48,4,FALSE),\"\")","v":2},{"$f":"IFERROR(VLOOKUP($B49,'Cls BG'!$A$1:$G$48,5,FALSE),\"\")","v":0},null,null,34,1,9,"STMA 1","NDF 2 (F)"]
[null,5,"NDF 1","STMA 1","STMA T1","14h",{"$f":"IFERROR(VLOOKUP($B50,'Cls BG'!$A$1:$G$48,4,FALSE),\"\")","v":2},{"$f":"IFERROR(VLOOKUP($B50,'Cls BG'!$A$1:$G$48,5,FALSE),\"\")","v":1},null,null,35,3,7,"NDF 1","STMA 3 (F)"]
[null,8,"NDF 2 (F)","STMA 2","STMA T2","14h",{"$f":"IFERROR(VLOOKUP($B51,'Cls BG'!$A$1:$G$48,4,FALSE),\"\")","v":2},{"$f":"IFERROR(VLOOKUP($B51,'Cls BG'!$A$1:$G$48,5,FALSE),\"\")","v":1},null,null,36,8,2,"JBS 2 (F)","JBS 1"]
[null,34,"STMA 1","NDF 2 (F)","STMA T1","15h",{"$f":"IFERROR(VLOOKUP($B52,'Cls BG'!$A$1:$G$48,4,FALSE),\"\")","v":2},{"$f":"IFERROR(VLOOKUP($B52,'Cls BG'!$A$1:$G$48,5,FALSE),\"\")","v":0},null,null,37,6,4,"SVI 3","SVI 1"]
[null,35,"NDF 1","STMA 3 (F)","STMA T2","15h",{"$f":"IFERROR(VLOOKUP($B53,'Cls BG'!$A$1:$G$48,4,FALSE),\"\")","v":2},{"$f":"IFERROR(VLOOKUP($B53,'Cls BG'!$A$1:$G$48,5,FALSE),\"\")","v":0},null,null,38,9,5,"NDF 2 (F)","SVI 2"]
["2022-02-16","ENTRAINEMENTS",null,null,null,null,null,null,null,null,39,10,3,"STMA 2","NDF 1"]
[null,null,null,null,null,null,null,null,null,null,40,7,1,"STMA 3 (F)","STMA 1"]
[null,null,null,null,null,null,null,null,null,null,41,4,8,"SVI 1","JBS 2 (F)"]
[null,null,null,null,null,null,null,null,null,null,42,2,9,"JBS 1","NDF 2 (F)"]
[null,null,null,null,null,null,null,null,null,null,43,3,6,"NDF 1","SVI 3"]
[null,null,null,null,null,null,null,null,null,null,44,5,7,"SVI 2","STMA 3 (F)"]
["2022-03-09",11,{"$f":"VLOOKUP($B60,$K$15:$O$60,4)","v":"SVI 2"},{"$f":"VLOOKUP($B60,$K$15:$O$60,5)","v":"STMA 1"},"STMA T3","14h30",{"$f":"IFERROR(VLOOKUP($B60,'Cls BG'!$A$1:$G$48,4,FALSE),\"\")","v":0},{"$f":"IFERROR(VLOOKUP($B60,'Cls BG'!$A$1:$G$48,5,FALSE),\"\")","v":2},null,null,45,1,10,"STMA 1","STMA 2"]
[null,22,"STMA 1","SVI 3","STMA T2","15h",{"$f":"IFERROR(VLOOKUP($B61,'Cls BG'!$A$1:$G$48,4,FALSE),\"\")","v":2},{"$f":"IFERROR(VLOOKUP($B61,'Cls BG'!$A$1:$G$48,5,FALSE),\"\")","v":0}]
[null,null,null,null,null,null,{"$f":"IFERROR(VLOOKUP($B62,'Cls BG'!$A$1:$G$48,4,FALSE),\"\")","v":""},{"$f":"IFERROR(VLOOKUP($B62,'Cls BG'!$A$1:$G$48,5,FALSE),\"\")","v":""}]
[null,null,null,null,null,null,{"$f":"IFERROR(VLOOKUP($B63,'Cls BG'!$A$1:$G$48,4,FALSE),\"\")","v":""},{"$f":"IFERROR(VLOOKUP($B63,'Cls BG'!$A$1:$G$48,5,FALSE),\"\")","v":""}]
[null,null,null,null,null,null,{"$f":"IFERROR(VLOOKUP($B64,'Cls BG'!$A$1:$G$48,4,FALSE),\"\")","v":""},{"$f":"IFERROR(VLOOKUP($B64,'Cls BG'!$A$1:$G$48,5,FALSE),\"\")","v":""}]
["2022-03-16",41,"SVI 1","JBS 2 (F)","JBS T1","14h",{"$f":"IFERROR(VLOOKUP($B65,'Cls BG'!$A$1:$G$48,4,FALSE),\"\")","v":2},{"$f":"IFERROR(VLOOKUP($B65,'Cls BG'!$A$1:$G$48,5,FALSE),\"\")","v":1}]
[null,31,"JBS 1","SVI 3","JBS T1","14h30",{"$f":"IFERROR(VLOOKUP($B66,'Cls BG'!$A$1:$G$48,4,FALSE),\"\")","v":2},{"$f":"IFERROR(VLOOKUP($B66,'Cls BG'!$A$1:$G$48,5,FALSE),\"\")","v":0}]
[null,32,"SVI 2","JBS 2 (F)","JBS T1","15h",{"$f":"IFERROR(VLOOKUP($B67,'Cls BG'!$A$1:$G$48,4,FALSE),\"\")","v":1},{"$f":"IFERROR(VLOOKUP($B67,'Cls BG'!$A$1:$G$48,5,FALSE),\"\")","v":2}]
[null,13,"SVI 1","JBS 1","JBS T2","15h",{"$f":"IFERROR(VLOOKUP($B68,'Cls BG'!$A$1:$G$48,4,FALSE),\"\")","v":0},{"$f":"IFERROR(VLOOKUP($B68,'Cls BG'!$A$1:$G$48,5,FALSE),\"\")","v":2}]
[null,14,"NDF 2 (F)","STMA 3 (F)","STMA T1","14h30",{"$f":"IFERROR(VLOOKUP($B69,'Cls BG'!$A$1:$G$48,4,FALSE),\"\")","v":2},{"$f":"IFERROR(VLOOKUP($B69,'Cls BG'!$A$1:$G$48,5,FALSE),\"\")","v":0}]
[null,39,"STMA 2","NDF 1","STMA T2","14h30",{"$f":"IFERROR(VLOOKUP($B70,'Cls BG'!$A$1:$G$48,4,FALSE),\"\")","v":0},{"$f":"IFERROR(VLOOKUP($B70,'Cls BG'!$A$1:$G$48,5,FALSE),\"\")","v":2}]
["2022-03-23","ENTRAINEMENTS"]
[]
[]
[]
[]
[]
["2022-03-30",23,"JBS 1","STMA 3 (F)","STMA T1","14h30",{"$f":"IFERROR(VLOOKUP($B77,'Cls BG'!$A$1:$G$48,4,FALSE),\"\")","v":2},{"$f":"IFERROR(VLOOKUP($B77,'Cls BG'!$A$1:$G$48,5,FALSE),\"\")","v":0}]
[null,24,"NDF 1","JBS 2 (F)","STMA T2","14h30",{"$f":"IFERROR(VLOOKUP($B78,'Cls BG'!$A$1:$G$48,4,FALSE),\"\")","v":2},{"$f":"IFERROR(VLOOKUP($B78,'Cls BG'!$A$1:$G$48,5,FALSE),\"\")","v":0}]
[null,28,"JBS 2 (F)","STMA 1","STMA T1","15h",{"$f":"IFERROR(VLOOKUP($B79,'Cls BG'!$A$1:$G$48,4,FALSE),\"\")","v":1},{"$f":"IFERROR(VLOOKUP($B79,'Cls BG'!$A$1:$G$48,5,FALSE),\"\")","v":2}]
[null,42,"JBS 1","NDF 2 (F)","STMA T2","15h",{"$f":"IFERROR(VLOOKUP($B80,'Cls BG'!$A$1:$G$48,4,FALSE),\"\")","v":2},{"$f":"IFERROR(VLOOKUP($B80,'Cls BG'!$A$1:$G$48,5,FALSE),\"\")","v":0}]
[null,null,null,null,null,null,{"$f":"IFERROR(VLOOKUP($B81,'Cls BG'!$A$1:$G$48,4,FALSE),\"\")","v":""},{"$f":"IFERROR(VLOOKUP($B81,'Cls BG'!$A$1:$G$48,5,FALSE),\"\")","v":""}]
[null,null,null,null,null,null,{"$f":"IFERROR(VLOOKUP($B82,'Cls BG'!$A$1:$G$48,4,FALSE),\"\")","v":""},{"$f":"IFERROR(VLOOKUP($B82,'Cls BG'!$A$1:$G$48,5,FALSE),\"\")","v":""}]
["2022-04-06",29,"STMA 3 (F)","SVI 1","SVI T1","14h",{"$f":"IFERROR(VLOOKUP($B83,'Cls BG'!$A$1:$G$48,4,FALSE),\"\")","v":0},{"$f":"IFERROR(VLOOKUP($B83,'Cls BG'!$A$1:$G$48,5,FALSE),\"\")","v":2}]
[null,12,"STMA 2","SVI 3","SVI T2","14h",{"$f":"IFERROR(VLOOKUP($B84,'Cls BG'!$A$1:$G$48,4,FALSE),\"\")","v":2},{"$f":"IFERROR(VLOOKUP($B84,'Cls BG'!$A$1:$G$48,5,FALSE),\"\")","v":1}]
[null,43,"NDF 1","SVI 3","SVI T1","14h30",{"$f":"IFERROR(VLOOKUP($B85,'Cls BG'!$A$1:$G$48,4,FALSE),\"\")","v":2},{"$f":"IFERROR(VLOOKUP($B85,'Cls BG'!$A$1:$G$48,5,FALSE),\"\")","v":0}]
[null,25,"SVI 1","NDF 2 (F)","SVI T2","14h30",{"$f":"IFERROR(VLOOKUP($B86,'Cls BG'!$A$1:$G$48,4,FALSE),\"\")","v":2},{"$f":"IFERROR(VLOOKUP($B86,'Cls BG'!$A$1:$G$48,5,FALSE),\"\")","v":0}]
[null,44,"SVI 2","STMA 3 (F)","SVI T1","15h",{"$f":"IFERROR(VLOOKUP($B87,'Cls BG'!$A$1:$G$48,4,FALSE),\"\")","v":2},{"$f":"IFERROR(VLOOKUP($B87,'Cls BG'!$A$1:$G$48,5,FALSE),\"\")","v":0}]
[null,33,"SVI 1","STMA 2","SVI T2","15h",{"$f":"IFERROR(VLOOKUP($B88,'Cls BG'!$A$1:$G$48,4,FALSE),\"\")","v":2},{"$f":"IFERROR(VLOOKUP($B88,'Cls BG'!$A$1:$G$48,5,FALSE),\"\")","v":0}]
["2022-04-13","ENTRAINEMENTS"]

{"sheet":"Cls BG","index":2,"n_rows":48,"n_cols":19,"rows_kept":48,"cut":false,"hidden":false,"merged":[[2,3,2,4],[0,0,1,6]]}
["BENJAMINS DIVISION 1"]
[]
["N° Match","Equipe A","Equipe B","Scores",null,"Vainqueur","Perdant",null,null,"SIGLE","Etablissement","Matchs joués","Victoires","Défaites","Sets Pour","Sets Contre","Différence","Points"]
[1,{"$f":"'Calendrier BG'!N16","v":"STMA 1"},{"$f":"'Calendrier BG'!O16","v":"SVI 1"},2,1,{"$f":"IF(D4<>\"\",IF(D4>E4,B4,IF(D4<E4,C4,\"nul\")),\"\")","v":"STMA 1"},{"$f":"IF(E4<>\"\",IF(E4<D4,C4,IF(E4>D4,B4,\"nul\")),\"\")","v":"SVI 1"},null,{"$f":"RANK(S4,$S$4:$S$13)","v":3},"STMA 1","Sainte Thérèse Maison Alfort 1",{"$f":"COUNT(D4,D8,D14,D20,D25,D31,D37,D43,D48)","v":9},{"$f":"COUNTIF($F$3:$F$48,J4)","v":7},{"$f":"COUNTIF($G$3:$G$48,J4)","v":2},{"$f":"SUM(D4,E8,E14,D20,D25,E31,D37,E43,D48)","v":15},{"$f":"SUM(E4,D8,D14,E20,E25,D31,E37,D43,E48)","v":6},{"$f":"O4-P4","v":9},{"$f":"M4*3+N4*1","v":23},{"$f":"SUM(R4*1000000+Q4*10000+O4*100+L4*10)","v":23091590}]
[2,{"$f":"'Calendrier BG'!N17","v":"SVI 3"},{"$f":"'Calendrier BG'!O17","v":"NDF 2 (F)"},0,2,{"$f":"IF(D5<>\"\",IF(D5>E5,B5,IF(D5<E5,C5,\"nul\")),\"\")","v":"NDF 2 (F)"},{"$f":"IF(E5<>\"\",IF(E5<D5,C5,IF(E5>D5,B5,\"nul\")),\"\")","v":"SVI 3"},null,{"$f":"RANK(S5,$S$4:$S$13)","v":1},"JBS 1","Jean Baptiste de la Salle 1",{"$f":"COUNT(D6,D12,D16,D20,D26,D30,D34,D39,D45)","v":9},{"$f":"COUNTIF($F$3:$F$48,J5)","v":9},{"$f":"COUNTIF($G$3:$G$48,J5)","v":0},{"$f":"SUM(D6,D12,E16,E20,D26,E30,D34,E39,D45)","v":18},{"$f":"SUM(E6,E12,D16,D20,E26,D30,E34,D39,E45)","v":2},{"$f":"O5-P5","v":16},{"$f":"M5*3+N5*1","v":27},27161890]
[3,{"$f":"'Calendrier BG'!N18","v":"JBS 1"},{"$f":"'Calendrier BG'!O18","v":"SVI 2"},2,0,"JBS 1","SVI 2",null,2,"NDF 1","Notre Dame de France 1",{"$f":"COUNT(D8,D12,D18,D22,D27,D33,D38,D42,D46)","v":9},7,2,{"$f":"SUM(D8,E12,E18,D22,D27,E33,D38,E42,D46)","v":16},{"$f":"SUM(E8,D12,D18,E22,E27,D33,E38,D42,E46)","v":5},{"$f":"O6-P6","v":11},23,23111690]
[4,{"$f":"'Calendrier BG'!N19","v":"STMA 3 (F)"},{"$f":"'Calendrier BG'!O19","v":"STMA 2"},0,2,"STMA 2","STMA 3 (F)",null,3,"SVI 1","Saint Vincent 1",{"$f":"COUNT(D4,D10,D16,D22,D28,D32,D36,D40,D44)","v":9},7,2,{"$f":"SUM(E4,D10,D16,E22,D28,E32,D36,E40,D44)","v":15},{"$f":"SUM(D4,E10,E16,D22,E28,D32,E36,D40,E44)","v":6},9,23,23091590]
[5,{"$f":"'Calendrier BG'!N20","v":"NDF 1"},{"$f":"'Calendrier BG'!O20","v":"STMA 1"},2,1,"NDF 1","STMA 1",null,8,"SVI 2","Saint Vincent 2",{"$f":"COUNT(D6,D10,D14,D18,D24,D29,D35,D41,D47)","v":9},2,7,{"$f":"SUM(E6,E10,D14,D18,D24,E29,D35,E41,D47)","v":5},{"$f":"SUM(D6,D10,E14,E18,E24,D29,E35,D41,E47)","v":15},-10,13,12900590]
[6,{"$f":"'Calendrier BG'!N21","v":"JBS 2 (F)"},{"$f":"'Calendrier BG'!O21","v":"SVI 3"},2,0,"JBS 2 (F)","SVI 3",null,9,"SVI 3","Saint Vincent 3",{"$f":"COUNT(D5,D9,D15,D21,D25,D29,D34,D40,D46)","v":9},1,8,{"$f":"SUM(D5,E9,E15,D21,E25,D29,E34,D40,E46)","v":4},{"$f":"SUM(E5,D9,E15,E21,D25,E29,D34,E40,D46)","v":15},-11,11,10890490]
[7,{"$f":"'Calendrier BG'!N22","v":"SVI 1"},{"$f":"'Calendrier BG'!O22","v":"SVI 2"},2,0,"SVI 1","SVI 2",null,10,"STMA 3 (F)","Sainte Thérèse Maison Alfort 3",{"$f":"COUNT(D7,D13,D17,D21,D26,D32,D38,D43,D47)","v":9},0,9,{"$f":"SUM(D7,D13,E17,E21,E26,D32,E38,D43,E47)","v":0},{"$f":"SUM(E7,E13,D17,D21,D26,E32,D38,E43,D47)","v":18},{"$f":"O10-P10","v":-18},9,8820090]
[8,{"$f":"'Calendrier BG'!N23","v":"NDF 2 (F)"},{"$f":"'Calendrier BG'!O23","v":"STMA 2"},2,1,"NDF 2 (F)","STMA 2",null,7,"JBS 2 (F)","Jean Baptiste de la Salle 2",{"$f":"COUNT(D9,D13,D19,D23,D27,D31,D35,D39,D44)","v":9},3,6,{"$f":"SUM(D9,E13,D19,D23,E27,D31,E35,D39,E44)","v":10},{"$f":"SUM(E9,D13,E19,E23,D27,E31,D35,E39,D44)","v":12},-2,15,14981090]
[9,{"$f":"'Calendrier BG'!N24","v":"JBS 1"},{"$f":"'Calendrier BG'!O24","v":"NDF 1"},2,1,{"$f":"IF(D12<>\"\",IF(D12>E12,B12,IF(D12<E12,C12,\"nul\")),\"\")","v":"JBS 1"},"NDF 1",null,5,"NDF 2 (F)","Notre Dame de France 2",{"$f":"COUNT(D5,D11,D17,D23,D28,D33,D37,D41,D45)","v":9},5,4,{"$f":"SUM(E5,D11,D17,D23,E28,D33,E37,D41,E45)","v":8},{"$f":"SUM(D5,E11,E17,E23,D28,E33,D37,E41,D45)","v":11},-3,19,18970890]
[10,{"$f":"'Calendrier BG'!N25","v":"STMA 3 (F)"},{"$f":"'Calendrier BG'!O25","v":"JBS 2 (F)"},0,2,"JBS 2 (F)","STMA 3 (F)",null,6,"STMA 2","Sainte Thérèse Maison Alfort 2",{"$f":"COUNT(D7,D11,D15,D19,D24,D30,D36,D42,D48)","v":9},{"$f":"COUNTIF($F$3:$F$48,J13)","v":4},5,{"$f":"SUM(E7,E11,D15,D19,E24,D30,E36,D42,E48)","v":10},{"$f":"SUM(D7,D11,E15,E19,D24,E30,D36,E42,D48)","v":12},{"$f":"O13-P13","v":-2},{"$f":"M13*3+N13*1","v":17},16981090]
[11,{"$f":"'Calendrier BG'!N26","v":"SVI 2"},{"$f":"'Calendrier BG'!O26","v":"STMA 1"},0,2,"STMA 1","SVI 2"]
[12,{"$f":"'Calendrier BG'!N27","v":"STMA 2"},{"$f":"'Calendrier BG'!O27","v":"SVI 3"},2,1,"STMA 2","SVI 3"]
[13,{"$f":"'Calendrier BG'!N28","v":"SVI 1"},{"$f":"'Calendrier BG'!O28","v":"JBS 1"},0,2,"JBS 1","SVI 1",null,"Classement","SIGLE","Etablissement","Matchs joués","Victoires","Défaites","Sets Pour","Sets Contre","Différence","Points"]
[14,{"$f":"'Calendrier BG'!N29","v":"NDF 2 (F)"},{"$f":"'Calendrier BG'!O29","v":"STMA 3 (F)"},2,0,"NDF 2 (F)","STMA 3 (F)",null,1,{"$f":"VLOOKUP($I17,$I$3:$R$13,COLUMNS($J16:J16)+1,FALSE)","v":"JBS 1"},{"$f":"VLOOKUP($I17,$I$3:$R$13,COLUMNS($J16:K16)+1,FALSE)","v":"Jean Baptiste de la Salle 1"},{"$f":"VLOOKUP($I17,$I$3:$R$13,COLUMNS($J16:L16)+1,FALSE)","v":9},{"$f":"VLOOKUP($I17,$I$3:$R$13,COLUMNS($J16:M16)+1,FALSE)","v":9},{"$f":"VLOOKUP($I17,$I$3:$R$13,COLUMNS($J16:N16)+1,FALSE)","v":0},{"$f":"VLOOKUP($I17,$I$3:$R$13,COLUMNS($J16:O16)+1,FALSE)","v":18},{"$f":"VLOOKUP($I17,$I$3:$R$13,COLUMNS($J16:P16)+1,FALSE)","v":2},{"$f":"VLOOKUP($I17,$I$3:$R$13,COLUMNS($J16:Q16)+1,FALSE)","v":16},{"$f":"VLOOKUP($I17,$I$3:$R$13,COLUMNS($J16:R16)+1,FALSE)","v":27}]
[15,{"$f":"'Calendrier BG'!N30","v":"SVI 2"},{"$f":"'Calendrier BG'!O30","v":"NDF 1"},0,2,"NDF 1","SVI 2",null,2,{"$f":"VLOOKUP($I18,$I$3:$R$13,COLUMNS($J17:J17)+1,FALSE)","v":"NDF 1"},{"$f":"VLOOKUP($I18,$I$3:$R$13,COLUMNS($J17:K17)+1,FALSE)","v":"Notre Dame de France 1"},{"$f":"VLOOKUP($I18,$I$3:$R$13,COLUMNS($J17:L17)+1,FALSE)","v":9},{"$f":"VLOOKUP($I18,$I$3:$R$13,COLUMNS($J17:M17)+1,FALSE)","v":7},{"$f":"VLOOKUP($I18,$I$3:$R$13,COLUMNS($J17:N17)+1,FALSE)","v":2},{"$f":"VLOOKUP($I18,$I$3:$R$13,COLUMNS($J17:O17)+1,FALSE)","v":16},{"$f":"VLOOKUP($I18,$I$3:$R$13,COLUMNS($J17:P17)+1,FALSE)","v":5},{"$f":"VLOOKUP($I18,$I$3:$R$13,COLUMNS($J17:Q17)+1,FALSE)","v":11},{"$f":"VLOOKUP($I18,$I$3:$R$13,COLUMNS($J17:R17)+1,FALSE)","v":23}]
[16,{"$f":"'Calendrier BG'!N31","v":"STMA 2"},{"$f":"'Calendrier BG'!O31","v":"JBS 2 (F)"},2,1,"STMA 2","JBS 2 (F)",null,3,{"$f":"VLOOKUP($I19,$I$3:$R$13,COLUMNS($J18:J18)+1,FALSE)","v":"STMA 1"},{"$f":"VLOOKUP($I19,$I$3:$R$13,COLUMNS($J18:K18)+1,FALSE)","v":"Sainte Thérèse Maison Alfort 1"},{"$f":"VLOOKUP($I19,$I$3:$R$13,COLUMNS($J18:L18)+1,FALSE)","v":9},{"$f":"VLOOKUP($I19,$I$3:$R$13,COLUMNS($J18:M18)+1,FALSE)","v":7},{"$f":"VLOOKUP($I19,$I$3:$R$13,COLUMNS($J18:N18)+1,FALSE)","v":2},{"$f":"VLOOKUP($I19,$I$3:$R$13,COLUMNS($J18:O18)+1,FALSE)","v":15},{"$f":"VLOOKUP($I19,$I$3:$R$13,COLUMNS($J18:P18)+1,FALSE)","v":6},{"$f":"VLOOKUP($I19,$I$3:$R$13,COLUMNS($J18:Q18)+1,FALSE)","v":9},{"$f":"VLOOKUP($I19,$I$3:$R$13,COLUMNS($J18:R18)+1,FALSE)","v":23}]
[17,{"$f":"'Calendrier BG'!N32","v":"STMA 1"},{"$f":"'Calendrier BG'!O32","v":"JBS 1"},0,2,"JBS 1","STMA 1",null,4,{"$f":"VLOOKUP($I20,$I$3:$R$13,COLUMNS($J19:J19)+1,FALSE)","v":{"$error":"#N/A"}},{"$f":"VLOOKUP($I20,$I$3:$R$13,COLUMNS($J19:K19)+1,FALSE)","v":{"$error":"#N/A"}},{"$f":"VLOOKUP($I20,$I$3:$R$13,COLUMNS($J19:L19)+1,FALSE)","v":{"$error":"#N/A"}},{"$f":"VLOOKUP($I20,$I$3:$R$13,COLUMNS($J19:M19)+1,FALSE)","v":{"$error":"#N/A"}},{"$f":"VLOOKUP($I20,$I$3:$R$13,COLUMNS($J19:N19)+1,FALSE)","v":{"$error":"#N/A"}},{"$f":"VLOOKUP($I20,$I$3:$R$13,COLUMNS($J19:O19)+1,FALSE)","v":{"$error":"#N/A"}},{"$f":"VLOOKUP($I20,$I$3:$R$13,COLUMNS($J19:P19)+1,FALSE)","v":{"$error":"#N/A"}},{"$f":"VLOOKUP($I20,$I$3:$R$13,COLUMNS($J19:Q19)+1,FALSE)","v":{"$error":"#N/A"}},{"$f":"VLOOKUP($I20,$I$3:$R$13,COLUMNS($J19:R19)+1,FALSE)","v":{"$error":"#N/A"}}]
[18,{"$f":"'Calendrier BG'!N33","v":"SVI 3"},{"$f":"'Calendrier BG'!O33","v":"STMA 3 (F)"},2,0,"SVI 3","STMA 3 (F)",null,5,{"$f":"VLOOKUP($I21,$I$3:$R$13,COLUMNS($J20:J20)+1,FALSE)","v":"NDF 2 (F)"},{"$f":"VLOOKUP($I21,$I$3:$R$13,COLUMNS($J20:K20)+1,FALSE)","v":"Notre Dame de France 2"},{"$f":"VLOOKUP($I21,$I$3:$R$13,COLUMNS($J20:L20)+1,FALSE)","v":9},{"$f":"VLOOKUP($I21,$I$3:$R$13,COLUMNS($J20:M20)+1,FALSE)","v":5},{"$f":"VLOOKUP($I21,$I$3:$R$13,COLUMNS($J20:N20)+1,FALSE)","v":4},{"$f":"VLOOKUP($I21,$I$3:$R$13,COLUMNS($J20:O20)+1,FALSE)","v":8},{"$f":"VLOOKUP($I21,$I$3:$R$13,COLUMNS($J20:P20)+1,FALSE)","v":11},{"$f":"VLOOKUP($I21,$I$3:$R$13,COLUMNS($J20:Q20)+1,FALSE)","v":-3},{"$f":"VLOOKUP($I21,$I$3:$R$13,COLUMNS($J20:R20)+1,FALSE)","v":19}]
[19,{"$f":"'Calendrier BG'!N34","v":"NDF 1"},{"$f":"'Calendrier BG'!O34","v":"SVI 1"},1,2,"SVI 1","NDF 1",null,6,{"$f":"VLOOKUP($I22,$I$3:$R$13,COLUMNS($J21:J21)+1,FALSE)","v":"STMA 2"},{"$f":"VLOOKUP($I22,$I$3:$R$13,COLUMNS($J21:K21)+1,FALSE)","v":"Sainte Thérèse Maison Alfort 2"},{"$f":"VLOOKUP($I22,$I$3:$R$13,COLUMNS($J21:L21)+1,FALSE)","v":9},{"$f":"VLOOKUP($I22,$I$3:$R$13,COLUMNS($J21:M21)+1,FALSE)","v":4},{"$f":"VLOOKUP($I22,$I$3:$R$13,COLUMNS($J21:N21)+1,FALSE)","v":5},{"$f":"VLOOKUP($I22,$I$3:$R$13,COLUMNS($J21:O21)+1,FALSE)","v":10},{"$f":"VLOOKUP($I22,$I$3:$R$13,COLUMNS($J21:P21)+1,FALSE)","v":12},{"$f":"VLOOKUP($I22,$I$3:$R$13,COLUMNS($J21:Q21)+1,FALSE)","v":-2},{"$f":"VLOOKUP($I22,$I$3:$R$13,COLUMNS($J21:R21)+1,FALSE)","v":17}]
[20,{"$f":"'Calendrier BG'!N35","v":"JBS 2 (F)"},{"$f":"'Calendrier BG'!O35","v":"NDF 2 (F)"},0,2,"NDF 2 (F)","JBS 2 (F)",null,7,{"$f":"VLOOKUP($I23,$I$3:$R$13,COLUMNS($J22:J22)+1,FALSE)","v":"JBS 2 (F)"},{"$f":"VLOOKUP($I23,$I$3:$R$13,COLUMNS($J22:K22)+1,FALSE)","v":"Jean Baptiste de la Salle 2"},{"$f":"VLOOKUP($I23,$I$3:$R$13,COLUMNS($J22:L22)+1,FALSE)","v":9},{"$f":"VLOOKUP($I23,$I$3:$R$13,COLUMNS($J22:M22)+1,FALSE)","v":3},{"$f":"VLOOKUP($I23,$I$3:$R$13,COLUMNS($J22:N22)+1,FALSE)","v":6},{"$f":"VLOOKUP($I23,$I$3:$R$13,COLUMNS($J22:O22)+1,FALSE)","v":10},{"$f":"VLOOKUP($I23,$I$3:$R$13,COLUMNS($J22:P22)+1,FALSE)","v":12},{"$f":"VLOOKUP($I23,$I$3:$R$13,COLUMNS($J22:Q22)+1,FALSE)","v":-2},{"$f":"VLOOKUP($I23,$I$3:$R$13,COLUMNS($J22:R22)+1,FALSE)","v":15}]
[21,{"$f":"'Calendrier BG'!N36","v":"SVI 2"},{"$f":"'Calendrier BG'!O36","v":"STMA 2"},0,2,"STMA 2","SVI 2",null,8,{"$f":"VLOOKUP($I24,$I$3:$R$13,COLUMNS($J23:J23)+1,FALSE)","v":"SVI 2"},{"$f":"VLOOKUP($I24,$I$3:$R$13,COLUMNS($J23:K23)+1,FALSE)","v":"Saint Vincent 2"},{"$f":"VLOOKUP($I24,$I$3:$R$13,COLUMNS($J23:L23)+1,FALSE)","v":9},{"$f":"VLOOKUP($I24,$I$3:$R$13,COLUMNS($J23:M23)+1,FALSE)","v":2},{"$f":"VLOOKUP($I24,$I$3:$R$13,COLUMNS($J23:N23)+1,FALSE)","v":7},{"$f":"VLOOKUP($I24,$I$3:$R$13,COLUMNS($J23:O23)+1,FALSE)","v":5},{"$f":"VLOOKUP($I24,$I$3:$R$13,COLUMNS($J23:P23)+1,FALSE)","v":15},{"$f":"VLOOKUP($I24,$I$3:$R$13,COLUMNS($J23:Q23)+1,FALSE)","v":-10},{"$f":"VLOOKUP($I24,$I$3:$R$13,COLUMNS($J23:R23)+1,FALSE)","v":13}]
[22,{"$f":"'Calendrier BG'!N37","v":"STMA 1"},{"$f":"'Calendrier BG'!O37","v":"SVI 3"},2,0,{"$f":"IF(D25<>\"\",IF(D25>E25,B25,IF(D25<E25,C25,\"nul\")),\"\")","v":"STMA 1"},{"$f":"IF(E25<>\"\",IF(E25<D25,C25,IF(E25>D25,B25,\"nul\")),\"\")","v":"SVI 3"},null,9,{"$f":"VLOOKUP($I25,$I$3:$R$13,COLUMNS($J24:J24)+1,FALSE)","v":"SVI 3"},{"$f":"VLOOKUP($I25,$I$3:$R$13,COLUMNS($J24:K24)+1,FALSE)","v":"Saint Vincent 3"},{"$f":"VLOOKUP($I25,$I$3:$R$13,COLUMNS($J24:L24)+1,FALSE)","v":9},{"$f":"VLOOKUP($I25,$I$3:$R$13,COLUMNS($J24:M24)+1,FALSE)","v":1},{"$f":"VLOOKUP($I25,$I$3:$R$13,COLUMNS($J24:N24)+1,FALSE)","v":8},{"$f":"VLOOKUP($I25,$I$3:$R$13,COLUMNS($J24:O24)+1,FALSE)","v":4},{"$f":"VLOOKUP($I25,$I$3:$R$13,COLUMNS($J24:P24)+1,FALSE)","v":15},{"$f":"VLOOKUP($I25,$I$3:$R$13,COLUMNS($J24:Q24)+1,FALSE)","v":-11},{"$f":"VLOOKUP($I25,$I$3:$R$13,COLUMNS($J24:R24)+1,FALSE)","v":11}]
[23,{"$f":"'Calendrier BG'!N38","v":"JBS 1"},{"$f":"'Calendrier BG'!O38","v":"STMA 3 (F)"},2,0,"JBS 1","STMA 3 (F)",null,10,{"$f":"VLOOKUP($I26,$I$3:$R$13,COLUMNS($J25:J25)+1,FALSE)","v":"STMA 3 (F)"},{"$f":"VLOOKUP($I26,$I$3:$R$13,COLUMNS($J25:K25)+1,FALSE)","v":"Sainte Thérèse Maison Alfort 3"},{"$f":"VLOOKUP($I26,$I$3:$R$13,COLUMNS($J25:L25)+1,FALSE)","v":9},{"$f":"VLOOKUP($I26,$I$3:$R$13,COLUMNS($J25:M25)+1,FALSE)","v":0},{"$f":"VLOOKUP($I26,$I$3:$R$13,COLUMNS($J25:N25)+1,FALSE)","v":9},{"$f":"VLOOKUP($I26,$I$3:$R$13,COLUMNS($J25:O25)+1,FALSE)","v":0},{"$f":"VLOOKUP($I26,$I$3:$R$13,COLUMNS($J25:P25)+1,FALSE)","v":18},{"$f":"VLOOKUP($I26,$I$3:$R$13,COLUMNS($J25:Q25)+1,FALSE)","v":-18},{"$f":"VLOOKUP($I26,$I$3:$R$13,COLUMNS($J25:R25)+1,FALSE)","v":9}]
[24,{"$f":"'Calendrier BG'!N39","v":"NDF 1"},{"$f":"'Calendrier BG'!O39","v":"JBS 2 (F)"},2,0,"NDF 1","JBS 2 (F)"]
[25,{"$f":"'Calendrier BG'!N40","v":"SVI 1"},{"$f":"'Calendrier BG'!O40","v":"NDF 2 (F)"},2,0,"SVI 1","NDF 2 (F)"]
[26,{"$f":"'Calendrier BG'!N41","v":"SVI 3"},{"$f":"'Calendrier BG'!O41","v":"SVI 2"},1,2,"SVI 2","SVI 3"]
[27,{"$f":"'Calendrier BG'!N42","v":"STMA 2"},{"$f":"'Calendrier BG'!O42","v":"JBS 1"},1,2,"JBS 1","STMA 2"]
[28,{"$f":"'Calendrier BG'!N43","v":"JBS 2 (F)"},{"$f":"'Calendrier BG'!O43","v":"STMA 1"},1,2,"STMA 1","JBS 2 (F)"]
[29,{"$f":"'Calendrier BG'!N44","v":"STMA 3 (F)"},{"$f":"'Calendrier BG'!O44","v":"SVI 1"},0,2,"SVI 1","STMA 3 (F)"]
[30,{"$f":"'Calendrier BG'!N45","v":"NDF 2 (F)"},{"$f":"'Calendrier BG'!O45","v":"NDF 1"},0,2,"NDF 1","NDF 2 (F)"]
[31,{"$f":"'Calendrier BG'!N46","v":"JBS 1"},{"$f":"'Calendrier BG'!O46","v":"SVI 3"},2,0,"JBS 1","SVI 3"]
[32,{"$f":"'Calendrier BG'!N47","v":"SVI 2"},{"$f":"'Calendrier BG'!O47","v":"JBS 2 (F)"},1,2,"JBS 2 (F)","SVI 2"]
[33,{"$f":"'Calendrier BG'!N48","v":"SVI 1"},{"$f":"'Calendrier BG'!O48","v":"STMA 2"},2,0,"SVI 1","STMA 2"]
[34,{"$f":"'Calendrier BG'!N49","v":"STMA 1"},{"$f":"'Calendrier BG'!O49","v":"NDF 2 (F)"},2,0,"STMA 1","NDF 2 (F)"]
[35,{"$f":"'Calendrier BG'!N50","v":"NDF 1"},{"$f":"'Calendrier BG'!O50","v":"STMA 3 (F)"},2,0,"NDF 1","STMA 3 (F)"]
[36,{"$f":"'Calendrier BG'!N51","v":"JBS 2 (F)"},{"$f":"'Calendrier BG'!O51","v":"JBS 1"},0,2,"JBS 1","JBS 2 (F)"]
[37,{"$f":"'Calendrier BG'!N52","v":"SVI 3"},{"$f":"'Calendrier BG'!O52","v":"SVI 1"},0,2,{"$f":"IF(D40<>\"\",IF(D40>E40,B40,IF(D40<E40,C40,\"nul\")),\"\")","v":"SVI 1"},{"$f":"IF(E40<>\"\",IF(E40<D40,C40,IF(E40>D40,B40,\"nul\")),\"\")","v":"SVI 3"}]
[38,{"$f":"'Calendrier BG'!N53","v":"NDF 2 (F)"},{"$f":"'Calendrier BG'!O53","v":"SVI 2"},2,0,"NDF 2 (F)","SVI 2"]
[39,{"$f":"'Calendrier BG'!N54","v":"STMA 2"},{"$f":"'Calendrier BG'!O54","v":"NDF 1"},0,2,"NDF 1","STMA 2"]
[40,{"$f":"'Calendrier BG'!N55","v":"STMA 3 (F)"},{"$f":"'Calendrier BG'!O55","v":"STMA 1"},0,2,"STMA 1","STMA 3 (F)"]
[41,{"$f":"'Calendrier BG'!N56","v":"SVI 1"},{"$f":"'Calendrier BG'!O56","v":"JBS 2 (F)"},2,1,"SVI 1","JBS 2 (F)"]
[42,{"$f":"'Calendrier BG'!N57","v":"JBS 1"},{"$f":"'Calendrier BG'!O57","v":"NDF 2 (F)"},2,0,"JBS 1","NDF 2 (F)"]
[43,{"$f":"'Calendrier BG'!N58","v":"NDF 1"},{"$f":"'Calendrier BG'!O58","v":"SVI 3"},2,0,"NDF 1","SVI 3"]
[44,{"$f":"'Calendrier BG'!N59","v":"SVI 2"},{"$f":"'Calendrier BG'!O59","v":"STMA 3 (F)"},2,0,"SVI 2","STMA 3 (F)"]
[45,{"$f":"'Calendrier BG'!N60","v":"STMA 1"},{"$f":"'Calendrier BG'!O60","v":"STMA 2"},2,0,"STMA 1","STMA 2"]

{"sheet":"Calendrier MG","index":3,"n_rows":100,"n_cols":15,"rows_kept":100,"cut":false,"hidden":false,"merged":[[2,0,9,0],[29,1,34,8],[29,0,34,0],[18,0,23,0],[24,0,28,0],[10,0,17,0],[24,4,25,4],[26,4,27,4],[18,1,23,8],[0,10,0,14],[1,10,1,11],[2,10,2,11],[12,13,12,14],[1,6,1,7],[0,1,0,8],[2,4,4,4],[12,4,15,4],[95,0,99,0],[69,0,74,0],[51,0,56,0],[51,1,56,8],[35,0,40,0],[35,1,40,8],[41,0,46,0],[41,1,46,8],[47,0,50,0],[90,0,94,0],[79,0,84,0],[79,1,84,8],[85,0,89,0],[62,0,68,0],[75,0,78,0],[57,0,61,0]]}
[null," CALENDRIER MINIMES",null,null,null,null,null,null,null,null,"POULES ET MATCHS MINIMES"]
["Date","Match","Equipe A","Equipe B","Lieux","Horaires","Résultats",null,"Indisponibilités",null,"DIVISION 1 "]
["2021-11-17",1,{"$f":"VLOOKUP($B3,$K$13:$O$41,4)","v":"STMA 2"},{"$f":"VLOOKUP($B3,$K$13:$O$41,5)","v":"STMA 3 (F)"},"STMA",null,{"$f":"IFERROR(VLOOKUP($B3,'Cls MG 1'!$A$1:$G$31,4,FALSE),\"\")","v":2},{"$f":"IFERROR(VLOOKUP($B3,'Cls MG 1'!$A$1:$G$31,5,FALSE),\"\")","v":0},null,null,"Etablissements"]
[null,28,{"$f":"VLOOKUP($B4,$K$13:$O$41,4)","v":"STMA 1"},{"$f":"VLOOKUP($B4,$K$13:$O$41,5)","v":"STMA 3 (F)"},null,null,{"$f":"IFERROR(VLOOKUP($B4,'Cls MG 1'!$A$1:$G$31,4,FALSE),\"\")","v":2},{"$f":"IFERROR(VLOOKUP($B4,'Cls MG 1'!$A$1:$G$31,5,FALSE),\"\")","v":0},null,null,1,"STMA 1"]
[null,5,"STMA 1","STMA 2",null,null,{"$f":"IFERROR(VLOOKUP($B5,'Cls MG 1'!$A$1:$G$31,4,FALSE),\"\")","v":2},{"$f":"IFERROR(VLOOKUP($B5,'Cls MG 1'!$A$1:$G$31,5,FALSE),\"\")","v":0},null,null,2,"STMA 2"]
[null,25,"JBS 1","JBS 2","JBS",null,{"$f":"IFERROR(VLOOKUP($B6,'Cls MG 1'!$A$1:$G$31,4,FALSE),\"\")","v":2},{"$f":"IFERROR(VLOOKUP($B6,'Cls MG 1'!$A$1:$G$31,5,FALSE),\"\")","v":0},null,null,3,"STMA 3 (F)"]
[null,15,"NDF 2 (F)","NDF 1","NDF",null,{"$f":"IFERROR(VLOOKUP($B7,'Cls MG 1'!$A$1:$G$31,4,FALSE),\"\")","v":2},{"$f":"IFERROR(VLOOKUP($B7,'Cls MG 1'!$A$1:$G$31,5,FALSE),\"\")","v":0},null,null,4,"JBS 1"]
[null,null,null,null,null,null,{"$f":"IFERROR(VLOOKUP($B8,'Cls BG'!$A$1:$G$39,4,FALSE),\"\")","v":""},{"$f":"IFERROR(VLOOKUP($B8,'Cls BG'!$A$1:$G$39,5,FALSE),\"\")","v":""},null,null,5,"NDF 1"]
[null,null,null,null,null,null,{"$f":"IFERROR(VLOOKUP($B9,'Cls BG'!$A$1:$G$39,4,FALSE),\"\")","v":""},{"$f":"IFERROR(VLOOKUP($B9,'Cls BG'!$A$1:$G$39,5,FALSE),\"\")","v":""},null,null,6,"JBS 2"]
[null,null,null,null,null,null,null,null,null,null,7,"NDF 2 (F)"]
["2021-11-24",8,{"$f":"VLOOKUP($B11,$K$13:$O$41,4)","v":"SVI"},{"$f":"VLOOKUP($B11,$K$13:$O$41,5)","v":"NDF 2 (F)"},"SVI T1","14h",{"$f":"IFERROR(VLOOKUP($B11,'Cls MG 1'!$A$1:$G$31,4,FALSE),\"\")","v":0},{"$f":"IFERROR(VLOOKUP($B11,'Cls MG 1'!$A$1:$G$31,5,FALSE),\"\")","v":2},null,null,8,"SVI"]
[null,null,{"$f":"VLOOKUP($B12,$K$13:$O$41,4)","v":{"$error":"#N/A"}},{"$f":"VLOOKUP($B12,$K$13:$O$41,5)","v":{"$error":"#N/A"}},null,null,{"$f":"IFERROR(VLOOKUP($B12,'Cls MG 1'!$A$1:$G$31,4,FALSE),\"\")","v":""},{"$f":"IFERROR(VLOOKUP($B12,'Cls MG 1'!$A$1:$G$31,5,FALSE),\"\")","v":""}]
[null,6,"STMA 3 (F)","JBS 1","JBS T2","14h",{"$f":"IFERROR(VLOOKUP($B13,'Cls MG 1'!$A$1:$G$31,4,FALSE),\"\")","v":0},{"$f":"IFERROR(VLOOKUP($B13,'Cls MG 1'!$A$1:$G$31,5,FALSE),\"\")","v":2},null,null,"N° Match","Equipe A","Equipe B","Match"]
[null,9,"JBS 1","STMA 1",null,"14h30",{"$f":"IFERROR(VLOOKUP($B14,'Cls MG 1'!$A$1:$G$31,4,FALSE),\"\")","v":1},{"$f":"IFERROR(VLOOKUP($B14,'Cls MG 1'!$A$1:$G$31,5,FALSE),\"\")","v":2},null,null,1,2,3,{"$f":"VLOOKUP(L14,$K$2:$L$11,2)","v":"STMA 2"},{"$f":"VLOOKUP(M14,$K$2:$L$11,2)","v":"STMA 3 (F)"}]
[null,16,"STMA 3 (F)","JBS 2",null,"15h",{"$f":"IFERROR(VLOOKUP($B15,'Cls MG 1'!$A$1:$G$31,4,FALSE),\"\")","v":2},{"$f":"IFERROR(VLOOKUP($B15,'Cls MG 1'!$A$1:$G$31,5,FALSE),\"\")","v":1},null,null,2,1,5,{"$f":"VLOOKUP(L15,$K$2:$L$11,2)","v":"STMA 1"},{"$f":"VLOOKUP(M15,$K$2:$L$11,2)","v":"NDF 1"}]
[null,22,"STMA 2","JBS 2",null,"15h30",{"$f":"IFERROR(VLOOKUP($B16,'Cls MG 1'!$A$1:$G$31,4,FALSE),\"\")","v":0},{"$f":"IFERROR(VLOOKUP($B16,'Cls MG 1'!$A$1:$G$31,5,FALSE),\"\")","v":2},null,null,3,7,4,"NDF 2 (F)","JBS 1"]
[null,null,null,null,null,null,{"$f":"IFERROR(VLOOKUP($B17,'Cls BG'!$A$1:$G$39,4,FALSE),\"\")","v":""},{"$f":"IFERROR(VLOOKUP($B17,'Cls BG'!$A$1:$G$39,5,FALSE),\"\")","v":""},null,null,4,6,8,"JBS 2","SVI"]
[null,null,null,null,null,null,null,null,null,null,5,1,2,"STMA 1","STMA 2"]
["2021-12-01","ENTRAINEMENTS",null,null,null,null,null,null,null,null,6,3,4,"STMA 3 (F)","JBS 1"]
[null,null,null,null,null,null,null,null,null,null,7,5,6,"NDF 1","JBS 2"]
[null,null,null,null,null,null,null,null,null,null,8,8,7,"SVI","NDF 2 (F)"]
[null,null,null,null,null,null,null,null,null,null,9,4,1,"JBS 1","STMA 1"]
[null,null,null,null,null,null,null,null,null,null,10,5,2,"NDF 1","STMA 2"]
[null,null,null,null,null,null,null,null,null,null,11,8,3,"SVI","STMA 3 (F)"]
["2021-12-08",14,{"$f":"VLOOKUP($B25,$K$13:$O$41,4)","v":"SVI"},{"$f":"VLOOKUP($B25,$K$13:$O$41,5)","v":"STMA 1"},"STMA T2","14h",{"$f":"IFERROR(VLOOKUP($B25,'Cls MG 1'!$A$1:$G$31,4,FALSE),\"\")","v":0},{"$f":"IFERROR(VLOOKUP($B25,'Cls MG 1'!$A$1:$G$31,5,FALSE),\"\")","v":2},null,null,12,6,7,"JBS 2","NDF 2 (F)"]
[null,17,{"$f":"VLOOKUP($B26,$K$13:$O$41,4)","v":"STMA 2"},{"$f":"VLOOKUP($B26,$K$13:$O$41,5)","v":"SVI"},null,"14h30",{"$f":"IFERROR(VLOOKUP($B26,'Cls MG 1'!$A$1:$G$31,4,FALSE),\"\")","v":1},{"$f":"IFERROR(VLOOKUP($B26,'Cls MG 1'!$A$1:$G$31,5,FALSE),\"\")","v":2},null,null,13,4,2,"JBS 1","STMA 2"]
[null,3,"NDF 2 (F)","JBS 1","JBS T2","14h",{"$f":"IFERROR(VLOOKUP($B27,'Cls MG 1'!$A$1:$G$31,4,FALSE),\"\")","v":1},{"$f":"IFERROR(VLOOKUP($B27,'Cls MG 1'!$A$1:$G$31,5,FALSE),\"\")","v":2},null,null,14,8,1,"SVI","STMA 1"]
[null,7,"NDF 1","JBS 2",null,"14h30",{"$f":"IFERROR(VLOOKUP($B28,'Cls MG 1'!$A$1:$G$31,4,FALSE),\"\")","v":2},{"$f":"IFERROR(VLOOKUP($B28,'Cls MG 1'!$A$1:$G$31,5,FALSE),\"\")","v":0},null,null,15,7,5,"NDF 2 (F)","NDF 1"]
[null,null,null,null,null,null,{"$f":"IFERROR(VLOOKUP($B29,'Cls BG'!$A$1:$G$39,4,FALSE),\"\")","v":""},{"$f":"IFERROR(VLOOKUP($B29,'Cls BG'!$A$1:$G$39,5,FALSE),\"\")","v":""},null,null,16,3,6,"STMA 3 (F)","JBS 2"]
["2021-12-15","ENTRAINEMENTS",null,null,null,null,null,null,null,null,17,2,8,"STMA 2","SVI"]
[null,null,null,null,null,null,null,null,null,null,18,5,4,"NDF 1","JBS 1"]
[null,null,null,null,null,null,null,null,null,null,19,6,1,"JBS 2","STMA 1"]
[null,null,null,null,null,null,null,null,null,null,20,3,7,"STMA 3 (F)","NDF 2 (F)"]
[null,null,null,null,null,null,null,null,null,null,21,4,8,"JBS 1","SVI"]
[null,null,null,null,null,null,null,null,null,null,22,2,6,"STMA 2","JBS 2"]
["2021-01-05","ENTRAINEMENTS",null,null,null,null,null,null,null,null,23,3,5,"STMA 3 (F)","NDF 1"]
[null,null,null,null,null,null,null,null,null,null,24,1,7,"STMA 1","NDF 2 (F)"]
[null,null,null,null,null,null,null,null,null,null,25,4,6,"JBS 1","JBS 2"]
[null,null,null,null,null,null,null,null,null,null,26,8,5,"SVI","NDF 1"]
[null,null,null,null,null,null,null,null,null,null,27,7,2,"NDF 2 (F)","STMA 2"]
[null,null,null,null,null,null,null,null,null,null,28,1,3,"STMA 1","STMA 3 (F)"]
["2021-02-02","ENTRAINEMENTS",null,null,null,null,null,null,null,null,29,3,2,{"$f":"VLOOKUP(L42,$K$2:$L$11,2)","v":"STMA 3 (F)"},{"$f":"VLOOKUP(M42,$K$2:$L$11,2)","v":"STMA 2"}]
[null,null,null,null,null,null,null,null,null,null,30,5,1,"NDF 1","STMA 1"]
[null,null,null,null,null,null,null,null,null,null,31,4,7,"JBS 1","NDF 2 (F)"]
[null,null,null,null,null,null,null,null,null,null,32,8,6,"SVI","JBS 2"]
[null,null,null,null,null,null,null,null,null,null,33,2,1,"STMA 2","STMA 1"]
[null,null,null,null,null,null,null,null,null,null,34,4,3,"JBS 1","STMA 3 (F)"]
["2022-02-09",4,{"$f":"VLOOKUP($B48,$K$15:$O$60,4)","v":"JBS 2"},{"$f":"VLOOKUP($B48,$K$15:$O$60,5)","v":"SVI"},"SVI T1","14h",{"$f":"IFERROR(VLOOKUP($B48,'Cls MG 1'!$A$1:$G$31,4,FALSE),\"\")","v":2},{"$f":"IFERROR(VLOOKUP($B48,'Cls MG 1'!$A$1:$G$31,5,FALSE),\"\")","v":0},null,null,35,6,5,"JBS 2","NDF 1"]
[null,21,"JBS 1","SVI","SVI T1","14h30",{"$f":"IFERROR(VLOOKUP($B49,'Cls MG 1'!$A$1:$G$31,4,FALSE),\"\")","v":2},{"$f":"IFERROR(VLOOKUP($B49,'Cls MG 1'!$A$1:$G$31,5,FALSE),\"\")","v":0},null,null,36,7,8,"NDF 2 (F)","SVI"]
[null,23,"STMA 3 (F)","NDF 1","STMA T1","14h30",{"$f":"IFERROR(VLOOKUP($B50,'Cls MG 1'!$A$1:$G$31,4,FALSE),\"\")","v":0},{"$f":"IFERROR(VLOOKUP($B50,'Cls MG 1'!$A$1:$G$31,5,FALSE),\"\")","v":2},null,null,37,1,4,"STMA 1","JBS 1"]
[null,27,"NDF 2 (F)","STMA 2","STMA T2","14h30",{"$f":"IFERROR(VLOOKUP($B51,'Cls MG 1'!$A$1:$G$31,4,FALSE),\"\")","v":2},{"$f":"IFERROR(VLOOKUP($B51,'Cls MG 1'!$A$1:$G$31,5,FALSE),\"\")","v":0},null,null,38,2,5,"STMA 2","NDF 1"]
["2022-02-16","ENTRAINEMENTS",null,null,null,null,null,null,null,null,39,3,8,"STMA 3 (F)","SVI"]
[null,null,null,null,null,null,null,null,null,null,40,7,6,"NDF 2 (F)","JBS 2"]
[null,null,null,null,null,null,null,null,null,null,41,2,4,"STMA 2","JBS 1"]
[null,null,null,null,null,null,null,null,null,null,42,1,8,"STMA 1","SVI"]
[null,null,null,null,null,null,null,null,null,null,43,5,7,"NDF 1","NDF 2 (F)"]
[null,null,null,null,null,null,null,null,null,null,44,6,3,"JBS 2","STMA 3 (F)"]
["2022-03-09",2,{"$f":"VLOOKUP($B58,$K$15:$O$60,4)","v":"STMA 1"},{"$f":"VLOOKUP($B58,$K$15:$O$60,5)","v":"NDF 1"},"STMA T1","14h30",{"$f":"IFERROR(VLOOKUP($B58,'Cls MG 1'!$A$1:$G$31,4,FALSE),\"\")","v":2},{"$f":"IFERROR(VLOOKUP($B58,'Cls MG 1'!$A$1:$G$31,5,FALSE),\"\")","v":0},null,null,45,8,2,"SVI","STMA 2"]
[null,20,{"$f":"VLOOKUP($B59,$K$15:$O$60,4)","v":"STMA 3 (F)"},{"$f":"VLOOKUP($B59,$K$15:$O$60,5)","v":"NDF 2 (F)"},"STMA T2","14h30",{"$f":"IFERROR(VLOOKUP($B59,'Cls MG 1'!$A$1:$G$31,4,FALSE),\"\")","v":0},{"$f":"IFERROR(VLOOKUP($B59,'Cls MG 1'!$A$1:$G$31,5,FALSE),\"\")","v":2},null,null,46,4,5,"JBS 1","NDF 1"]
[null,11,{"$f":"VLOOKUP($B60,$K$15:$O$60,4)","v":"SVI"},{"$f":"VLOOKUP($B60,$K$15:$O$60,5)","v":"STMA 3 (F)"},"STMA T1","15h",{"$f":"IFERROR(VLOOKUP($B60,'Cls MG 1'!$A$1:$G$31,4,FALSE),\"\")","v":2},{"$f":"IFERROR(VLOOKUP($B60,'Cls MG 1'!$A$1:$G$31,5,FALSE),\"\")","v":0},null,null,47,1,6,"STMA 1","JBS 2"]
[null,10,{"$f":"VLOOKUP($B61,$K$15:$O$60,4)","v":"NDF 1"},{"$f":"VLOOKUP($B61,$K$15:$O$60,5)","v":"STMA 2"},"STMA T1","15h30",{"$f":"IFERROR(VLOOKUP($B61,'Cls MG 1'!$A$1:$G$31,4,FALSE),\"\")","v":2},{"$f":"IFERROR(VLOOKUP($B61,'Cls MG 1'!$A$1:$G$31,5,FALSE),\"\")","v":1},null,null,48,7,3,"NDF 2 (F)","STMA 3 (F)"]
[null,24,{"$f":"VLOOKUP($B62,$K$15:$O$60,4)","v":"STMA 1"},{"$f":"VLOOKUP($B62,$K$15:$O$60,5)","v":"NDF 2 (F)"},null,null,{"$f":"IFERROR(VLOOKUP($B62,'Cls MG 1'!$A$1:$G$31,4,FALSE),\"\")","v":2},{"$f":"IFERROR(VLOOKUP($B62,'Cls MG 1'!$A$1:$G$31,5,FALSE),\"\")","v":0},null,null,49,8,4,"SVI","JBS 1"]
["2022-03-16",32,{"$f":"VLOOKUP($B63,$K$14:$O$69,4)","v":"SVI"},{"$f":"VLOOKUP($B63,$K$14:$O$69,5)","v":"JBS 2"},"JBS T2","14h",{"$f":"IFERROR(VLOOKUP($B63,'Cls MG 1'!$A$1:$G$59,4,FALSE),\"\")","v":2},{"$f":"IFERROR(VLOOKUP($B63,'Cls MG 1'!$A$1:$G$59,5,FALSE),\"\")","v":1},null,null,50,6,2,"JBS 2","STMA 2"]
[null,49,{"$f":"VLOOKUP($B64,$K$14:$O$69,4)","v":"SVI"},{"$f":"VLOOKUP($B64,$K$14:$O$69,5)","v":"JBS 1"},"JBS T2","14h30",{"$f":"IFERROR(VLOOKUP($B64,'Cls MG 1'!$A$1:$G$59,4,FALSE),\"\")","v":0},{"$f":"IFERROR(VLOOKUP($B64,'Cls MG 1'!$A$1:$G$59,5,FALSE),\"\")","v":2},null,null,51,5,3,"NDF 1","STMA 3 (F)"]
[null,48,"NDF 2 (F)","STMA 3 (F)","STMA T3","14h30",{"$f":"IFERROR(VLOOKUP($B65,'Cls MG 1'!$A$1:$G$59,4,FALSE),\"\")","v":2},{"$f":"IFERROR(VLOOKUP($B65,'Cls MG 1'!$A$1:$G$59,5,FALSE),\"\")","v":0},null,null,52,7,1,"NDF 2 (F)","STMA 1"]
[null,51,"NDF 1","STMA 3 (F)","STMA T3","15h",{"$f":"IFERROR(VLOOKUP($B66,'Cls MG 1'!$A$1:$G$59,4,FALSE),\"\")","v":2},{"$f":"IFERROR(VLOOKUP($B66,'Cls MG 1'!$A$1:$G$59,5,FALSE),\"\")","v":1},null,null,53,6,4,"JBS 2","JBS 1"]
[null,55,"STMA 2","NDF 2 (F)","STMA T1","15h",{"$f":"IFERROR(VLOOKUP($B67,'Cls MG 1'!$A$1:$G$59,4,FALSE),\"\")","v":2},{"$f":"IFERROR(VLOOKUP($B67,'Cls MG 1'!$A$1:$G$59,5,FALSE),\"\")","v":1},null,null,54,5,8,"NDF 1","SVI"]
[null,52,"NDF 2 (F)","STMA 1","STMA T2","15h30",{"$f":"IFERROR(VLOOKUP($B68,'Cls MG 1'!$A$1:$G$59,4,FALSE),\"\")","v":0},{"$f":"IFERROR(VLOOKUP($B68,'Cls MG 1'!$A$1:$G$59,5,FALSE),\"\")","v":2},null,null,55,2,7,"STMA 2","NDF 2 (F)"]
[null,38,"STMA 2","NDF 1","STMA T1","15h30",{"$f":"IFERROR(VLOOKUP($B69,'Cls MG 1'!$A$1:$G$59,4,FALSE),\"\")","v":1},{"$f":"IFERROR(VLOOKUP($B69,'Cls MG 1'!$A$1:$G$59,5,FALSE),\"\")","v":2},null,null,56,3,1,"STMA 3 (F)","STMA 1"]
["2022-03-23",45,"SVI","STMA 2","SVI T1","14h",{"$f":"IFERROR(VLOOKUP($B70,'Cls MG 1'!$A$1:$G$59,4,FALSE),\"\")","v":2},{"$f":"IFERROR(VLOOKUP($B70,'Cls MG 1'!$A$1:$G$59,5,FALSE),\"\")","v":1}]
[null,30,"NDF 1","STMA 1","SVI T2","14h",{"$f":"IFERROR(VLOOKUP($B71,'Cls MG 1'!$A$1:$G$59,4,FALSE),\"\")","v":0},{"$f":"IFERROR(VLOOKUP($B71,'Cls MG 1'!$A$1:$G$59,5,FALSE),\"\")","v":2}]
[null,26,"SVI","NDF 1","SVI T1","14h30",{"$f":"IFERROR(VLOOKUP($B72,'Cls MG 1'!$A$1:$G$59,4,FALSE),\"\")","v":2},{"$f":"IFERROR(VLOOKUP($B72,'Cls MG 1'!$A$1:$G$59,5,FALSE),\"\")","v":0}]
[null,33,"STMA 2","STMA 1","SVI T2","14h30",{"$f":"IFERROR(VLOOKUP($B73,'Cls MG 1'!$A$1:$G$59,4,FALSE),\"\")","v":0},{"$f":"IFERROR(VLOOKUP($B73,'Cls MG 1'!$A$1:$G$59,5,FALSE),\"\")","v":2}]
[null,42,"STMA 1","SVI","SVI T1","15h",{"$f":"IFERROR(VLOOKUP($B74,'Cls MG 1'!$A$1:$G$59,4,FALSE),\"\")","v":2},{"$f":"IFERROR(VLOOKUP($B74,'Cls MG 1'!$A$1:$G$59,5,FALSE),\"\")","v":0}]
[]
["2022-03-30",35,"JBS 2","NDF 1","STMA T3","14h30",{"$f":"IFERROR(VLOOKUP($B76,'Cls MG 1'!$A$1:$G$59,4,FALSE),\"\")","v":0},{"$f":"IFERROR(VLOOKUP($B76,'Cls MG 1'!$A$1:$G$59,5,FALSE),\"\")","v":2}]
[null,13,"JBS 1","STMA 2","STMA T3","15h",{"$f":"IFERROR(VLOOKUP($B77,'Cls MG 1'!$A$1:$G$59,4,FALSE),\"\")","v":2},{"$f":"IFERROR(VLOOKUP($B77,'Cls MG 1'!$A$1:$G$59,5,FALSE),\"\")","v":0}]
[null,18,"NDF 1","JBS 1","STMA T3","15h30",{"$f":"IFERROR(VLOOKUP($B78,'Cls MG 1'!$A$1:$G$59,4,FALSE),\"\")","v":0},{"$f":"IFERROR(VLOOKUP($B78,'Cls MG 1'!$A$1:$G$59,5,FALSE),\"\")","v":2}]
[null,19,"JBS 2","STMA 1","STMA T1","15h30",{"$f":"IFERROR(VLOOKUP($B79,'Cls MG 1'!$A$1:$G$59,4,FALSE),\"\")","v":0},{"$f":"IFERROR(VLOOKUP($B79,'Cls MG 1'!$A$1:$G$59,5,FALSE),\"\")","v":2}]
["2022-04-06","ENTRAINEMENTS"]
[]
[]
[]
[]
[]
["2022-04-13",31,{"$f":"VLOOKUP($B86,$K$14:$O$69,4)","v":"JBS 1"},{"$f":"VLOOKUP($B86,$K$14:$O$69,5)","v":"NDF 2 (F)"},"JBS T1","14h",{"$f":"IFERROR(VLOOKUP($B86,'Cls MG 1'!$A$1:$G$59,4,FALSE),\"\")","v":2},{"$f":"IFERROR(VLOOKUP($B86,'Cls MG 1'!$A$1:$G$59,5,FALSE),\"\")","v":0}]
[null,47,{"$f":"VLOOKUP($B87,$K$14:$O$69,4)","v":"STMA 1"},{"$f":"VLOOKUP($B87,$K$14:$O$69,5)","v":"JBS 2"},"JBS T2","14h",{"$f":"IFERROR(VLOOKUP($B87,'Cls MG 1'!$A$1:$G$59,4,FALSE),\"\")","v":2},{"$f":"IFERROR(VLOOKUP($B87,'Cls MG 1'!$A$1:$G$59,5,FALSE),\"\")","v":0}]
[null,37,"STMA 1","JBS 1","JBS T1","14h30",{"$f":"IFERROR(VLOOKUP($B88,'Cls MG 1'!$A$1:$G$59,4,FALSE),\"\")","v":0},{"$f":"IFERROR(VLOOKUP($B88,'Cls MG 1'!$A$1:$G$59,5,FALSE),\"\")","v":2}]
[null,12,"JBS 2","NDF 2 (F)","JBS T2","14h30",{"$f":"IFERROR(VLOOKUP($B89,'Cls MG 1'!$A$1:$G$59,4,FALSE),\"\")","v":0},{"$f":"IFERROR(VLOOKUP($B89,'Cls MG 1'!$A$1:$G$59,5,FALSE),\"\")","v":2}]
[null,46,"JBS 1","NDF 1","JBS T1","15h",{"$f":"IFERROR(VLOOKUP($B90,'Cls MG 1'!$A$1:$G$59,4,FALSE),\"\")","v":2},{"$f":"IFERROR(VLOOKUP($B90,'Cls MG 1'!$A$1:$G$59,5,FALSE),\"\")","v":0}]
["2022-04-20",54,"NDF 1","SVI","STMA T1","14h30",{"$f":"IFERROR(VLOOKUP($B91,'Cls MG 1'!$A$1:$G$59,4,FALSE),\"\")","v":2},{"$f":"IFERROR(VLOOKUP($B91,'Cls MG 1'!$A$1:$G$59,5,FALSE),\"\")","v":0}]
[null,29,"STMA 3 (F)","STMA 2","STMA T2","14h30",{"$f":"IFERROR(VLOOKUP($B92,'Cls MG 1'!$A$1:$G$59,4,FALSE),\"\")","v":1},{"$f":"IFERROR(VLOOKUP($B92,'Cls MG 1'!$A$1:$G$59,5,FALSE),\"\")","v":2}]
[null,43,"NDF 1","NDF 2 (F)","STMA T1","15h",{"$f":"IFERROR(VLOOKUP($B93,'Cls MG 1'!$A$1:$G$59,4,FALSE),\"\")","v":2},{"$f":"IFERROR(VLOOKUP($B93,'Cls MG 1'!$A$1:$G$59,5,FALSE),\"\")","v":1}]
[null,39,"STMA 3 (F)","SVI","STMA T2","15h",{"$f":"IFERROR(VLOOKUP($B94,'Cls MG 1'!$A$1:$G$59,4,FALSE),\"\")","v":2},{"$f":"IFERROR(VLOOKUP($B94,'Cls MG 1'!$A$1:$G$59,5,FALSE),\"\")","v":0}]
[null,36,"NDF 2 (F)","SVI","STMA T1","15h30",{"$f":"IFERROR(VLOOKUP($B95,'Cls MG 1'!$A$1:$G$59,4,FALSE),\"\")","v":2},{"$f":"IFERROR(VLOOKUP($B95,'Cls MG 1'!$A$1:$G$59,5,FALSE),\"\")","v":0}]
["2022-05-11",34,{"$f":"VLOOKUP($B96,$K$14:$O$69,4)","v":"JBS 1"},{"$f":"VLOOKUP($B96,$K$14:$O$69,5)","v":"STMA 3 (F)"},"JBS T1","14h",{"$f":"IFERROR(VLOOKUP($B96,'Cls MG 1'!$A$1:$G$59,4,FALSE),\"\")","v":2},{"$f":"IFERROR(VLOOKUP($B96,'Cls MG 1'!$A$1:$G$59,5,FALSE),\"\")","v":0}]
[null,40,"NDF 2 (F)","JBS 2","JBS T2","14h",{"$f":"IFERROR(VLOOKUP($B97,'Cls MG 1'!$A$1:$G$59,4,FALSE),\"\")","v":0},{"$f":"IFERROR(VLOOKUP($B97,'Cls MG 1'!$A$1:$G$59,5,FALSE),\"\")","v":2}]
[null,41,"STMA 2","JBS 1","JBS T1","14h30",{"$f":"IFERROR(VLOOKUP($B98,'Cls MG 1'!$A$1:$G$59,4,FALSE),\"\")","v":0},{"$f":"IFERROR(VLOOKUP($B98,'Cls MG 1'!$A$1:$G$59,5,FALSE),\"\")","v":2}]
[null,44,"JBS 2","STMA 3 (F)","JBS T2","14h30",{"$f":"IFERROR(VLOOKUP($B99,'Cls MG 1'!$A$1:$G$59,4,FALSE),\"\")","v":0},{"$f":"IFERROR(VLOOKUP($B99,'Cls MG 1'!$A$1:$G$59,5,FALSE),\"\")","v":2}]
[null,50,"JBS 2","STMA 2","JBS T1","15h",{"$f":"IFERROR(VLOOKUP($B100,'Cls MG 1'!$A$1:$G$59,4,FALSE),\"\")","v":0},{"$f":"IFERROR(VLOOKUP($B100,'Cls MG 1'!$A$1:$G$59,5,FALSE),\"\")","v":2}]

{"sheet":"Cls MG 1","index":4,"n_rows":59,"n_cols":19,"rows_kept":59,"cut":false,"hidden":false,"merged":[[0,0,1,6],[2,3,2,4]]}
["MINIMES DIVISION 1 Phase 1"]
[]
["N° Match","Equipe A","Equipe B","Scores",null,"Vainqueur","Perdant",null,null,"SIGLE","Etablissement","Matchs joués","Victoires","Défaites","Sets Pour","Sets Contre","Différence","Points"]
[1,{"$f":"'Calendrier MG'!N14","v":"STMA 2"},{"$f":"'Calendrier MG'!O14","v":"STMA 3 (F)"},2,0,{"$f":"IF(D4<>\"\",IF(D4>E4,B4,IF(D4<E4,C4,\"nul\")),\"\")","v":"STMA 2"},{"$f":"IF(E4<>\"\",IF(E4<D4,C4,IF(E4>D4,B4,\"nul\")),\"\")","v":"STMA 3 (F)"},null,{"$f":"RANK(S4,$S$4:$S$11)","v":2},"STMA 1","Sainte Thérèse Maison Alfort 1",{"$f":"COUNT(D5,D8,D12,D17,D22,D27,D31,D33,D36,D40,D45,D50,D55,D59)","v":14},{"$f":"COUNTIF($F$3:$F$59,J4)","v":13},{"$f":"COUNTIF($G$3:$G$59,J4)","v":1},{"$f":"SUM(D5,D8,E12,E17,E22,D27,D31,E33,E36,D40,D45,D50,E55,E59)","v":26},{"$f":"SUM(E5,E8,D12,D17,D22,E27,E31,D33,D36,E40,E45,E50,D59,D55)","v":3},{"$f":"O4-P4","v":23},{"$f":"M4*3+N4*1","v":40},{"$f":"SUM(R4*1000000+Q4*10000+O4*100+L4*10)","v":40232740}]
[2,{"$f":"'Calendrier MG'!N15","v":"STMA 1"},{"$f":"'Calendrier MG'!O15","v":"NDF 1"},2,0,{"$f":"IF(D5<>\"\",IF(D5>E5,B5,IF(D5<E5,C5,\"nul\")),\"\")","v":"STMA 1"},{"$f":"IF(E5<>\"\",IF(E5<D5,C5,IF(E5>D5,B5,\"nul\")),\"\")","v":"NDF 1"},null,{"$f":"RANK(S5,$S$4:$S$11)","v":6},"STMA 2","Sainte Thérèse Maison Alfort 2",{"$f":"COUNT(D4,D8,D13,D16,D20,D25,D30,D32,D36,D41,D44,D48,D53,D58)","v":14},{"$f":"COUNTIF($F$3:$F$59,J5)","v":4},{"$f":"COUNTIF($G$3:$G$59,J5)","v":10},{"$f":"SUM(D4,E8,E13,E16,D20,D25,E30,E32,D36,D41,D44,E48,E53,D58)","v":12},{"$f":"SUM(E4,D8,D13,D16,E20,E25,D30,D32,E36,E41,E44,D48,E58,D53)","v":22},{"$f":"O5-P5","v":-10},{"$f":"M5*3+N5*1","v":22},21901340]
[3,{"$f":"'Calendrier MG'!N16","v":"NDF 2 (F)"},{"$f":"'Calendrier MG'!O16","v":"JBS 1"},1,2,"JBS 1","NDF 2 (F)",null,7,"STMA 3 (F)","Sainte Thérèse Maison Alfort 3",{"$f":"COUNT(D4,D9,D14,D19,D23,D26,D31,D32,D37,D42,D47,D51,D54,D59)","v":14},3,11,{"$f":"SUM(E4,D9,E14,D19,D23,D26,E31,D32,E37,D42,E47,E51,E54,D59)","v":8},{"$f":"SUM(D4,E9,D14,E19,E23,E26,D31,E32,D37,E42,D47,D51,E59,D54)","v":23},-15,20,19850940]
[4,{"$f":"'Calendrier MG'!N17","v":"JBS 2"},{"$f":"'Calendrier MG'!O17","v":"SVI"},2,0,"JBS 2","SVI",null,1,"JBS 1","Jean Baptiste la Salle Saint Denis 1",{"$f":"COUNT(D6,D9,D12,D16,D21,D24,D28,D34,D37,D40,D44,D49,D52,D56)","v":14},13,1,{"$f":"SUM(E6,E9,D12,D16,E21,D24,D28,D34,D37,E40,E44,D49,E52,E56)","v":27},{"$f":"SUM(D6,D9,E12,E16,D21,E24,E28,E34,E37,D44,E49,D52,D40,D56)","v":3},24,40,40242840]
[5,{"$f":"'Calendrier MG'!N18","v":"STMA 1"},{"$f":"'Calendrier MG'!O18","v":"STMA 2"},2,0,"STMA 1","STMA 2",null,3,"NDF 1","Notre Dame de France 1",{"$f":"COUNT(D5,D10,D13,D18,D21,D26,D29,D33,D38,D41,D46,D49,D54,D57)","v":14},8,6,{"$f":"SUM(E5,D10,D13,E18,D21,E26,E29,D33,E38,E41,D46,E49,D54,D57)","v":16},{"$f":"SUM(D5,E10,E13,D18,E21,D26,D29,E33,D38,D41,E46,D49,E57,E54)","v":16},0,30,30001740]
[6,{"$f":"'Calendrier MG'!N19","v":"STMA 3 (F)"},{"$f":"'Calendrier MG'!O19","v":"JBS 1"},0,2,"JBS 1","STMA 3 (F)",null,8,"JBS 2 (F)","Jean Baptiste la Salle Saint Denis 2",{"$f":"COUNT(D7,D10,D15,D19,D22,D25,D28,D35,D38,D43,D47,D50,D53,D56)","v":14},0,0,{"$f":"SUM(D7,E10,D15,E19,D22,E25,E28,E35,D38,E43,D47,E50,D56,D53)","v":8},{"$f":"SUM(E7,D10,E15,D19,E22,D25,D28,D35,E38,D43,E47,D50,E56,E53)","v":22},-14,0,-139060]
[7,{"$f":"'Calendrier MG'!N20","v":"NDF 1"},{"$f":"'Calendrier MG'!O20","v":"JBS 2"},2,0,"NDF 1","JBS 2",null,4,"NDF 2 (F)","Notre Dame de France 2",{"$f":"COUNT(D6,D11,D15,D18,D23,D27,D30,D34,D39,D43,D46,D51,D55,D58)","v":14},7,7,{"$f":"SUM(D6,E11,E15,D18,E23,E27,D30,E34,D39,D43,E46,D51,D55,E58)","v":17},{"$f":"SUM(E6,D11,D15,E18,D23,D27,D34,E43,D46,E58,E51,E55,E30,E39)","v":13},{"$f":"O10-P10","v":4},{"$f":"M10*3+N10*1","v":28},28041840]
[8,{"$f":"'Calendrier MG'!N21","v":"SVI"},{"$f":"'Calendrier MG'!O21","v":"NDF 2 (F)"},0,2,"NDF 2 (F)","SVI",null,5,"SVI","Saint Vincent",{"$f":"COUNT(D7,D11,D14,D17,D20,D24,D29,D35,D39,D42,D45,D48,D52,D57)","v":14},5,9,{"$f":"SUM(E7,D11,D14,D17,E20,E24,D29,D35,E39,E42,E45,D48,D52,E57)","v":10},{"$f":"SUM(D7,E11,E14,E17,D20,D24,E29,E35,D39,D45,E52,D57,D66,E48)","v":19},-9,24,23911140]
[9,{"$f":"'Calendrier MG'!N22","v":"JBS 1"},{"$f":"'Calendrier MG'!O22","v":"STMA 1"},1,2,{"$f":"IF(D12<>\"\",IF(D12>E12,B12,IF(D12<E12,C12,\"nul\")),\"\")","v":"STMA 1"},"JBS 1"]
[10,{"$f":"'Calendrier MG'!N23","v":"NDF 1"},{"$f":"'Calendrier MG'!O23","v":"STMA 2"},2,1,"NDF 1","STMA 2"]
[11,{"$f":"'Calendrier MG'!N24","v":"SVI"},{"$f":"'Calendrier MG'!O24","v":"STMA 3 (F)"},2,0,"SVI","STMA 3 (F)",null,"Classement","SIGLE","Etablissement","Matchs joués","Victoires","Défaites","Sets Pour","Sets Contre","Différence","Points"]
[12,{"$f":"'Calendrier MG'!N25","v":"JBS 2"},{"$f":"'Calendrier MG'!O25","v":"NDF 2 (F)"},0,2,"NDF 2 (F)","JBS 2",null,1,{"$f":"VLOOKUP($I15,$I$3:$R$11,COLUMNS($J14:J14)+1,FALSE)","v":"JBS 1"},{"$f":"VLOOKUP($I15,$I$3:$R$11,COLUMNS($J14:K14)+1,FALSE)","v":"Jean Baptiste la Salle Saint Denis 1"},{"$f":"VLOOKUP($I15,$I$3:$R$11,COLUMNS($J14:L14)+1,FALSE)","v":14},{"$f":"VLOOKUP($I15,$I$3:$R$11,COLUMNS($J14:M14)+1,FALSE)","v":13},{"$f":"VLOOKUP($I15,$I$3:$R$11,COLUMNS($J14:N14)+1,FALSE)","v":1},{"$f":"VLOOKUP($I15,$I$3:$R$11,COLUMNS($J14:O14)+1,FALSE)","v":27},{"$f":"VLOOKUP($I15,$I$3:$R$11,COLUMNS($J14:P14)+1,FALSE)","v":3},{"$f":"VLOOKUP($I15,$I$3:$R$11,COLUMNS($J14:Q14)+1,FALSE)","v":24},{"$f":"VLOOKUP($I15,$I$3:$R$11,COLUMNS($J14:R14)+1,FALSE)","v":40}]
[13,{"$f":"'Calendrier MG'!N26","v":"JBS 1"},{"$f":"'Calendrier MG'!O26","v":"STMA 2"},2,0,"JBS 1","STMA 2",null,2,{"$f":"VLOOKUP($I16,$I$3:$R$11,COLUMNS($J15:J15)+1,FALSE)","v":"STMA 1"},{"$f":"VLOOKUP($I16,$I$3:$R$11,COLUMNS($J15:K15)+1,FALSE)","v":"Sainte Thérèse Maison Alfort 1"},{"$f":"VLOOKUP($I16,$I$3:$R$11,COLUMNS($J15:L15)+1,FALSE)","v":14},{"$f":"VLOOKUP($I16,$I$3:$R$11,COLUMNS($J15:M15)+1,FALSE)","v":13},{"$f":"VLOOKUP($I16,$I$3:$R$11,COLUMNS($J15:N15)+1,FALSE)","v":1},{"$f":"VLOOKUP($I16,$I$3:$R$11,COLUMNS($J15:O15)+1,FALSE)","v":26},{"$f":"VLOOKUP($I16,$I$3:$R$11,COLUMNS($J15:P15)+1,FALSE)","v":3},{"$f":"VLOOKUP($I16,$I$3:$R$11,COLUMNS($J15:Q15)+1,FALSE)","v":23},{"$f":"VLOOKUP($I16,$I$3:$R$11,COLUMNS($J15:R15)+1,FALSE)","v":40}]
[14,{"$f":"'Calendrier MG'!N27","v":"SVI"},{"$f":"'Calendrier MG'!O27","v":"STMA 1"},0,2,"STMA 1","SVI",null,3,{"$f":"VLOOKUP($I17,$I$3:$R$11,COLUMNS($J16:J16)+1,FALSE)","v":"NDF 1"},{"$f":"VLOOKUP($I17,$I$3:$R$11,COLUMNS($J16:K16)+1,FALSE)","v":"Notre Dame de France 1"},{"$f":"VLOOKUP($I17,$I$3:$R$11,COLUMNS($J16:L16)+1,FALSE)","v":14},{"$f":"VLOOKUP($I17,$I$3:$R$11,COLUMNS($J16:M16)+1,FALSE)","v":8},{"$f":"VLOOKUP($I17,$I$3:$R$11,COLUMNS($J16:N16)+1,FALSE)","v":6},{"$f":"VLOOKUP($I17,$I$3:$R$11,COLUMNS($J16:O16)+1,FALSE)","v":16},{"$f":"VLOOKUP($I17,$I$3:$R$11,COLUMNS($J16:P16)+1,FALSE)","v":16},{"$f":"VLOOKUP($I17,$I$3:$R$11,COLUMNS($J16:Q16)+1,FALSE)","v":0},{"$f":"VLOOKUP($I17,$I$3:$R$11,COLUMNS($J16:R16)+1,FALSE)","v":30}]
[15,{"$f":"'Calendrier MG'!N28","v":"NDF 2 (F)"},{"$f":"'Calendrier MG'!O28","v":"NDF 1"},2,0,"NDF 2 (F)","NDF 1",null,4,{"$f":"VLOOKUP($I18,$I$3:$R$11,COLUMNS($J17:J17)+1,FALSE)","v":"NDF 2 (F)"},{"$f":"VLOOKUP($I18,$I$3:$R$11,COLUMNS($J17:K17)+1,FALSE)","v":"Notre Dame de France 2"},{"$f":"VLOOKUP($I18,$I$3:$R$11,COLUMNS($J17:L17)+1,FALSE)","v":14},{"$f":"VLOOKUP($I18,$I$3:$R$11,COLUMNS($J17:M17)+1,FALSE)","v":7},{"$f":"VLOOKUP($I18,$I$3:$R$11,COLUMNS($J17:N17)+1,FALSE)","v":7},{"$f":"VLOOKUP($I18,$I$3:$R$11,COLUMNS($J17:O17)+1,FALSE)","v":17},{"$f":"VLOOKUP($I18,$I$3:$R$11,COLUMNS($J17:P17)+1,FALSE)","v":13},{"$f":"VLOOKUP($I18,$I$3:$R$11,COLUMNS($J17:Q17)+1,FALSE)","v":4},{"$f":"VLOOKUP($I18,$I$3:$R$11,COLUMNS($J17:R17)+1,FALSE)","v":28}]
[16,{"$f":"'Calendrier MG'!N29","v":"STMA 3 (F)"},{"$f":"'Calendrier MG'!O29","v":"JBS 2"},2,1,{"$f":"IF(D19<>\"\",IF(D19>E19,B19,IF(D19<E19,C19,\"nul\")),\"\")","v":"STMA 3 (F)"},{"$f":"IF(E19<>\"\",IF(E19<D19,C19,IF(E19>D19,B19,\"nul\")),\"\")","v":"JBS 2"},null,5,{"$f":"VLOOKUP($I19,$I$3:$R$11,COLUMNS($J18:J18)+1,FALSE)","v":"SVI"},{"$f":"VLOOKUP($I19,$I$3:$R$11,COLUMNS($J18:K18)+1,FALSE)","v":"Saint Vincent"},{"$f":"VLOOKUP($I19,$I$3:$R$11,COLUMNS($J18:L18)+1,FALSE)","v":14},{"$f":"VLOOKUP($I19,$I$3:$R$11,COLUMNS($J18:M18)+1,FALSE)","v":5},{"$f":"VLOOKUP($I19,$I$3:$R$11,COLUMNS($J18:N18)+1,FALSE)","v":9},{"$f":"VLOOKUP($I19,$I$3:$R$11,COLUMNS($J18:O18)+1,FALSE)","v":10},{"$f":"VLOOKUP($I19,$I$3:$R$11,COLUMNS($J18:P18)+1,FALSE)","v":19},{"$f":"VLOOKUP($I19,$I$3:$R$11,COLUMNS($J18:Q18)+1,FALSE)","v":-9},{"$f":"VLOOKUP($I19,$I$3:$R$11,COLUMNS($J18:R18)+1,FALSE)","v":24}]
[17,{"$f":"'Calendrier MG'!N30","v":"STMA 2"},{"$f":"'Calendrier MG'!O30","v":"SVI"},1,2,"SVI","STMA 2",null,6,{"$f":"VLOOKUP($I20,$I$3:$R$11,COLUMNS($J19:J19)+1,FALSE)","v":"STMA 2"},{"$f":"VLOOKUP($I20,$I$3:$R$11,COLUMNS($J19:K19)+1,FALSE)","v":"Sainte Thérèse Maison Alfort 2"},{"$f":"VLOOKUP($I20,$I$3:$R$11,COLUMNS($J19:L19)+1,FALSE)","v":14},{"$f":"VLOOKUP($I20,$I$3:$R$11,COLUMNS($J19:M19)+1,FALSE)","v":4},{"$f":"VLOOKUP($I20,$I$3:$R$11,COLUMNS($J19:N19)+1,FALSE)","v":10},{"$f":"VLOOKUP($I20,$I$3:$R$11,COLUMNS($J19:O19)+1,FALSE)","v":12},{"$f":"VLOOKUP($I20,$I$3:$R$11,COLUMNS($J19:P19)+1,FALSE)","v":22},{"$f":"VLOOKUP($I20,$I$3:$R$11,COLUMNS($J19:Q19)+1,FALSE)","v":-10},{"$f":"VLOOKUP($I20,$I$3:$R$11,COLUMNS($J19:R19)+1,FALSE)","v":22}]
[18,{"$f":"'Calendrier MG'!N31","v":"NDF 1"},{"$f":"'Calendrier MG'!O31","v":"JBS 1"},0,2,"JBS 1","NDF 1",null,7,{"$f":"VLOOKUP($I21,$I$3:$R$11,COLUMNS($J20:J20)+1,FALSE)","v":"STMA 3 (F)"},{"$f":"VLOOKUP($I21,$I$3:$R$11,COLUMNS($J20:K20)+1,FALSE)","v":"Sainte Thérèse Maison Alfort 3"},{"$f":"VLOOKUP($I21,$I$3:$R$11,COLUMNS($J20:L20)+1,FALSE)","v":14},{"$f":"VLOOKUP($I21,$I$3:$R$11,COLUMNS($J20:M20)+1,FALSE)","v":3},{"$f":"VLOOKUP($I21,$I$3:$R$11,COLUMNS($J20:N20)+1,FALSE)","v":11},{"$f":"VLOOKUP($I21,$I$3:$R$11,COLUMNS($J20:O20)+1,FALSE)","v":8},{"$f":"VLOOKUP($I21,$I$3:$R$11,COLUMNS($J20:P20)+1,FALSE)","v":23},{"$f":"VLOOKUP($I21,$I$3:$R$11,COLUMNS($J20:Q20)+1,FALSE)","v":-15},{"$f":"VLOOKUP($I21,$I$3:$R$11,COLUMNS($J20:R20)+1,FALSE)","v":20}]
[19,{"$f":"'Calendrier MG'!N32","v":"JBS 2"},{"$f":"'Calendrier MG'!O32","v":"STMA 1"},0,2,"STMA 1","JBS 2",null,8,{"$f":"VLOOKUP($I22,$I$3:$R$11,COLUMNS($J21:J21)+1,FALSE)","v":"JBS 2 (F)"},{"$f":"VLOOKUP($I22,$I$3:$R$11,COLUMNS($J21:K21)+1,FALSE)","v":"Jean Baptiste la Salle Saint Denis 2"},{"$f":"VLOOKUP($I22,$I$3:$R$11,COLUMNS($J21:L21)+1,FALSE)","v":14},{"$f":"VLOOKUP($I22,$I$3:$R$11,COLUMNS($J21:M21)+1,FALSE)","v":0},{"$f":"VLOOKUP($I22,$I$3:$R$11,COLUMNS($J21:N21)+1,FALSE)","v":0},{"$f":"VLOOKUP($I22,$I$3:$R$11,COLUMNS($J21:O21)+1,FALSE)","v":8},{"$f":"VLOOKUP($I22,$I$3:$R$11,COLUMNS($J21:P21)+1,FALSE)","v":22},{"$f":"VLOOKUP($I22,$I$3:$R$11,COLUMNS($J21:Q21)+1,FALSE)","v":-14},{"$f":"VLOOKUP($I22,$I$3:$R$11,COLUMNS($J21:R21)+1,FALSE)","v":0}]
[20,{"$f":"'Calendrier MG'!N33","v":"STMA 3 (F)"},{"$f":"'Calendrier MG'!O33","v":"NDF 2 (F)"},0,2,"NDF 2 (F)","STMA 3 (F)"]
[21,{"$f":"'Calendrier MG'!N34","v":"JBS 1"},{"$f":"'Calendrier MG'!O34","v":"SVI"},2,0,"JBS 1","SVI"]
[22,{"$f":"'Calendrier MG'!N35","v":"STMA 2"},{"$f":"'Calendrier MG'!O35","v":"JBS 2"},0,2,"JBS 2","STMA 2"]
[23,{"$f":"'Calendrier MG'!N36","v":"STMA 3 (F)"},{"$f":"'Calendrier MG'!O36","v":"NDF 1"},0,2,"NDF 1","STMA 3 (F)"]
[24,{"$f":"'Calendrier MG'!N37","v":"STMA 1"},{"$f":"'Calendrier MG'!O37","v":"NDF 2 (F)"},2,0,"STMA 1","NDF 2 (F)"]
[25,{"$f":"'Calendrier MG'!N38","v":"JBS 1"},{"$f":"'Calendrier MG'!O38","v":"JBS 2"},2,0,"JBS 1","JBS 2"]
[26,{"$f":"'Calendrier MG'!N39","v":"SVI"},{"$f":"'Calendrier MG'!O39","v":"NDF 1"},2,0,"SVI","NDF 1"]
[27,{"$f":"'Calendrier MG'!N40","v":"NDF 2 (F)"},{"$f":"'Calendrier MG'!O40","v":"STMA 2"},2,0,"NDF 2 (F)","STMA 2"]
[28,{"$f":"'Calendrier MG'!N41","v":"STMA 1"},{"$f":"'Calendrier MG'!O41","v":"STMA 3 (F)"},2,0,"STMA 1","STMA 3 (F)"]
[29,{"$f":"'Calendrier MG'!N42","v":"STMA 3 (F)"},{"$f":"'Calendrier MG'!O42","v":"STMA 2"},1,2,{"$f":"IF(D32<>\"\",IF(D32>E32,B32,IF(D32<E32,C32,\"nul\")),\"\")","v":"STMA 2"},{"$f":"IF(E32<>\"\",IF(E32<D32,C32,IF(E32>D32,B32,\"nul\")),\"\")","v":"STMA 3 (F)"}]
[30,{"$f":"'Calendrier MG'!N43","v":"NDF 1"},{"$f":"'Calendrier MG'!O43","v":"STMA 1"},0,2,"STMA 1","NDF 1"]
[31,{"$f":"'Calendrier MG'!N44","v":"JBS 1"},{"$f":"'Calendrier MG'!O44","v":"NDF 2 (F)"},2,0,"JBS 1","NDF 2 (F)"]
[32,{"$f":"'Calendrier MG'!N45","v":"SVI"},{"$f":"'Calendrier MG'!O45","v":"JBS 2"},2,1,"SVI","JBS 2"]
[33,{"$f":"'Calendrier MG'!N46","v":"STMA 2"},{"$f":"'Calendrier MG'!O46","v":"STMA 1"},0,2,"STMA 1","STMA 2"]
[34,{"$f":"'Calendrier MG'!N47","v":"JBS 1"},{"$f":"'Calendrier MG'!O47","v":"STMA 3 (F)"},2,0,"JBS 1","STMA 3 (F)"]
[35,{"$f":"'Calendrier MG'!N48","v":"JBS 2"},{"$f":"'Calendrier MG'!O48","v":"NDF 1"},0,2,"NDF 1","JBS 2"]
[36,{"$f":"'Calendrier MG'!N49","v":"NDF 2 (F)"},{"$f":"'Calendrier MG'!O49","v":"SVI"},2,0,"NDF 2 (F)","SVI"]
[37,{"$f":"'Calendrier MG'!N50","v":"STMA 1"},{"$f":"'Calendrier MG'!O50","v":"JBS 1"},0,2,"JBS 1","STMA 1"]
[38,{"$f":"'Calendrier MG'!N51","v":"STMA 2"},{"$f":"'Calendrier MG'!O51","v":"NDF 1"},1,2,"NDF 1","STMA 2"]
[39,{"$f":"'Calendrier MG'!N52","v":"STMA 3 (F)"},{"$f":"'Calendrier MG'!O52","v":"SVI"},2,0,"STMA 3 (F)","SVI"]
[40,{"$f":"'Calendrier MG'!N53","v":"NDF 2 (F)"},{"$f":"'Calendrier MG'!O53","v":"JBS 2"},0,2,"JBS 2","NDF 2 (F)"]
[41,{"$f":"'Calendrier MG'!N54","v":"STMA 2"},{"$f":"'Calendrier MG'!O54","v":"JBS 1"},0,2,"JBS 1","STMA 2"]
[42,{"$f":"'Calendrier MG'!N55","v":"STMA 1"},{"$f":"'Calendrier MG'!O55","v":"SVI"},2,0,"STMA 1","SVI"]
[43,{"$f":"'Calendrier MG'!N56","v":"NDF 1"},{"$f":"'Calendrier MG'!O56","v":"NDF 2 (F)"},2,1,"NDF 1","NDF 2 (F)"]
[44,{"$f":"'Calendrier MG'!N57","v":"JBS 2"},{"$f":"'Calendrier MG'!O57","v":"STMA 3 (F)"},0,2,"STMA 3 (F)","JBS 2"]
[45,{"$f":"'Calendrier MG'!N58","v":"SVI"},{"$f":"'Calendrier MG'!O58","v":"STMA 2"},2,1,"SVI","STMA 2"]
[46,{"$f":"'Calendrier MG'!N59","v":"JBS 1"},{"$f":"'Calendrier MG'!O59","v":"NDF 1"},2,0,"JBS 1","NDF 1"]
[47,{"$f":"'Calendrier MG'!N60","v":"STMA 1"},{"$f":"'Calendrier MG'!O60","v":"JBS 2"},2,0,"STMA 1","JBS 2"]
[48,{"$f":"'Calendrier MG'!N61","v":"NDF 2 (F)"},{"$f":"'Calendrier MG'!O61","v":"STMA 3 (F)"},2,0,"NDF 2 (F)","STMA 3 (F)"]
[49,{"$f":"'Calendrier MG'!N62","v":"SVI"},{"$f":"'Calendrier MG'!O62","v":"JBS 1"},0,2,"JBS 1","SVI"]
[50,{"$f":"'Calendrier MG'!N63","v":"JBS 2"},{"$f":"'Calendrier MG'!O63","v":"STMA 2"},0,2,"STMA 2","JBS 2"]
[51,{"$f":"'Calendrier MG'!N64","v":"NDF 1"},{"$f":"'Calendrier MG'!O64","v":"STMA 3 (F)"},2,1,"NDF 1","STMA 3 (F)"]
[52,{"$f":"'Calendrier MG'!N65","v":"NDF 2 (F)"},{"$f":"'Calendrier MG'!O65","v":"STMA 1"},0,2,"STMA 1","NDF 2 (F)"]
[53,{"$f":"'Calendrier MG'!N66","v":"JBS 2"},{"$f":"'Calendrier MG'!O66","v":"JBS 1"},0,2,"JBS 1","JBS 2"]
[54,{"$f":"'Calendrier MG'!N67","v":"NDF 1"},{"$f":"'Calendrier MG'!O67","v":"SVI"},2,0,"NDF 1","SVI"]
[55,{"$f":"'Calendrier MG'!N68","v":"STMA 2"},{"$f":"'Calendrier MG'!O68","v":"NDF 2 (F)"},2,1,"STMA 2","NDF 2 (F)"]
[56,{"$f":"'Calendrier MG'!N69","v":"STMA 3 (F)"},{"$f":"'Calendrier MG'!O69","v":"STMA 1"},0,2,"STMA 1","STMA 3 (F)"]

{"sheet":"Classements","index":5,"n_rows":28,"n_cols":10,"rows_kept":28,"cut":false,"hidden":false,"merged":[[0,0,1,9],[2,0,2,2],[16,0,17,9],[18,0,18,2]]}
["CLASSEMENT PROMO BENJAMINS 2021-2022"]
[]
["DIVISION 1"]
["Classement","SIGLE","Etablissement","Matchs joués","Victoires","Défaites","Sets Pour","Sets Contre","Différence","Points"]
[1,{"$f":"'Cls BG'!J17","v":"JBS 1"},{"$f":"'Cls BG'!K17","v":"Jean Baptiste de la Salle 1"},{"$f":"'Cls BG'!L17","v":9},{"$f":"'Cls BG'!M17","v":9},{"$f":"'Cls BG'!N17","v":0},{"$f":"'Cls BG'!O17","v":18},{"$f":"'Cls BG'!P17","v":2},{"$f":"'Cls BG'!Q17","v":16},{"$f":"'Cls BG'!R17","v":27}]
[2,{"$f":"'Cls BG'!J18","v":"NDF 1"},{"$f":"'Cls BG'!K18","v":"Notre Dame de France 1"},{"$f":"'Cls BG'!L18","v":9},{"$f":"'Cls BG'!M18","v":7},{"$f":"'Cls BG'!N18","v":2},{"$f":"'Cls BG'!O18","v":16},{"$f":"'Cls BG'!P18","v":5},{"$f":"'Cls BG'!Q18","v":11},{"$f":"'Cls BG'!R18","v":23}]
[3,{"$f":"'Cls BG'!J19","v":"STMA 1"},{"$f":"'Cls BG'!K19","v":"Sainte Thérèse Maison Alfort 1"},{"$f":"'Cls BG'!L19","v":9},{"$f":"'Cls BG'!M19","v":7},{"$f":"'Cls BG'!N19","v":2},{"$f":"'Cls BG'!O19","v":15},{"$f":"'Cls BG'!P19","v":6},{"$f":"'Cls BG'!Q19","v":9},{"$f":"'Cls BG'!R19","v":23}]
[4,"SVI 1","Saint Vincent 1",9,7,2,15,6,9,23]
[5,{"$f":"'Cls BG'!J21","v":"NDF 2 (F)"},{"$f":"'Cls BG'!K21","v":"Notre Dame de France 2"},{"$f":"'Cls BG'!L21","v":9},{"$f":"'Cls BG'!M21","v":5},{"$f":"'Cls BG'!N21","v":4},{"$f":"'Cls BG'!O21","v":8},{"$f":"'Cls BG'!P21","v":11},{"$f":"'Cls BG'!Q21","v":-3},{"$f":"'Cls BG'!R21","v":19}]
[6,{"$f":"'Cls BG'!J22","v":"STMA 2"},{"$f":"'Cls BG'!K22","v":"Sainte Thérèse Maison Alfort 2"},{"$f":"'Cls BG'!L22","v":9},{"$f":"'Cls BG'!M22","v":4},{"$f":"'Cls BG'!N22","v":5},{"$f":"'Cls BG'!O22","v":10},{"$f":"'Cls BG'!P22","v":12},{"$f":"'Cls BG'!Q22","v":-2},{"$f":"'Cls BG'!R22","v":17}]
[7,{"$f":"'Cls BG'!J23","v":"JBS 2 (F)"},{"$f":"'Cls BG'!K23","v":"Jean Baptiste de la Salle 2"},{"$f":"'Cls BG'!L23","v":9},{"$f":"'Cls BG'!M23","v":3},{"$f":"'Cls BG'!N23","v":6},{"$f":"'Cls BG'!O23","v":10},{"$f":"'Cls BG'!P23","v":12},{"$f":"'Cls BG'!Q23","v":-2},{"$f":"'Cls BG'!R23","v":15}]
[8,{"$f":"'Cls BG'!J24","v":"SVI 2"},{"$f":"'Cls BG'!K24","v":"Saint Vincent 2"},{"$f":"'Cls BG'!L24","v":9},{"$f":"'Cls BG'!M24","v":2},{"$f":"'Cls BG'!N24","v":7},{"$f":"'Cls BG'!O24","v":5},{"$f":"'Cls BG'!P24","v":15},{"$f":"'Cls BG'!Q24","v":-10},{"$f":"'Cls BG'!R24","v":13}]
[9,{"$f":"'Cls BG'!J25","v":"SVI 3"},{"$f":"'Cls BG'!K25","v":"Saint Vincent 3"},{"$f":"'Cls BG'!L25","v":9},{"$f":"'Cls BG'!M25","v":1},{"$f":"'Cls BG'!N25","v":8},{"$f":"'Cls BG'!O25","v":4},{"$f":"'Cls BG'!P25","v":15},{"$f":"'Cls BG'!Q25","v":-11},{"$f":"'Cls BG'!R25","v":11}]
[10,{"$f":"'Cls BG'!J26","v":"STMA 3 (F)"},{"$f":"'Cls BG'!K26","v":"Sainte Thérèse Maison Alfort 3"},{"$f":"'Cls BG'!L26","v":9},{"$f":"'Cls BG'!M26","v":0},{"$f":"'Cls BG'!N26","v":9},{"$f":"'Cls BG'!O26","v":0},{"$f":"'Cls BG'!P26","v":18},{"$f":"'Cls BG'!Q26","v":-18},{"$f":"'Cls BG'!R26","v":9}]
[]
[]
["CLASSEMENT PROMO MINIMES 2021-2022"]
[]
["DIVISION 1 "]
["Classement","SIGLE","Etablissement","Matchs joués","Victoires","Défaites","Sets Pour","Sets Contre","Différence","Points"]
[1,{"$f":"'Cls MG 1'!J15","v":"JBS 1"},{"$f":"'Cls MG 1'!K15","v":"Jean Baptiste la Salle Saint Denis 1"},{"$f":"'Cls MG 1'!L15","v":14},{"$f":"'Cls MG 1'!M15","v":13},{"$f":"'Cls MG 1'!N15","v":1},{"$f":"'Cls MG 1'!O15","v":27},{"$f":"'Cls MG 1'!P15","v":3},{"$f":"'Cls MG 1'!Q15","v":24},{"$f":"'Cls MG 1'!R15","v":40}]
[2,{"$f":"'Cls MG 1'!J16","v":"STMA 1"},{"$f":"'Cls MG 1'!K16","v":"Sainte Thérèse Maison Alfort 1"},{"$f":"'Cls MG 1'!L16","v":14},{"$f":"'Cls MG 1'!M16","v":13},{"$f":"'Cls MG 1'!N16","v":1},{"$f":"'Cls MG 1'!O16","v":26},{"$f":"'Cls MG 1'!P16","v":3},{"$f":"'Cls MG 1'!Q16","v":23},{"$f":"'Cls MG 1'!R16","v":40}]
[3,{"$f":"'Cls MG 1'!J17","v":"NDF 1"},{"$f":"'Cls MG 1'!K17","v":"Notre Dame de France 1"},{"$f":"'Cls MG 1'!L17","v":14},{"$f":"'Cls MG 1'!M17","v":8},{"$f":"'Cls MG 1'!N17","v":6},{"$f":"'Cls MG 1'!O17","v":16},{"$f":"'Cls MG 1'!P17","v":16},{"$f":"'Cls MG 1'!Q17","v":0},{"$f":"'Cls MG 1'!R17","v":30}]
[4,{"$f":"'Cls MG 1'!J18","v":"NDF 2 (F)"},{"$f":"'Cls MG 1'!K18","v":"Notre Dame de France 2"},{"$f":"'Cls MG 1'!L18","v":14},{"$f":"'Cls MG 1'!M18","v":7},{"$f":"'Cls MG 1'!N18","v":7},{"$f":"'Cls MG 1'!O18","v":17},{"$f":"'Cls MG 1'!P18","v":13},{"$f":"'Cls MG 1'!Q18","v":4},{"$f":"'Cls MG 1'!R18","v":28}]
[5,{"$f":"'Cls MG 1'!J19","v":"SVI"},{"$f":"'Cls MG 1'!K19","v":"Saint Vincent"},{"$f":"'Cls MG 1'!L19","v":14},{"$f":"'Cls MG 1'!M19","v":5},{"$f":"'Cls MG 1'!N19","v":9},{"$f":"'Cls MG 1'!O19","v":10},{"$f":"'Cls MG 1'!P19","v":19},{"$f":"'Cls MG 1'!Q19","v":-9},{"$f":"'Cls MG 1'!R19","v":24}]
[6,{"$f":"'Cls MG 1'!J20","v":"STMA 2"},{"$f":"'Cls MG 1'!K20","v":"Sainte Thérèse Maison Alfort 2"},{"$f":"'Cls MG 1'!L20","v":14},{"$f":"'Cls MG 1'!M20","v":4},{"$f":"'Cls MG 1'!N20","v":10},{"$f":"'Cls MG 1'!O20","v":12},{"$f":"'Cls MG 1'!P20","v":22},{"$f":"'Cls MG 1'!Q20","v":-10},{"$f":"'Cls MG 1'!R20","v":22}]
[7,{"$f":"'Cls MG 1'!J21","v":"STMA 3 (F)"},{"$f":"'Cls MG 1'!K21","v":"Sainte Thérèse Maison Alfort 3"},{"$f":"'Cls MG 1'!L21","v":14},{"$f":"'Cls MG 1'!M21","v":3},{"$f":"'Cls MG 1'!N21","v":11},{"$f":"'Cls MG 1'!O21","v":8},{"$f":"'Cls MG 1'!P21","v":23},{"$f":"'Cls MG 1'!Q21","v":-15},{"$f":"'Cls MG 1'!R21","v":20}]
[8,{"$f":"'Cls MG 1'!J22","v":"JBS 2 (F)"},{"$f":"'Cls MG 1'!K22","v":"Jean Baptiste la Salle Saint Denis 2"},{"$f":"'Cls MG 1'!L22","v":14},{"$f":"'Cls MG 1'!M22","v":0},{"$f":"'Cls MG 1'!N22","v":0},{"$f":"'Cls MG 1'!O22","v":8},{"$f":"'Cls MG 1'!P22","v":22},{"$f":"'Cls MG 1'!Q22","v":-14},{"$f":"'Cls MG 1'!R22","v":0}]

{"sheet":"Indispos profs","index":6,"n_rows":9,"n_cols":7,"rows_kept":9,"cut":false,"hidden":false,"merged":[[0,0,0,10],[1,1,1,5],[1,6,1,10]]}
["DATES D'INDISPONIBILITES DES ETABLISSEMENTS"]
["SIGLES","Benjamins",null,null,null,null,"Minimes"]
["STMA"]
["AM"]
["GSMV"]
["SVI"]
["JBS"]
["SCN"]
["NDF"]

{"sheet":"Listing profs","index":7,"n_rows":8,"n_cols":5,"rows_kept":8,"cut":false,"hidden":false,"merged":[[8,2,9,2],[6,1,7,1],[6,0,7,0],[0,0,0,4]]}
["LISTING PROFESSEUR VOLLEY-BALL 2021-2022"]
["NOM D'ETABLISSEMENT","SIGLE","NOM et PRENOM","N° MOBILE","MAIL "]
["JEAN-BAPTISTE DE LA SALLE","JBS","JAEGLE Thomas","06 60 92 14 09","thomas.jaegle@lasallesaintdenis.com"]
["NOTRE DAME DE France","NDF","BONNIN Dimitri","06 09 91 28 54","dimitri.bonnin@gmail.com"]
["ST VINCENT","SVI","ESCOBAR Claudio","06 48 17 62 43","claudioescorp@gmail.com"]
["ALBERT DE MUN","AM","DRIEU Yolaine","06 60 72 98 51","yolainedrieu@hotmail.fr"]
["SAINTE THERESE MAISON ALFORT","STMA","RILAT Olivier","06 01 94 50 10","orilat@yahoo.fr"]
[null,null,"MEYNIEL Serge","06 01 81 99 64","sergemeyniel65@gmail.com"]

{"sheet":"Installations","index":8,"n_rows":6,"n_cols":5,"rows_kept":6,"cut":false,"hidden":false,"merged":[[0,0,0,4]]}
["INSTALLATIONS VOLLEY-BALL 2021/2022"]
["NOM DU TERRAIN","COORDONNEES","MOYENS D'ACCES","HORAIRES","TERRAINS"]
[]
["JEAN BAPTISTE DE LA SALLE","6/8 place de la Résistance 93200 Saint-Denis","Métro 13 Saint Denis Porte de Paris","13h30-16h30","2 terrains couverts"]
["ST VINCENT","151 rue des poissonniers 75018 Paris","Métro Porte de la Chapelle, Porte de Clignancourt, station tram T3 b :Diana Arbus ","13h30-16h30","2 terrains couverts"]
["SAINTE THERESE MAISON-ALFORT","13 rue Pierre Semard 94700 Maisons-Alfort (code petite porte en métal gris 0143) ","RER D Maison-Alfort/Alfortville ou Métro 8 Maison-Alfort Stade","14h30-17h30","3 terrains couverts"]