{"text_format":"1","workbook":"xlsx","n_sheets":9,"sheets":["Calendrier général","Calendrier BG","Cls BG","Calendrier MG","Cls MG 1","Classements","Indispos profs","Listing profs","Installations"],"not_rendered":{"charts":0,"images":0,"macros":0,"external_links":0,"defined_names":1,"comments":0,"pivot_tables":0},"unopened":[],"bounds":{"document_bytes":16777216,"sheet_cells":100000,"rows_first":2000,"rows_last":500,"rows_between":2000,"halvings":0,"cell_chars":16384,"cell_head_chars":4096},"cells_cut":0,"cells_raw":0,"read":"whole","date_system":"1900"}

{"sheet":"Calendrier général","index":0,"n_rows":110,"n_cols":19,"rows_kept":110,"cut":false,"hidden":false,"merged":[[83,11,88,18],[89,10,93,10],[77,10,82,10],[77,0,82,0],[83,0,88,0],[83,10,88,10],[89,1,93,8],[89,0,93,0],[41,0,46,0],[41,1,46,8],[41,10,46,10],[41,11,46,18],[35,0,40,0],[35,1,40,8],[35,10,40,10],[35,11,40,18],[18,0,23,0],[18,1,23,8],[29,0,34,0],[29,1,34,8],[29,10,34,10],[24,0,28,0],[29,11,34,18],[24,4,26,4],[24,10,28,10],[24,14,25,14],[26,14,27,14],[27,4,28,4],[2,0,9,0],[2,4,4,4],[7,4,9,4],[10,0,17,0],[14,4,17,4],[12,14,15,14],[18,10,23,10],[18,11,23,18],[0,1,0,8],[1,6,1,7],[0,11,0,18],[1,16,1,17],[2,10,9,10],[2,14,4,14],[10,10,17,10],[53,11,58,18],[47,10,50,10],[53,0,58,0],[53,1,58,8],[53,10,58,10],[47,0,52,0],[94,10,98,10],[104,0,108,0],[104,1,108,8],[59,10,63,10],[64,10,70,10],[71,10,76,10],[59,0,63,0],[64,0,69,0],[71,0,76,0],[71,1,76,8],[94,0,98,0],[94,1,98,8],[109,10,113,10],[109,11,113,18],[99,10,103,10],[99,0,103,0],[99,1,103,8]]}
[null," CALENDRIER BENJAMINS ",null,null,null,null,null,null,null,null,null," CALENDRIER MINIMES"]
["Date","Match","Equipe A","Equipe B","Lieux","Horaires","Résultats",null,"Indisponibilités",null,"Date","Match","Equipe A","Equipe B","Lieux","Horaires","Résultats",null,"Indisponibilités"]
["2021-11-17",4,{"$f":"'Calendrier BG'!C3","v":"STMA 3 (F)"},{"$f":"'Calendrier BG'!D3","v":"STMA 2"},"STMA",null,{"$f":"'Calendrier BG'!G3","v":0},{"$f":"'Calendrier BG'!H3","v":2},null,null,"2021-11-17",1,{"$f":"'Calendrier MG'!C3","v":"STMA 2"},{"$f":"'Calendrier MG'!D3","v":"STMA 3 (F)"},"STMA",null,{"$f":"'Calendrier MG'!G3","v":2},{"$f":"'Calendrier MG'!H3","v":0}]
[null,40,{"$f":"'Calendrier BG'!C4","v":"STMA 3 (F)"},{"$f":"'Calendrier BG'!D4","v":"STMA 1"},null,null,{"$f":"'Calendrier BG'!G4","v":0},{"$f":"'Calendrier BG'!H4","v":2},null,null,null,28,{"$f":"'Calendrier MG'!C4","v":"STMA 1"},{"$f":"'Calendrier MG'!D4","v":"STMA 3 (F)"},null,null,{"$f":"'Calendrier MG'!G4","v":2},{"$f":"'Calendrier MG'!H4","v":0}]
[null,45,{"$f":"'Calendrier BG'!C5","v":"STMA 1"},{"$f":"'Calendrier BG'!D5","v":"STMA 2"},null,null,{"$f":"'Calendrier BG'!G5","v":2},{"$f":"'Calendrier BG'!H5","v":0},null,null,null,5,{"$f":"'Calendrier MG'!C5","v":"STMA 1"},{"$f":"'Calendrier MG'!D5","v":"STMA 2"},null,null,{"$f":"'Calendrier MG'!G5","v":2},{"$f":"'Calendrier MG'!H5","v":0}]
[null,36,{"$f":"'Calendrier BG'!C6","v":"JBS 2 (F)"},{"$f":"'Calendrier BG'!D6","v":"JBS 1"},"JBS",null,{"$f":"'Calendrier BG'!G6","v":0},{"$f":"'Calendrier BG'!H6","v":2},null,null,null,25,{"$f":"'Calendrier MG'!C6","v":"JBS 1"},{"$f":"'Calendrier MG'!D6","v":"JBS 2"},"JBS",null,{"$f":"'Calendrier MG'!G6","v":2},{"$f":"'Calendrier MG'!H6","v":0}]
[null,30,{"$f":"'Calendrier BG'!C7","v":"NDF 2 (F)"},{"$f":"'Calendrier BG'!D7","v":"NDF 1"},"NDF",null,{"$f":"'Calendrier BG'!G7","v":0},{"$f":"'Calendrier BG'!H7","v":2},null,null,null,15,{"$f":"'Calendrier MG'!C7","v":"NDF 2 (F)"},{"$f":"'Calendrier MG'!D7","v":"NDF 1"},"NDF",null,{"$f":"'Calendrier MG'!G7","v":2},{"$f":"'Calendrier MG'!H7","v":0}]
[null,7,{"$f":"'Calendrier BG'!C8","v":"SVI 1"},{"$f":"'Calendrier BG'!D8","v":"SVI 2"},"SVI",null,{"$f":"'Calendrier BG'!G8","v":2},{"$f":"'Calendrier BG'!H8","v":0},null,null,null,null,null,null,null,null,{"$f":"'Calendrier MG'!G8","v":""},{"$f":"'Calendrier MG'!H8","v":""}]
[null,26,{"$f":"'Calendrier BG'!C9","v":"SVI 3"},{"$f":"'Calendrier BG'!D9","v":"SVI 2"},null,null,{"$f":"'Calendrier BG'!G9","v":1},{"$f":"'Calendrier BG'!H9","v":2},null,null,null,null,null,null,null,null,{"$f":"'Calendrier MG'!G9","v":""},{"$f":"'Calendrier MG'!H9","v":""}]
[null,37,{"$f":"'Calendrier BG'!C10","v":"SVI 3"},{"$f":"'Calendrier BG'!D10","v":"SVI 1"},null,null,{"$f":"'Calendrier BG'!G10","v":0},{"$f":"'Calendrier BG'!H10","v":2}]
{"$rows_left_out":101}
{"sheet":"Calendrier BG","index":1,"n_rows":89,"n_cols":15,"rows_kept":89,"cut":false,"hidden":false,"merged":[[88,0,92,0],[88,1,92,8],[41,0,46,0],[41,1,46,8],[64,0,69,0],[47,0,52,0],[59,0,63,0],[53,0,58,0],[70,0,75,0],[76,0,81,0],[70,1,75,8],[82,0,87,0],[53,1,58,8],[2,0,9,0],[0,10,0,14],[1,10,1,11],[2,10,2,11],[0,1,0,8],[14,13,14,14],[1,6,1,7],[2,4,4,4],[7,4,9,4],[14,4,17,4],[10,0,17,0],[18,1,23,8],[35,0,40,0],[35,1,40,8],[18,0,23,0],[24,0,28,0],[29,0,34,0],[29,1,34,8],[24,4,26,4],[27,4,28,4]]}
[null," CALENDRIER BENJAMINS ",null,null,null,null,null,null,null,null,"POULES ET MATCHS BENJAMINS"]
["Date","Match","Equipe A","Equipe B","Lieux","Horaires","Résultats",null,"Indisponibilités",null,"DIVISION 1"]
["2021-11-17",4,{"$f":"VLOOKUP($B3,$K$15:$O$60,4)","v":"STMA 3 (F)"},{"$f":"VLOOKUP($B3,$K$15:$O$60,5)","v":"STMA 2"},"STMA",null,{"$f":"IFERROR(VLOOKUP($B3,'Cls BG'!$A$1:$G$48,4,FALSE),\"\")","v":0},{"$f":"IFERROR(VLOOKUP($B3,'Cls BG'!$A$1:$G$48,5,FALSE),\"\")","v":2},null,null,"Etablissements"]
[null,40,"STMA 3 (F)","STMA 1",null,null,{"$f":"IFERROR(VLOOKUP($B4,'Cls BG'!$A$1:$G$48,4,FALSE),\"\")","v":0},{"$f":"IFERROR(VLOOKUP($B4,'Cls BG'!$A$1:$G$48,5,FALSE),\"\")","v":2},null,null,1,"STMA 1"]
[null,45,"STMA 1","STMA 2",null,null,{"$f":"IFERROR(VLOOKUP($B5,'Cls BG'!$A$1:$G$48,4,FALSE),\"\")","v":2},{"$f":"IFERROR(VLOOKUP($B5,'Cls BG'!$A$1:$G$48,5,FALSE),\"\")","v":0},null,null,2,"JBS 1"]
[null,36,"JBS 2 (F)","JBS 1","JBS",null,{"$f":"IFERROR(VLOOKUP($B6,'Cls BG'!$A$1:$G$48,4,FALSE),\"\")","v":0},{"$f":"IFERROR(VLOOKUP($B6,'Cls BG'!$A$1:$G$48,5,FALSE),\"\")","v":2},null,null,3,"NDF 1"]
[null,30,"NDF 2 (F)","NDF 1","NDF",null,{"$f":"IFERROR(VLOOKUP($B7,'Cls BG'!$A$1:$G$48,4,FALSE),\"\")","v":0},{"$f":"IFERROR(VLOOKUP($B7,'Cls BG'!$A$1:$G$48,5,FALSE),\"\")","v":2},null,null,4,"SVI 1"]
[null,7,"SVI 1","SVI 2","SVI",null,{"$f":"IFERROR(VLOOKUP($B8,'Cls BG'!$A$1:$G$48,4,FALSE),\"\")","v":2},{"$f":"IFERROR(VLOOKUP($B8,'Cls BG'!$A$1:$G$48,5,FALSE),\"\")","v":0},null,null,5,"SVI 2"]
[null,26,"SVI 3","SVI 2",null,null,{"$f":"IFERROR(VLOOKUP($B9,'Cls BG'!$A$1:$G$48,4,FALSE),\"\")","v":1},{"$f":"IFERROR(VLOOKUP($B9,'Cls BG'!$A$1:$G$48,5,FALSE),\"\")","v":2},null,null,6,"SVI 3"]
[null,37,"SVI 3","SVI 1",null,null,{"$f":"IFERROR(VLOOKUP($B10,'Cls BG'!$A$1:$G$48,4,FALSE),\"\")","v":0},{"$f":"IFERROR(VLOOKUP($B10,'Cls BG'!$A$1:$G$48,5,FALSE),\"\")","v":2},null,null,7,"STMA 3 (F)"]
{"$rows_left_out":80}
{"sheet":"Cls BG","index":2,"n_rows":48,"n_cols":19,"rows_kept":48,"cut":false,"hidden":false,"merged":[[2,3,2,4],[0,0,1,6]]}
["BENJAMINS DIVISION 1"]
[]
["N° Match","Equipe A","Equipe B","Scores",null,"Vainqueur","Perdant",null,null,"SIGLE","Etablissement","Matchs joués","Victoires","Défaites","Sets Pour","Sets Contre","Différence","Points"]
[1,{"$f":"'Calendrier BG'!N16","v":"STMA 1"},{"$f":"'Calendrier BG'!O16","v":"SVI 1"},2,1,{"$f":"IF(D4<>\"\",IF(D4>E4,B4,IF(D4<E4,C4,\"nul\")),\"\")","v":"STMA 1"},{"$f":"IF(E4<>\"\",IF(E4<D4,C4,IF(E4>D4,B4,\"nul\")),\"\")","v":"SVI 1"},null,{"$f":"RANK(S4,$S$4:$S$13)","v":3},"STMA 1","Sainte Thérèse Maison Alfort 1",{"$f":"COUNT(D4,D8,D14,D20,D25,D31,D37,D43,D48)","v":9},{"$f":"COUNTIF($F$3:$F$48,J4)","v":7},{"$f":"COUNTIF($G$3:$G$48,J4)","v":2},{"$f":"SUM(D4,E8,E14,D20,D25,E31,D37,E43,D48)","v":15},{"$f":"SUM(E4,D8,D14,E20,E25,D31,E37,D43,E48)","v":6},{"$f":"O4-P4","v":9},{"$f":"M4*3+N4*1","v":23},{"$f":"SUM(R4*1000000+Q4*10000+O4*100+L4*10)","v":23091590}]
[2,{"$f":"'Calendrier BG'!N17","v":"SVI 3"},{"$f":"'Calendrier BG'!O17","v":"NDF 2 (F)"},0,2,{"$f":"IF(D5<>\"\",IF(D5>E5,B5,IF(D5<E5,C5,\"nul\")),\"\")","v":"NDF 2 (F)"},{"$f":"IF(E5<>\"\",IF(E5<D5,C5,IF(E5>D5,B5,\"nul\")),\"\")","v":"SVI 3"},null,{"$f":"RANK(S5,$S$4:$S$13)","v":1},"JBS 1","Jean Baptiste de la Salle 1",{"$f":"COUNT(D6,D12,D16,D20,D26,D30,D34,D39,D45)","v":9},{"$f":"COUNTIF($F$3:$F$48,J5)","v":9},{"$f":"COUNTIF($G$3:$G$48,J5)","v":0},{"$f":"SUM(D6,D12,E16,E20,D26,E30,D34,E39,D45)","v":18},{"$f":"SUM(E6,E12,D16,D20,E26,D30,E34,D39,E45)","v":2},{"$f":"O5-P5","v":16},{"$f":"M5*3+N5*1","v":27},27161890]
[3,{"$f":"'Calendrier BG'!N18","v":"JBS 1"},{"$f":"'Calendrier BG'!O18","v":"SVI 2"},2,0,"JBS 1","SVI 2",null,2,"NDF 1","Notre Dame de France 1",{"$f":"COUNT(D8,D12,D18,D22,D27,D33,D38,D42,D46)","v":9},7,2,{"$f":"SUM(D8,E12,E18,D22,D27,E33,D38,E42,D46)","v":16},{"$f":"SUM(E8,D12,D18,E22,E27,D33,E38,D42,E46)","v":5},{"$f":"O6-P6","v":11},23,23111690]
[4,{"$f":"'Calendrier BG'!N19","v":"STMA 3 (F)"},{"$f":"'Calendrier BG'!O19","v":"STMA 2"},0,2,"STMA 2","STMA 3 (F)",null,3,"SVI 1","Saint Vincent 1",{"$f":"COUNT(D4,D10,D16,D22,D28,D32,D36,D40,D44)","v":9},7,2,{"$f":"SUM(E4,D10,D16,E22,D28,E32,D36,E40,D44)","v":15},{"$f":"SUM(D4,E10,E16,D22,E28,D32,E36,D40,E44)","v":6},9,23,23091590]
[5,{"$f":"'Calendrier BG'!N20","v":"NDF 1"},{"$f":"'Calendrier BG'!O20","v":"STMA 1"},2,1,"NDF 1","STMA 1",null,8,"SVI 2","Saint Vincent 2",{"$f":"COUNT(D6,D10,D14,D18,D24,D29,D35,D41,D47)","v":9},2,7,{"$f":"SUM(E6,E10,D14,D18,D24,E29,D35,E41,D47)","v":5},{"$f":"SUM(D6,D10,E14,E18,E24,D29,E35,D41,E47)","v":15},-10,13,12900590]
[6,{"$f":"'Calendrier BG'!N21","v":"JBS 2 (F)"},{"$f":"'Calendrier BG'!O21","v":"SVI 3"},2,0,"JBS 2 (F)","SVI 3",null,9,"SVI 3","Saint Vincent 3",{"$f":"COUNT(D5,D9,D15,D21,D25,D29,D34,D40,D46)","v":9},1,8,{"$f":"SUM(D5,E9,E15,D21,E25,D29,E34,D40,E46)","v":4},{"$f":"SUM(E5,D9,E15,E21,D25,E29,D34,E40,D46)","v":15},-11,11,10890490]
[7,{"$f":"'Calendrier BG'!N22","v":"SVI 1"},{"$f":"'Calendrier BG'!O22","v":"SVI 2"},2,0,"SVI 1","SVI 2",null,10,"STMA 3 (F)","Sainte Thérèse Maison Alfort 3",{"$f":"COUNT(D7,D13,D17,D21,D26,D32,D38,D43,D47)","v":9},0,9,{"$f":"SUM(D7,D13,E17,E21,E26,D32,E38,D43,E47)","v":0},{"$f":"SUM(E7,E13,D17,D21,D26,E32,D38,E43,D47)","v":18},{"$f":"O10-P10","v":-18},9,8820090]
{"$rows_left_out":39}
{"sheet":"Calendrier MG","index":3,"n_rows":100,"n_cols":15,"rows_kept":100,"cut":false,"hidden":false,"merged":[[2,0,9,0],[29,1,34,8],[29,0,34,0],[18,0,23,0],[24,0,28,0],[10,0,17,0],[24,4,25,4],[26,4,27,4],[18,1,23,8],[0,10,0,14],[1,10,1,11],[2,10,2,11],[12,13,12,14],[1,6,1,7],[0,1,0,8],[2,4,4,4],[12,4,15,4],[95,0,99,0],[69,0,74,0],[51,0,56,0],[51,1,56,8],[35,0,40,0],[35,1,40,8],[41,0,46,0],[41,1,46,8],[47,0,50,0],[90,0,94,0],[79,0,84,0],[79,1,84,8],[85,0,89,0],[62,0,68,0],[75,0,78,0],[57,0,61,0]]}
[null," CALENDRIER MINIMES",null,null,null,null,null,null,null,null,"POULES ET MATCHS MINIMES"]
["Date","Match","Equipe A","Equipe B","Lieux","Horaires","Résultats",null,"Indisponibilités",null,"DIVISION 1 "]
["2021-11-17",1,{"$f":"VLOOKUP($B3,$K$13:$O$41,4)","v":"STMA 2"},{"$f":"VLOOKUP($B3,$K$13:$O$41,5)","v":"STMA 3 (F)"},"STMA",null,{"$f":"IFERROR(VLOOKUP($B3,'Cls MG 1'!$A$1:$G$31,4,FALSE),\"\")","v":2},{"$f":"IFERROR(VLOOKUP($B3,'Cls MG 1'!$A$1:$G$31,5,FALSE),\"\")","v":0},null,null,"Etablissements"]
[null,28,{"$f":"VLOOKUP($B4,$K$13:$O$41,4)","v":"STMA 1"},{"$f":"VLOOKUP($B4,$K$13:$O$41,5)","v":"STMA 3 (F)"},null,null,{"$f":"IFERROR(VLOOKUP($B4,'Cls MG 1'!$A$1:$G$31,4,FALSE),\"\")","v":2},{"$f":"IFERROR(VLOOKUP($B4,'Cls MG 1'!$A$1:$G$31,5,FALSE),\"\")","v":0},null,null,1,"STMA 1"]
[null,5,"STMA 1","STMA 2",null,null,{"$f":"IFERROR(VLOOKUP($B5,'Cls MG 1'!$A$1:$G$31,4,FALSE),\"\")","v":2},{"$f":"IFERROR(VLOOKUP($B5,'Cls MG 1'!$A$1:$G$31,5,FALSE),\"\")","v":0},null,null,2,"STMA 2"]
[null,25,"JBS 1","JBS 2","JBS",null,{"$f":"IFERROR(VLOOKUP($B6,'Cls MG 1'!$A$1:$G$31,4,FALSE),\"\")","v":2},{"$f":"IFERROR(VLOOKUP($B6,'Cls MG 1'!$A$1:$G$31,5,FALSE),\"\")","v":0},null,null,3,"STMA 3 (F)"]
[null,15,"NDF 2 (F)","NDF 1","NDF",null,{"$f":"IFERROR(VLOOKUP($B7,'Cls MG 1'!$A$1:$G$31,4,FALSE),\"\")","v":2},{"$f":"IFERROR(VLOOKUP($B7,'Cls MG 1'!$A$1:$G$31,5,FALSE),\"\")","v":0},null,null,4,"JBS 1"]
[null,null,null,null,null,null,{"$f":"IFERROR(VLOOKUP($B8,'Cls BG'!$A$1:$G$39,4,FALSE),\"\")","v":""},{"$f":"IFERROR(VLOOKUP($B8,'Cls BG'!$A$1:$G$39,5,FALSE),\"\")","v":""},null,null,5,"NDF 1"]
[null,null,null,null,null,null,{"$f":"IFERROR(VLOOKUP($B9,'Cls BG'!$A$1:$G$39,4,FALSE),\"\")","v":""},{"$f":"IFERROR(VLOOKUP($B9,'Cls BG'!$A$1:$G$39,5,FALSE),\"\")","v":""},null,null,6,"JBS 2"]
[null,null,null,null,null,null,null,null,null,null,7,"NDF 2 (F)"]
{"$rows_left_out":91}
{"sheet":"Cls MG 1","index":4,"n_rows":59,"n_cols":19,"rows_kept":59,"cut":false,"hidden":false,"merged":[[0,0,1,6],[2,3,2,4]]}
["MINIMES DIVISION 1 Phase 1"]
[]
["N° Match","Equipe A","Equipe B","Scores",null,"Vainqueur","Perdant",null,null,"SIGLE","Etablissement","Matchs joués","Victoires","Défaites","Sets Pour","Sets Contre","Différence","Points"]
[1,{"$f":"'Calendrier MG'!N14","v":"STMA 2"},{"$f":"'Calendrier MG'!O14","v":"STMA 3 (F)"},2,0,{"$f":"IF(D4<>\"\",IF(D4>E4,B4,IF(D4<E4,C4,\"nul\")),\"\")","v":"STMA 2"},{"$f":"IF(E4<>\"\",IF(E4<D4,C4,IF(E4>D4,B4,\"nul\")),\"\")","v":"STMA 3 (F)"},null,{"$f":"RANK(S4,$S$4:$S$11)","v":2},"STMA 1","Sainte Thérèse Maison Alfort 1",{"$f":"COUNT(D5,D8,D12,D17,D22,D27,D31,D33,D36,D40,D45,D50,D55,D59)","v":14},{"$f":"COUNTIF($F$3:$F$59,J4)","v":13},{"$f":"COUNTIF($G$3:$G$59,J4)","v":1},{"$f":"SUM(D5,D8,E12,E17,E22,D27,D31,E33,E36,D40,D45,D50,E55,E59)","v":26},{"$f":"SUM(E5,E8,D12,D17,D22,E27,E31,D33,D36,E40,E45,E50,D59,D55)","v":3},{"$f":"O4-P4","v":23},{"$f":"M4*3+N4*1","v":40},{"$f":"SUM(R4*1000000+Q4*10000+O4*100+L4*10)","v":40232740}]
[2,{"$f":"'Calendrier MG'!N15","v":"STMA 1"},{"$f":"'Calendrier MG'!O15","v":"NDF 1"},2,0,{"$f":"IF(D5<>\"\",IF(D5>E5,B5,IF(D5<E5,C5,\"nul\")),\"\")","v":"STMA 1"},{"$f":"IF(E5<>\"\",IF(E5<D5,C5,IF(E5>D5,B5,\"nul\")),\"\")","v":"NDF 1"},null,{"$f":"RANK(S5,$S$4:$S$11)","v":6},"STMA 2","Sainte Thérèse Maison Alfort 2",{"$f":"COUNT(D4,D8,D13,D16,D20,D25,D30,D32,D36,D41,D44,D48,D53,D58)","v":14},{"$f":"COUNTIF($F$3:$F$59,J5)","v":4},{"$f":"COUNTIF($G$3:$G$59,J5)","v":10},{"$f":"SUM(D4,E8,E13,E16,D20,D25,E30,E32,D36,D41,D44,E48,E53,D58)","v":12},{"$f":"SUM(E4,D8,D13,D16,E20,E25,D30,D32,E36,E41,E44,D48,E58,D53)","v":22},{"$f":"O5-P5","v":-10},{"$f":"M5*3+N5*1","v":22},21901340]
[3,{"$f":"'Calendrier MG'!N16","v":"NDF 2 (F)"},{"$f":"'Calendrier MG'!O16","v":"JBS 1"},1,2,"JBS 1","NDF 2 (F)",null,7,"STMA 3 (F)","Sainte Thérèse Maison Alfort 3",{"$f":"COUNT(D4,D9,D14,D19,D23,D26,D31,D32,D37,D42,D47,D51,D54,D59)","v":14},3,11,{"$f":"SUM(E4,D9,E14,D19,D23,D26,E31,D32,E37,D42,E47,E51,E54,D59)","v":8},{"$f":"SUM(D4,E9,D14,E19,E23,E26,D31,E32,D37,E42,D47,D51,E59,D54)","v":23},-15,20,19850940]
[4,{"$f":"'Calendrier MG'!N17","v":"JBS 2"},{"$f":"'Calendrier MG'!O17","v":"SVI"},2,0,"JBS 2","SVI",null,1,"JBS 1","Jean Baptiste la Salle Saint Denis 1",{"$f":"COUNT(D6,D9,D12,D16,D21,D24,D28,D34,D37,D40,D44,D49,D52,D56)","v":14},13,1,{"$f":"SUM(E6,E9,D12,D16,E21,D24,D28,D34,D37,E40,E44,D49,E52,E56)","v":27},{"$f":"SUM(D6,D9,E12,E16,D21,E24,E28,E34,E37,D44,E49,D52,D40,D56)","v":3},24,40,40242840]
[5,{"$f":"'Calendrier MG'!N18","v":"STMA 1"},{"$f":"'Calendrier MG'!O18","v":"STMA 2"},2,0,"STMA 1","STMA 2",null,3,"NDF 1","Notre Dame de France 1",{"$f":"COUNT(D5,D10,D13,D18,D21,D26,D29,D33,D38,D41,D46,D49,D54,D57)","v":14},8,6,{"$f":"SUM(E5,D10,D13,E18,D21,E26,E29,D33,E38,E41,D46,E49,D54,D57)","v":16},{"$f":"SUM(D5,E10,E13,D18,E21,D26,D29,E33,D38,D41,E46,D49,E57,E54)","v":16},0,30,30001740]
[6,{"$f":"'Calendrier MG'!N19","v":"STMA 3 (F)"},{"$f":"'Calendrier MG'!O19","v":"JBS 1"},0,2,"JBS 1","STMA 3 (F)",null,8,"JBS 2 (F)","Jean Baptiste la Salle Saint Denis 2",{"$f":"COUNT(D7,D10,D15,D19,D22,D25,D28,D35,D38,D43,D47,D50,D53,D56)","v":14},0,0,{"$f":"SUM(D7,E10,D15,E19,D22,E25,E28,E35,D38,E43,D47,E50,D56,D53)","v":8},{"$f":"SUM(E7,D10,E15,D19,E22,D25,D28,D35,E38,D43,E47,D50,E56,E53)","v":22},-14,0,-139060]
[7,{"$f":"'Calendrier MG'!N20","v":"NDF 1"},{"$f":"'Calendrier MG'!O20","v":"JBS 2"},2,0,"NDF 1","JBS 2",null,4,"NDF 2 (F)","Notre Dame de France 2",{"$f":"COUNT(D6,D11,D15,D18,D23,D27,D30,D34,D39,D43,D46,D51,D55,D58)","v":14},7,7,{"$f":"SUM(D6,E11,E15,D18,E23,E27,D30,E34,D39,D43,E46,D51,D55,E58)","v":17},{"$f":"SUM(E6,D11,D15,E18,D23,D27,D34,E43,D46,E58,E51,E55,E30,E39)","v":13},{"$f":"O10-P10","v":4},{"$f":"M10*3+N10*1","v":28},28041840]
{"$rows_left_out":50}
{"sheet":"Classements","index":5,"n_rows":28,"n_cols":10,"rows_kept":28,"cut":false,"hidden":false,"merged":[[0,0,1,9],[2,0,2,2],[16,0,17,9],[18,0,18,2]]}
["CLASSEMENT PROMO BENJAMINS 2021-2022"]
[]
["DIVISION 1"]
["Classement","SIGLE","Etablissement","Matchs joués","Victoires","Défaites","Sets Pour","Sets Contre","Différence","Points"]
[1,{"$f":"'Cls BG'!J17","v":"JBS 1"},{"$f":"'Cls BG'!K17","v":"Jean Baptiste de la Salle 1"},{"$f":"'Cls BG'!L17","v":9},{"$f":"'Cls BG'!M17","v":9},{"$f":"'Cls BG'!N17","v":0},{"$f":"'Cls BG'!O17","v":18},{"$f":"'Cls BG'!P17","v":2},{"$f":"'Cls BG'!Q17","v":16},{"$f":"'Cls BG'!R17","v":27}]
[2,{"$f":"'Cls BG'!J18","v":"NDF 1"},{"$f":"'Cls BG'!K18","v":"Notre Dame de France 1"},{"$f":"'Cls BG'!L18","v":9},{"$f":"'Cls BG'!M18","v":7},{"$f":"'Cls BG'!N18","v":2},{"$f":"'Cls BG'!O18","v":16},{"$f":"'Cls BG'!P18","v":5},{"$f":"'Cls BG'!Q18","v":11},{"$f":"'Cls BG'!R18","v":23}]
[3,{"$f":"'Cls BG'!J19","v":"STMA 1"},{"$f":"'Cls BG'!K19","v":"Sainte Thérèse Maison Alfort 1"},{"$f":"'Cls BG'!L19","v":9},{"$f":"'Cls BG'!M19","v":7},{"$f":"'Cls BG'!N19","v":2},{"$f":"'Cls BG'!O19","v":15},{"$f":"'Cls BG'!P19","v":6},{"$f":"'Cls BG'!Q19","v":9},{"$f":"'Cls BG'!R19","v":23}]
[4,"SVI 1","Saint Vincent 1",9,7,2,15,6,9,23]
[5,{"$f":"'Cls BG'!J21","v":"NDF 2 (F)"},{"$f":"'Cls BG'!K21","v":"Notre Dame de France 2"},{"$f":"'Cls BG'!L21","v":9},{"$f":"'Cls BG'!M21","v":5},{"$f":"'Cls BG'!N21","v":4},{"$f":"'Cls BG'!O21","v":8},{"$f":"'Cls BG'!P21","v":11},{"$f":"'Cls BG'!Q21","v":-3},{"$f":"'Cls BG'!R21","v":19}]
[6,{"$f":"'Cls BG'!J22","v":"STMA 2"},{"$f":"'Cls BG'!K22","v":"Sainte Thérèse Maison Alfort 2"},{"$f":"'Cls BG'!L22","v":9},{"$f":"'Cls BG'!M22","v":4},{"$f":"'Cls BG'!N22","v":5},{"$f":"'Cls BG'!O22","v":10},{"$f":"'Cls BG'!P22","v":12},{"$f":"'Cls BG'!Q22","v":-2},{"$f":"'Cls BG'!R22","v":17}]
{"$rows_left_out":19}
{"sheet":"Indispos profs","index":6,"n_rows":9,"n_cols":7,"rows_kept":9,"cut":false,"hidden":false,"merged":[[0,0,0,10],[1,1,1,5],[1,6,1,10]]}
["DATES D'INDISPONIBILITES DES ETABLISSEMENTS"]
["SIGLES","Benjamins",null,null,null,null,"Minimes"]
["STMA"]
["AM"]
["GSMV"]
["SVI"]
["JBS"]
["SCN"]
["NDF"]

{"sheet":"Listing profs","index":7,"n_rows":8,"n_cols":5,"rows_kept":8,"cut":false,"hidden":false,"merged":[[8,2,9,2],[6,1,7,1],[6,0,7,0],[0,0,0,4]]}
["LISTING PROFESSEUR VOLLEY-BALL 2021-2022"]
["NOM D'ETABLISSEMENT","SIGLE","NOM et PRENOM","N° MOBILE","MAIL "]
["JEAN-BAPTISTE DE LA SALLE","JBS","JAEGLE Thomas","06 60 92 14 09","thomas.jaegle@lasallesaintdenis.com"]
["NOTRE DAME DE France","NDF","BONNIN Dimitri","06 09 91 28 54","dimitri.bonnin@gmail.com"]
["ST VINCENT","SVI","ESCOBAR Claudio","06 48 17 62 43","claudioescorp@gmail.com"]
["ALBERT DE MUN","AM","DRIEU Yolaine","06 60 72 98 51","yolainedrieu@hotmail.fr"]
["SAINTE THERESE MAISON ALFORT","STMA","RILAT Olivier","06 01 94 50 10","orilat@yahoo.fr"]
[null,null,"MEYNIEL Serge","06 01 81 99 64","sergemeyniel65@gmail.com"]

{"sheet":"Installations","index":8,"n_rows":6,"n_cols":5,"rows_kept":6,"cut":false,"hidden":false,"merged":[[0,0,0,4]]}
["INSTALLATIONS VOLLEY-BALL 2021/2022"]
["NOM DU TERRAIN","COORDONNEES","MOYENS D'ACCES","HORAIRES","TERRAINS"]
[]
["JEAN BAPTISTE DE LA SALLE","6/8 place de la Résistance 93200 Saint-Denis","Métro 13 Saint Denis Porte de Paris","13h30-16h30","2 terrains couverts"]
["ST VINCENT","151 rue des poissonniers 75018 Paris","Métro Porte de la Chapelle, Porte de Clignancourt, station tram T3 b :Diana Arbus ","13h30-16h30","2 terrains couverts"]
["SAINTE THERESE MAISON-ALFORT","13 rue Pierre Semard 94700 Maisons-Alfort (code petite porte en métal gris 0143) ","RER D Maison-Alfort/Alfortville ou Métro 8 Maison-Alfort Stade","14h30-17h30","3 terrains couverts"]