{"text_format":"1","workbook":"xlsx","n_sheets":14,"sheets":["Calendrier général","Calendrier BG","Cls B1","Cls B2 et B3","Calendrier MG","Cls MG","Calendriers CG et JG","Cls CG et JG","Classements","Coupe BG","Coupe MG","Indispos profs","Listing profs","Installations"],"not_rendered":{"charts":0,"images":0,"macros":0,"external_links":0,"defined_names":1,"comments":0,"pivot_tables":0},"unopened":[],"bounds":{"document_bytes":16777216,"sheet_cells":100000,"rows_first":2000,"rows_last":500,"rows_between":2000,"halvings":0,"cell_chars":16384,"cell_head_chars":4096},"cells_cut":0,"cells_raw":0,"read":"whole","date_system":"1900"}

{"sheet":"Calendrier général","index":0,"n_rows":111,"n_cols":19,"rows_kept":111,"cut":false,"hidden":false,"merged":[[85,18,90,18],[69,1,69,8],[74,0,90,0],[74,1,74,8],[81,1,81,8],[86,1,86,8],[57,10,69,10],[84,10,90,10],[25,0,42,0],[25,1,25,8],[35,1,35,8],[39,1,39,8],[84,11,84,18],[25,11,25,18],[25,10,36,10],[0,1,0,8],[1,6,1,7],[0,11,0,18],[1,16,1,17],[21,1,21,8],[2,10,10,10],[2,11,2,18],[3,11,10,18],[11,10,20,10],[11,11,11,18],[2,0,7,0],[2,1,2,8],[3,1,7,8],[8,0,24,0],[8,1,8,8],[17,1,17,8],[91,0,96,0],[91,1,96,8],[97,0,102,0],[97,1,102,8],[43,11,43,18],[43,0,56,0],[43,1,43,8],[47,1,47,8],[52,1,52,8],[43,10,55,10],[57,11,57,18],[74,10,83,10],[74,11,74,18],[57,0,73,0],[57,1,57,8],[62,1,62,8],[110,10,115,10],[110,11,115,18],[91,10,97,10],[91,11,91,18],[98,10,103,10],[98,11,103,18],[104,10,109,10],[104,11,109,18]]}
[null," CALENDRIER BENJAMINS",null,null,null,null,null,null,null,null,null," CALENDRIER MINIMES"]
["Date","Match","Equipe A","Equipe B","Lieux","Horaires","Résultats",null,"Indisponibilités",null,"Date","Match","Equipe A","Equipe B","Lieux","Horaires","Résultats",null,"Indisponibilités"]
["2022-03-09","DIVISION 1",null,null,null,null,null,null,null,null,"2022-03-09","DIVISION 1"]
[null,"ENTRAINEMENT",null,null,null,null,null,null,null,null,null,"ENTRAINEMENT"]
[]
[]
[]
[]
["2022-03-16","DIVISION 1"]
[null,55,{"$f":"'Calendrier BG'!C10","v":"SJL 1"},{"$f":"'Calendrier BG'!D10","v":"MASS 2"},"SJL TA","14h20",{"$f":"'Calendrier BG'!G10","v":10},{"$f":"'Calendrier BG'!H10","v":0}]
[null,46,{"$f":"'Calendrier BG'!C11","v":"SJL 2"},{"$f":"'Calendrier BG'!D11","v":"MASS 1"},"SJL TB","14h20",{"$f":"'Calendrier BG'!G11","v":1},{"$f":"'Calendrier BG'!H11","v":6}]
[null,38,{"$f":"'Calendrier BG'!C12","v":"MASS 1"},{"$f":"'Calendrier BG'!D12","v":"SJL 1"},"SJL TA","14h40",{"$f":"'Calendrier BG'!G12","v":0},{"$f":"'Calendrier BG'!H12","v":4},null,null,"2022-03-16","DIVISION 1"]
[null,58,{"$f":"'Calendrier BG'!C13","v":"MASS 2"},{"$f":"'Calendrier BG'!D13","v":"SJL 2"},"SJL TB","14h40",{"$f":"'Calendrier BG'!G13","v":1},{"$f":"'Calendrier BG'!H13","v":4},null,null,null,32,{"$f":"'Calendrier MG'!C13","v":"STAN 2"},{"$f":"'Calendrier MG'!D13","v":"ASVP"},"La Courneuve T3 A","14h20",{"$f":"'Calendrier MG'!G13","v":3},{"$f":"'Calendrier MG'!H13","v":1}]
[null,67,{"$f":"'Calendrier BG'!C14","v":"ROC 1"},{"$f":"'Calendrier BG'!D14","v":"STAN 1"},"La Courneuve T5 B","14h20",{"$f":"'Calendrier BG'!G14","v":0},{"$f":"'Calendrier BG'!H14","v":2},null,null,null,37,{"$f":"'Calendrier MG'!C14","v":"SANO"},{"$f":"'Calendrier MG'!D14","v":"ROC "},"La Courneuve T3 A","14h40",{"$f":"'Calendrier MG'!G14","v":6},{"$f":"'Calendrier MG'!H14","v":0}]
[null,39,{"$f":"'Calendrier BG'!C15","v":"STAN 2"},{"$f":"'Calendrier BG'!D15","v":"FEN 1"},"La Courneuve T5 B","14h40",{"$f":"'Calendrier BG'!G15","v":2},{"$f":"'Calendrier BG'!H15","v":5},null,null,null,54,{"$f":"'Calendrier MG'!C15","v":"ASVP"},{"$f":"'Calendrier MG'!D15","v":"STAN 3"},"La Courneuve T3 A","15h",{"$f":"'Calendrier MG'!G15","v":1},{"$f":"'Calendrier MG'!H15","v":2}]
[null,56,{"$f":"'Calendrier BG'!C16","v":"FEN 1"},{"$f":"'Calendrier BG'!D16","v":"STAN 1"},"La Courneuve T5 B","15h",{"$f":"'Calendrier BG'!G16","v":0},{"$f":"'Calendrier BG'!H16","v":0},null,null,null,55,{"$f":"'Calendrier MG'!C16","v":"ROC "},{"$f":"'Calendrier MG'!D16","v":"STAN 3"},"La Courneuve T3 A","15h20",{"$f":"'Calendrier MG'!G16","v":0},{"$f":"'Calendrier MG'!H16","v":1}]
[null,68,{"$f":"'Calendrier BG'!C17","v":"ROC 1"},{"$f":"'Calendrier BG'!D17","v":"STAN 2"},"La Courneuve T5 B","15h20",{"$f":"'Calendrier BG'!G17","v":1},{"$f":"'Calendrier BG'!H17","v":1},null,null,null,75,{"$f":"'Calendrier MG'!C17","v":"SANO"},{"$f":"'Calendrier MG'!D17","v":"STAN 2"},"La Courneuve T3 A","15h40",{"$f":"'Calendrier MG'!G17","v":2},{"$f":"'Calendrier MG'!H17","v":4}]
[null,"DIVISION 2 ",null,null,null,null,null,null,null,null,null,92,{"$f":"'Calendrier MG'!C18","v":"MASS 1"},{"$f":"'Calendrier MG'!D18","v":"FEN 2"},"La Courneuve T6 A","14h20",{"$f":"'Calendrier MG'!G18","v":6},{"$f":"'Calendrier MG'!H18","v":0}]
[null,115,{"$f":"'Calendrier BG'!C19","v":"SJL 3"},{"$f":"'Calendrier BG'!D19","v":"SANO"},"La Courneuve T5 A","14h20",{"$f":"'Calendrier BG'!G19","v":0},{"$f":"'Calendrier BG'!H19","v":2},null,null,null,78,{"$f":"'Calendrier MG'!C19","v":"FEN 1"},{"$f":"'Calendrier MG'!D19","v":"MASS 2"},"La Courneuve T6 A","14h40",{"$f":"'Calendrier MG'!G19","v":4},{"$f":"'Calendrier MG'!H19","v":4}]
[null,120,{"$f":"'Calendrier BG'!C20","v":"FEN 2"},{"$f":"'Calendrier BG'!D20","v":"SANO"},"La Courneuve T5 A","14h40",{"$f":"'Calendrier BG'!G20","v":1},{"$f":"'Calendrier BG'!H20","v":0},null,null,null,81,{"$f":"'Calendrier MG'!C20","v":"MASS 1"},{"$f":"'Calendrier MG'!D20","v":"FEN 1"},"La Courneuve T6 A","15h",{"$f":"'Calendrier MG'!G20","v":2},{"$f":"'Calendrier MG'!H20","v":2}]
[null,117,{"$f":"'Calendrier BG'!C21","v":"SJL 3"},{"$f":"'Calendrier BG'!D21","v":"FEN 2"},"La Courneuve T5 A","15h",{"$f":"'Calendrier BG'!G21","v":0},{"$f":"'Calendrier BG'!H21","v":4},null,null,null,70,{"$f":"'Calendrier MG'!C21","v":"FEN 2"},{"$f":"'Calendrier MG'!D21","v":"MASS 2"},"La Courneuve T6 A","15h20",{"$f":"'Calendrier MG'!G21","v":2},{"$f":"'Calendrier MG'!H21","v":3}]
[null,"DIVISION 3"]
[null,136,{"$f":"'Calendrier BG'!C23","v":"ASVP"},{"$f":"'Calendrier BG'!D23","v":"FEN 3"},"La Courneuve T6 B","14h20",{"$f":"'Calendrier BG'!G23","v":3},{"$f":"'Calendrier BG'!H23","v":0}]
[null,141,{"$f":"'Calendrier BG'!C24","v":"FEN 3"},{"$f":"'Calendrier BG'!D24","v":"ROC 2"},"La Courneuve T6 B","14h40",{"$f":"'Calendrier BG'!G24","v":0},{"$f":"'Calendrier BG'!H24","v":2}]
[null,139,{"$f":"'Calendrier BG'!C25","v":"ASVP"},{"$f":"'Calendrier BG'!D25","v":"ROC 2"},"La Courneuve T6 B","15h",{"$f":"'Calendrier BG'!G25","v":3},{"$f":"'Calendrier BG'!H25","v":2}]
["2022-03-23","DIVISION 1",null,null,null,null,null,null,null,null,"2022-03-23","DIVISION 1"]
[null,48,{"$f":"'Calendrier BG'!C27","v":"FEN 1"},{"$f":"'Calendrier BG'!D27","v":"MASS 2"},"La Courneuve T3A","14h",{"$f":"'Calendrier BG'!G27","v":2},{"$f":"'Calendrier BG'!H27","v":0},"SANO",null,null,69,{"$f":"'Calendrier MG'!C23","v":"STAN 2"},{"$f":"'Calendrier MG'!D23","v":"FEN 1"},"La Courneuve T6 A","14h",{"$f":"'Calendrier MG'!G23","v":0},{"$f":"'Calendrier MG'!H23","v":1},"SANO"]
[null,33,{"$f":"'Calendrier BG'!C28","v":"MASS 1"},{"$f":"'Calendrier BG'!D28","v":"ROC 1"},"La Courneuve T3A","14h20",{"$f":"'Calendrier BG'!G28","v":0},{"$f":"'Calendrier BG'!H28","v":0},null,null,null,77,{"$f":"'Calendrier MG'!C24","v":"STAN 1"},{"$f":"'Calendrier MG'!D24","v":"FEN 2"},"La Courneuve T6 B","14h",{"$f":"'Calendrier MG'!G24","v":3},{"$f":"'Calendrier MG'!H24","v":0}]
[null,34,{"$f":"'Calendrier BG'!C29","v":"MASS 2"},{"$f":"'Calendrier BG'!D29","v":"ROC 1"},"La Courneuve T3A","14h40",{"$f":"'Calendrier BG'!G29","v":0},{"$f":"'Calendrier BG'!H29","v":1},null,null,null,107,{"$f":"'Calendrier MG'!C25","v":"ROC "},{"$f":"'Calendrier MG'!D25","v":"MASS 1"},"La Courneuve T6 A","14h20",{"$f":"'Calendrier MG'!G25","v":0},{"$f":"'Calendrier MG'!H25","v":3}]
[null,51,{"$f":"'Calendrier BG'!C30","v":"MASS 1"},{"$f":"'Calendrier BG'!D30","v":"FEN 1"},"La Courneuve T3A","15h",{"$f":"'Calendrier BG'!G30","v":5},{"$f":"'Calendrier BG'!H30","v":1},null,null,null,88,{"$f":"'Calendrier MG'!C26","v":"MASS 2"},{"$f":"'Calendrier MG'!D26","v":"BND"},"La Courneuve T6 B","14h20",{"$f":"'Calendrier MG'!G26","v":3},{"$f":"'Calendrier MG'!H26","v":1}]
[null,43,{"$f":"'Calendrier BG'!C31","v":"MASS 2"},{"$f":"'Calendrier BG'!D31","v":"MASS 1"},"La Courneuve T3A","15h20",{"$f":"'Calendrier BG'!G31","v":0},{"$f":"'Calendrier BG'!H31","v":3},null,null,null,100,{"$f":"'Calendrier MG'!C27","v":"ASVP"},{"$f":"'Calendrier MG'!D27","v":"MASS 2"},"La Courneuve T6 A","14h40",{"$f":"'Calendrier MG'!G27","v":0},{"$f":"'Calendrier MG'!H27","v":2}]
[null,45,{"$f":"'Calendrier BG'!C32","v":"SJL 1"},{"$f":"'Calendrier BG'!D32","v":"STAN 2"},"SJL TA","14h20",{"$f":"'Calendrier BG'!G32","v":5},{"$f":"'Calendrier BG'!H32","v":1},null,null,null,76,{"$f":"'Calendrier MG'!C28","v":"BND"},{"$f":"'Calendrier MG'!D28","v":"MASS 1"},"La Courneuve T6 B","14h40",{"$f":"'Calendrier MG'!G28","v":0},{"$f":"'Calendrier MG'!H28","v":4}]
[null,53,{"$f":"'Calendrier BG'!C33","v":"JBS 1"},{"$f":"'Calendrier BG'!D33","v":"SJL 2"},"SJL TB","14h20",{"$f":"'Calendrier BG'!G33","v":3},{"$f":"'Calendrier BG'!H33","v":1},null,null,null,119,{"$f":"'Calendrier MG'!C29","v":"STAN 3"},{"$f":"'Calendrier MG'!D29","v":"FEN 2"},"La Courneuve T6 A","15h",{"$f":"'Calendrier MG'!G29","v":1},{"$f":"'Calendrier MG'!H29","v":1}]
[null,50,{"$f":"'Calendrier BG'!C34","v":"SJL 1"},{"$f":"'Calendrier BG'!D34","v":"JBS 1"},"SJL TA","14h40",{"$f":"'Calendrier BG'!G34","v":4},{"$f":"'Calendrier BG'!H34","v":1},null,null,null,118,{"$f":"'Calendrier MG'!C30","v":"STAN 3"},{"$f":"'Calendrier MG'!D30","v":"FEN 1"},"La Courneuve T6 B","15h",{"$f":"'Calendrier MG'!G30","v":0},{"$f":"'Calendrier MG'!H30","v":3}]
[null,49,{"$f":"'Calendrier BG'!C35","v":"SJL 2"},{"$f":"'Calendrier BG'!D35","v":"STAN 2"},"SJL TB","14h40",{"$f":"'Calendrier BG'!G35","v":1},{"$f":"'Calendrier BG'!H35","v":0},null,null,null,108,{"$f":"'Calendrier MG'!C31","v":"ROC "},{"$f":"'Calendrier MG'!D31","v":"MASS 2"},"La Courneuve T6 A","15h20",{"$f":"'Calendrier MG'!G31","v":0},{"$f":"'Calendrier MG'!H31","v":3}]
[null,"DIVISION 2 ",null,null,null,null,null,null,null,null,null,99,{"$f":"'Calendrier MG'!C32","v":"ASVP"},{"$f":"'Calendrier MG'!D32","v":"MASS 1"},"La Courneuve T6 B","15h20",{"$f":"'Calendrier MG'!G32","v":0},{"$f":"'Calendrier MG'!H32","v":3}]
[null,114,{"$f":"'Calendrier BG'!C37","v":"BND"},{"$f":"'Calendrier BG'!D37","v":"FEN 2"},"La Courneuve T5A","14h20",{"$f":"'Calendrier BG'!G37","v":0},{"$f":"'Calendrier BG'!H37","v":2},null,null,null,72,{"$f":"'Calendrier MG'!C33","v":"STAN 2"},{"$f":"'Calendrier MG'!D33","v":"STAN 1"},"La Courneuve T6 B","15h40",{"$f":"'Calendrier MG'!G33","v":1},{"$f":"'Calendrier MG'!H33","v":0}]
[null,116,{"$f":"'Calendrier BG'!C38","v":"STAN 3"},{"$f":"'Calendrier BG'!D38","v":"BND"},"La Courneuve T5A","14h40",{"$f":"'Calendrier BG'!G38","v":0},{"$f":"'Calendrier BG'!H38","v":3}]
[null,122,{"$f":"'Calendrier BG'!C39","v":"FEN 2"},{"$f":"'Calendrier BG'!D39","v":"STAN 3"},"La Courneuve T5A","15h",{"$f":"'Calendrier BG'!G39","v":4},{"$f":"'Calendrier BG'!H39","v":1}]
[null,"DIVISION 3"]
[null,134,{"$f":"'Calendrier BG'!C41","v":"ROC 2"},{"$f":"'Calendrier BG'!D41","v":"FEN 3"},"La Courneuve T5B","14h20",{"$f":"'Calendrier BG'!G41","v":0},{"$f":"'Calendrier BG'!H41","v":3}]
[null,138,{"$f":"'Calendrier BG'!C42","v":"STAN 4"},{"$f":"'Calendrier BG'!D42","v":"FEN 3"},"La Courneuve T5B","14h40",{"$f":"'Calendrier BG'!G42","v":0},{"$f":"'Calendrier BG'!H42","v":3}]
[null,140,{"$f":"'Calendrier BG'!C43","v":"ROC 2"},{"$f":"'Calendrier BG'!D43","v":"STAN 4"},"La Courneuve T5B","15h",{"$f":"'Calendrier BG'!G43","v":3},{"$f":"'Calendrier BG'!H43","v":0}]
["2022-03-30","DIVISION 1",null,null,null,null,null,null,null,null,"2022-03-30","DIVISION 1"]
[null,null,null,null,null,null,{"$f":"IFERROR(VLOOKUP($B45,'Cls B1'!$A$1:$G$75,4,FALSE),\"\")","v":""},{"$f":"IFERROR(VLOOKUP($B45,'Cls B1'!$A$1:$G$75,5,FALSE),\"\")","v":""},"MASS",null,null,74,{"$f":"'Calendrier MG'!C35","v":"FEN 1"},{"$f":"'Calendrier MG'!D35","v":"FEN 2"},"La Courneuve T3 A","14h",{"$f":"'Calendrier MG'!G35","v":3},{"$f":"'Calendrier MG'!H35","v":0},"MASS"]
[null,null,null,null,null,null,{"$f":"IFERROR(VLOOKUP($B46,'Cls B1'!$A$1:$G$75,4,FALSE),\"\")","v":""},{"$f":"IFERROR(VLOOKUP($B46,'Cls B1'!$A$1:$G$75,5,FALSE),\"\")","v":""},"STAN 1 seul prof",null,null,80,{"$f":"'Calendrier MG'!C36","v":"SANO"},{"$f":"'Calendrier MG'!D36","v":"FEN 2"},"La Courneuve T3 A","14h20",{"$f":"'Calendrier MG'!G36","v":3},{"$f":"'Calendrier MG'!H36","v":0},"STAN 1 seul prof"]
[null,null,null,null,null,null,{"$f":"IFERROR(VLOOKUP($B47,'Cls B1'!$A$1:$G$75,4,FALSE),\"\")","v":""},{"$f":"IFERROR(VLOOKUP($B47,'Cls B1'!$A$1:$G$75,5,FALSE),\"\")","v":""},null,null,null,67,{"$f":"'Calendrier MG'!C37","v":"STAN 1"},{"$f":"'Calendrier MG'!D37","v":"BND"},"La Courneuve T3 A","14h40",{"$f":"'Calendrier MG'!G37","v":4},{"$f":"'Calendrier MG'!H37","v":0}]
[null,"DIVISION 2 ",null,null,null,null,null,null,null,null,null,71,{"$f":"'Calendrier MG'!C38","v":"BND"},{"$f":"'Calendrier MG'!D38","v":"SANO"},"La Courneuve T3 A","15h",{"$f":"'Calendrier MG'!G38","v":0},{"$f":"'Calendrier MG'!H38","v":0}]
[null,113,{"$f":"'Calendrier BG'!C53","v":"SANO"},{"$f":"'Calendrier BG'!D53","v":"STAN 3"},"La Courneuve T5A","14h20",{"$f":"'Calendrier BG'!G53","v":7},{"$f":"'Calendrier BG'!H53","v":1},null,null,null,86,{"$f":"'Calendrier MG'!C39","v":"FEN 1"},{"$f":"'Calendrier MG'!D39","v":"STAN 1"},"La Courneuve T3 A","15h20",{"$f":"'Calendrier MG'!G39","v":0},{"$f":"'Calendrier MG'!H39","v":0}]
[null,121,{"$f":"'Calendrier BG'!C54","v":"BND"},{"$f":"'Calendrier BG'!D54","v":"SJL 3"},"La Courneuve T5A","14h20",{"$f":"'Calendrier BG'!G54","v":0},{"$f":"'Calendrier BG'!H54","v":0}]
[null,119,{"$f":"'Calendrier BG'!C55","v":"STAN 3"},{"$f":"'Calendrier BG'!D55","v":"SJL 3"},"La Courneuve T5A","14h40",{"$f":"'Calendrier BG'!G55","v":1},{"$f":"'Calendrier BG'!H55","v":0}]
[null,118,{"$f":"'Calendrier BG'!C56","v":"SANO"},{"$f":"'Calendrier BG'!D56","v":"BND"},"La Courneuve T5A","14h40",{"$f":"'Calendrier BG'!G56","v":2},{"$f":"'Calendrier BG'!H56","v":1}]
[null,"DIVISION 3"]
[null,137,{"$f":"'Calendrier BG'!C58","v":"ROC 2"},{"$f":"'Calendrier BG'!D58","v":"JBS 2"},"La Courneuve T5B","14h20",{"$f":"'Calendrier BG'!G58","v":2},{"$f":"'Calendrier BG'!H58","v":4}]
[null,146,{"$f":"'Calendrier BG'!C59","v":"FEN 3"},{"$f":"'Calendrier BG'!D59","v":"ASVP"},"La Courneuve T5B","14h20",{"$f":"'Calendrier BG'!G59","v":0},{"$f":"'Calendrier BG'!H59","v":3}]
[null,149,{"$f":"'Calendrier BG'!C60","v":"ROC 2"},{"$f":"'Calendrier BG'!D60","v":"ASVP"},"La Courneuve T5B","14h40",{"$f":"'Calendrier BG'!G60","v":3},{"$f":"'Calendrier BG'!H60","v":2}]
[null,144,{"$f":"'Calendrier BG'!C61","v":"JBS 2"},{"$f":"'Calendrier BG'!D61","v":"FEN 3"},"La Courneuve T5B","14h40",{"$f":"'Calendrier BG'!G61","v":0},{"$f":"'Calendrier BG'!H61","v":2}]
["2022-04-06","DIVISION 1",null,null,null,null,null,null,null,null,"2022-04-06","DIVISION 1"]
[null,null,null,null,null,null,{"$f":"IFERROR(VLOOKUP($B59,'Cls B1'!$A$1:$G$75,4,FALSE),\"\")","v":""},{"$f":"IFERROR(VLOOKUP($B59,'Cls B1'!$A$1:$G$75,5,FALSE),\"\")","v":""},"MASS",null,null,87,{"$f":"'Calendrier MG'!C48","v":"FEN 2"},{"$f":"'Calendrier MG'!D48","v":"STAN 2"},"La Courneuve T6 A","14h",{"$f":"'Calendrier MG'!G48","v":0},{"$f":"'Calendrier MG'!H48","v":3},"MASS"]
[null,null,null,null,null,null,{"$f":"IFERROR(VLOOKUP($B60,'Cls B1'!$A$1:$G$75,4,FALSE),\"\")","v":""},{"$f":"IFERROR(VLOOKUP($B60,'Cls B1'!$A$1:$G$75,5,FALSE),\"\")","v":""},null,null,null,114,{"$f":"'Calendrier MG'!C49","v":"STAN 3"},{"$f":"'Calendrier MG'!D49","v":"STAN 1"},"La Courneuve T6 B","14h",{"$f":"'Calendrier MG'!G49","v":1},{"$f":"'Calendrier MG'!H49","v":3}]
[null,null,null,null,null,null,{"$f":"IFERROR(VLOOKUP($B61,'Cls B1'!$A$1:$G$75,4,FALSE),\"\")","v":""},{"$f":"IFERROR(VLOOKUP($B61,'Cls B1'!$A$1:$G$75,5,FALSE),\"\")","v":""},null,null,null,103,{"$f":"'Calendrier MG'!C50","v":"ROC "},{"$f":"'Calendrier MG'!D50","v":"SANO"},"La Courneuve T6 A","14h20",{"$f":"'Calendrier MG'!G50","v":0},{"$f":"'Calendrier MG'!H50","v":4}]
[null,null,null,null,null,null,{"$f":"IFERROR(VLOOKUP($B62,'Cls B1'!$A$1:$G$75,4,FALSE),\"\")","v":""},{"$f":"IFERROR(VLOOKUP($B62,'Cls B1'!$A$1:$G$75,5,FALSE),\"\")","v":""},null,null,null,83,{"$f":"'Calendrier MG'!C51","v":"FEN 2"},{"$f":"'Calendrier MG'!D51","v":"BND"},"La Courneuve T6 B","14h20",{"$f":"'Calendrier MG'!G51","v":0},{"$f":"'Calendrier MG'!H51","v":0}]
[null,"DIVISION 2 ",null,null,null,null,null,null,null,null,null,120,{"$f":"'Calendrier MG'!C52","v":"STAN 3"},{"$f":"'Calendrier MG'!D52","v":"ASVP"},"La Courneuve T6 A","14h40",{"$f":"'Calendrier MG'!G52","v":1},{"$f":"'Calendrier MG'!H52","v":1}]
[null,130,{"$f":"'Calendrier BG'!C68","v":"SANO"},{"$f":"'Calendrier BG'!D68","v":"FEN 2"},"La Courneuve T3A","14h",{"$f":"IFERROR(VLOOKUP($B64,'Cls B2 et B3'!$A$52:$G$74,4,FALSE),\"\")","v":1},{"$f":"IFERROR(VLOOKUP($B64,'Cls B2 et B3'!$A$52:$G$74,5,FALSE),\"\")","v":0},null,null,null,109,{"$f":"'Calendrier MG'!C53","v":"ROC "},{"$f":"'Calendrier MG'!D53","v":"FEN 1"},"La Courneuve T6 B","14h40",{"$f":"'Calendrier MG'!G53","v":1},{"$f":"'Calendrier MG'!H53","v":2}]
[null,127,{"$f":"'Calendrier BG'!C69","v":"FEN 2"},{"$f":"'Calendrier BG'!D69","v":"SJL 3"},"La Courneuve T3A","14h20",{"$f":"IFERROR(VLOOKUP($B65,'Cls B2 et B3'!$A$52:$G$74,4,FALSE),\"\")","v":1},{"$f":"IFERROR(VLOOKUP($B65,'Cls B2 et B3'!$A$52:$G$74,5,FALSE),\"\")","v":0},null,null,null,79,{"$f":"'Calendrier MG'!C54","v":"BND"},{"$f":"'Calendrier MG'!D54","v":"STAN 2"},"La Courneuve T6 A","15h",{"$f":"'Calendrier MG'!G54","v":1},{"$f":"'Calendrier MG'!H54","v":8}]
[null,128,{"$f":"'Calendrier BG'!C70","v":"BND"},{"$f":"'Calendrier BG'!D70","v":"SANO"},"La Courneuve T3A","14h40",{"$f":"IFERROR(VLOOKUP($B66,'Cls B2 et B3'!$A$52:$G$74,4,FALSE),\"\")","v":0},{"$f":"IFERROR(VLOOKUP($B66,'Cls B2 et B3'!$A$52:$G$74,5,FALSE),\"\")","v":4},null,null,null,90,{"$f":"'Calendrier MG'!C55","v":"FEN 1"},{"$f":"'Calendrier MG'!D55","v":"SANO"},"La Courneuve T6 B","15h",{"$f":"'Calendrier MG'!G55","v":0},{"$f":"'Calendrier MG'!H55","v":1}]
[null,129,{"$f":"'Calendrier BG'!C71","v":"SJL 3"},{"$f":"'Calendrier BG'!D71","v":"STAN 3"},"La Courneuve T3A","15h",{"$f":"IFERROR(VLOOKUP($B67,'Cls B2 et B3'!$A$52:$G$74,4,FALSE),\"\")","v":2},{"$f":"IFERROR(VLOOKUP($B67,'Cls B2 et B3'!$A$52:$G$74,5,FALSE),\"\")","v":1},null,null,null,101,{"$f":"'Calendrier MG'!C56","v":"ASVP"},{"$f":"'Calendrier MG'!D56","v":"FEN 1"},null,null,{"$f":"'Calendrier MG'!G56","v":0},{"$f":"'Calendrier MG'!H56","v":3}]
[null,124,{"$f":"'Calendrier BG'!C72","v":"FEN 2"},{"$f":"'Calendrier BG'!D72","v":"BND"},"La Courneuve T3A","15h20",{"$f":"IFERROR(VLOOKUP($B68,'Cls B2 et B3'!$A$52:$G$74,4,FALSE),\"\")","v":2},{"$f":"IFERROR(VLOOKUP($B68,'Cls B2 et B3'!$A$52:$G$74,5,FALSE),\"\")","v":0},null,null,null,93,{"$f":"'Calendrier MG'!C57","v":"BND"},{"$f":"'Calendrier MG'!D57","v":"FEN 1"},null,null,{"$f":"'Calendrier MG'!G57","v":1},{"$f":"'Calendrier MG'!H57","v":1}]
[null,132,{"$f":"'Calendrier BG'!C73","v":"STAN 3"},{"$f":"'Calendrier BG'!D73","v":"FEN 2"},"La Courneuve T3A","15h40",{"$f":"IFERROR(VLOOKUP($B69,'Cls B2 et B3'!$A$52:$G$74,4,FALSE),\"\")","v":0},{"$f":"IFERROR(VLOOKUP($B69,'Cls B2 et B3'!$A$52:$G$74,5,FALSE),\"\")","v":1},null,null,null,113,{"$f":"'Calendrier MG'!C58","v":"STAN 3"},{"$f":"'Calendrier MG'!D58","v":"BND"},null,null,{"$f":"'Calendrier MG'!G58","v":1},{"$f":"'Calendrier MG'!H58","v":0}]
[null,"DIVISION 3",null,null,null,null,null,null,null,null,null,97,{"$f":"'Calendrier MG'!C59","v":"ASVP"},{"$f":"'Calendrier MG'!D59","v":"STAN 1"},"La Courneuve T6 A","15h20",{"$f":"'Calendrier MG'!G59","v":0},{"$f":"'Calendrier MG'!H59","v":4}]
[null,134,{"$f":"'Calendrier BG'!C75","v":"FEN 3"},{"$f":"'Calendrier BG'!D75","v":"JBS 2"},"La Courneuve T5 A","14h",{"$f":"IFERROR(VLOOKUP($B71,'Cls B2 et B3'!$A$77:$G$99,4,FALSE),\"\")","v":1},{"$f":"IFERROR(VLOOKUP($B71,'Cls B2 et B3'!$A$77:$G$99,5,FALSE),\"\")","v":0}]
[null,133,{"$f":"'Calendrier BG'!C76","v":"STAN 4"},{"$f":"'Calendrier BG'!D76","v":"ASVP"},"La Courneuve T5 A","14h20",{"$f":"IFERROR(VLOOKUP($B72,'Cls B2 et B3'!$A$77:$G$99,4,FALSE),\"\")","v":0},{"$f":"IFERROR(VLOOKUP($B72,'Cls B2 et B3'!$A$77:$G$99,5,FALSE),\"\")","v":4}]
[null,140,{"$f":"'Calendrier BG'!C77","v":"JBS 2"},{"$f":"'Calendrier BG'!D77","v":"STAN 4"},"La Courneuve T5 A","14h40",{"$f":"IFERROR(VLOOKUP($B73,'Cls B2 et B3'!$A$77:$G$99,4,FALSE),\"\")","v":3},{"$f":"IFERROR(VLOOKUP($B73,'Cls B2 et B3'!$A$77:$G$99,5,FALSE),\"\")","v":1}]
[null,142,{"$f":"'Calendrier BG'!C78","v":"JBS 2"},{"$f":"'Calendrier BG'!D78","v":"ASVP"},"La Courneuve T5 A","15h",{"$f":"IFERROR(VLOOKUP($B74,'Cls B2 et B3'!$A$77:$G$99,4,FALSE),\"\")","v":4},{"$f":"IFERROR(VLOOKUP($B74,'Cls B2 et B3'!$A$77:$G$99,5,FALSE),\"\")","v":1}]
["2022-04-13","DIVISION 1",null,null,null,null,null,null,null,null,"2022-04-13","DIVISION 1"]
[null,66,{"$f":"'Calendrier BG'!C80","v":"ROC 1"},{"$f":"'Calendrier BG'!D80","v":"SJL 2"},"SJL TA","14h",{"$f":"IFERROR(VLOOKUP($B76,'Cls B1'!$A$1:$G$75,4,FALSE),\"\")","v":0},{"$f":"IFERROR(VLOOKUP($B76,'Cls B1'!$A$1:$G$75,5,FALSE),\"\")","v":0},null,null,null,68,{"$f":"'Calendrier MG'!C61","v":"MASS 1"},{"$f":"'Calendrier MG'!D61","v":"SANO"},"Tremblay MASS TA","14h",{"$f":"'Calendrier MG'!G61","v":2},{"$f":"'Calendrier MG'!H61","v":2}]
[null,62,{"$f":"'Calendrier BG'!C81","v":"MASS 1"},{"$f":"'Calendrier BG'!D81","v":"JBS 1"},"SJL TB","14h",{"$f":"IFERROR(VLOOKUP($B77,'Cls B1'!$A$1:$G$75,4,FALSE),\"\")","v":2},{"$f":"IFERROR(VLOOKUP($B77,'Cls B1'!$A$1:$G$75,5,FALSE),\"\")","v":2},null,null,null,91,{"$f":"'Calendrier MG'!C62","v":"MASS 2"},{"$f":"'Calendrier MG'!D62","v":"STAN 2"},"Tremblay MASS TB","14h",{"$f":"'Calendrier MG'!G62","v":0},{"$f":"'Calendrier MG'!H62","v":4}]
[null,69,{"$f":"'Calendrier BG'!C82","v":"ROC 1"},{"$f":"'Calendrier BG'!D82","v":"MASS 1"},"SJL TA","14h20",{"$f":"IFERROR(VLOOKUP($B78,'Cls B1'!$A$1:$G$75,4,FALSE),\"\")","v":0},{"$f":"IFERROR(VLOOKUP($B78,'Cls B1'!$A$1:$G$75,5,FALSE),\"\")","v":7},null,null,null,89,{"$f":"'Calendrier MG'!C63","v":"MASS 1"},{"$f":"'Calendrier MG'!D63","v":"STAN 1"},"Tremblay MASS TA","14h20",{"$f":"'Calendrier MG'!G63","v":1},{"$f":"'Calendrier MG'!H63","v":0}]
[null,40,{"$f":"'Calendrier BG'!C83","v":"JBS 1"},{"$f":"'Calendrier BG'!D83","v":"MASS 2"},"SJL TB","14h20",{"$f":"IFERROR(VLOOKUP($B79,'Cls B1'!$A$1:$G$75,4,FALSE),\"\")","v":6},{"$f":"IFERROR(VLOOKUP($B79,'Cls B1'!$A$1:$G$75,5,FALSE),\"\")","v":0},null,null,null,94,{"$f":"'Calendrier MG'!C64","v":"STAN 1"},{"$f":"'Calendrier MG'!D64","v":"SANO"},"Tremblay MASS TB","14h20",{"$f":"'Calendrier MG'!G64","v":0},{"$f":"'Calendrier MG'!H64","v":3}]
[null,70,{"$f":"'Calendrier BG'!C84","v":"ROC 1"},{"$f":"'Calendrier BG'!D84","v":"MASS 2"},"SJL TA","14h40",{"$f":"IFERROR(VLOOKUP($B80,'Cls B1'!$A$1:$G$75,4,FALSE),\"\")","v":5},{"$f":"IFERROR(VLOOKUP($B80,'Cls B1'!$A$1:$G$75,5,FALSE),\"\")","v":0},null,null,null,73,{"$f":"'Calendrier MG'!C65","v":"MASS 2"},{"$f":"'Calendrier MG'!D65","v":"MASS 1"},"Tremblay MASS TA","14h40",{"$f":"'Calendrier MG'!G65","v":0},{"$f":"'Calendrier MG'!H65","v":4}]
[null,null,null,null,null,null,{"$f":"IFERROR(VLOOKUP($B81,'Cls B1'!$A$1:$G$75,4,FALSE),\"\")","v":""},{"$f":"IFERROR(VLOOKUP($B81,'Cls B1'!$A$1:$G$75,5,FALSE),\"\")","v":""},null,null,null,112,{"$f":"'Calendrier MG'!C66","v":"STAN 3"},{"$f":"'Calendrier MG'!D66","v":"SANO"},"Tremblay MASS TB","14h40",{"$f":"'Calendrier MG'!G66","v":0},{"$f":"'Calendrier MG'!H66","v":3}]
[null,"DIVISION 2 ",null,null,null,null,null,null,null,null,null,85,{"$f":"'Calendrier MG'!C67","v":"SANO"},{"$f":"'Calendrier MG'!D67","v":"MASS 2"},"Tremblay MASS TA","15h",{"$f":"'Calendrier MG'!G67","v":1},{"$f":"'Calendrier MG'!H67","v":1}]
[null,131,{"$f":"'Calendrier BG'!C87","v":"SJL 3"},{"$f":"'Calendrier BG'!D87","v":"BND"},"Tremblay SANO TB","14h20",{"$f":"'Calendrier BG'!G87","v":3},{"$f":"'Calendrier BG'!H87","v":0},null,null,null,115,{"$f":"'Calendrier MG'!C68","v":"STAN 3"},{"$f":"'Calendrier MG'!D68","v":"STAN 2"},"Tremblay MASS TB","15h",{"$f":"'Calendrier MG'!G68","v":0},{"$f":"'Calendrier MG'!H68","v":3}]
[null,125,{"$f":"'Calendrier BG'!C88","v":"SANO"},{"$f":"'Calendrier BG'!D88","v":"SJL 3"},"Tremblay SANO TA","14h40",{"$f":"'Calendrier BG'!G88","v":6},{"$f":"'Calendrier BG'!H88","v":0}]
[null,null,null,null,null,null,{"$f":"IFERROR(VLOOKUP($B85,'Cls B2 et B3'!$A$1:$G$23,4,FALSE),\"\")","v":""},{"$f":"IFERROR(VLOOKUP($B85,'Cls B2 et B3'!$A$1:$G$23,5,FALSE),\"\")","v":""},null,null,"2022-04-20","DIVISION 1"]
[null,null,null,null,null,null,null,null,null,null,null,null,"MASS 1","FEN 1","Tremblay SANO TA","14h20",{"$f":"IFERROR(VLOOKUP($B86,'Cls MG'!$A$1:$G$135,4,FALSE),\"\")","v":""},{"$f":"IFERROR(VLOOKUP($B86,'Cls MG'!$A$1:$G$135,5,FALSE),\"\")","v":""},"Finales Territoire"]
[null,"DIVISION 3",null,null,null,null,null,null,null,null,null,null,"SANO ","STAN 2","Tremblay SANO TB","14h20",{"$f":"IFERROR(VLOOKUP($B87,'Cls MG'!$A$1:$G$135,4,FALSE),\"\")","v":""},{"$f":"IFERROR(VLOOKUP($B87,'Cls MG'!$A$1:$G$135,5,FALSE),\"\")","v":""}]
[null,null,null,null,null,null,null,null,null,null,null,null,"MASS 1","SANO","Tremblay SANO TA","14h40",{"$f":"IFERROR(VLOOKUP($B88,'Cls MG'!$A$1:$G$135,4,FALSE),\"\")","v":""},{"$f":"IFERROR(VLOOKUP($B88,'Cls MG'!$A$1:$G$135,5,FALSE),\"\")","v":""}]
[null,null,null,null,null,null,null,null,null,null,null,null,"FEN 1","STAN 2","Tremblay SANO TB","14h40",{"$f":"IFERROR(VLOOKUP($B89,'Cls MG'!$A$1:$G$135,4,FALSE),\"\")","v":""},{"$f":"IFERROR(VLOOKUP($B89,'Cls MG'!$A$1:$G$135,5,FALSE),\"\")","v":""}]
[null,null,null,null,null,null,null,null,null,null,null,null,"MASS 1","STAN 2","Tremblay SANO TA","15h",{"$f":"IFERROR(VLOOKUP($B90,'Cls MG'!$A$1:$G$135,4,FALSE),\"\")","v":""},{"$f":"IFERROR(VLOOKUP($B90,'Cls MG'!$A$1:$G$135,5,FALSE),\"\")","v":""}]
[null,null,null,null,null,null,null,null,null,null,null,null,"SANO","FEN 1","Tremblay SANO TB","15h",{"$f":"IFERROR(VLOOKUP($B91,'Cls MG'!$A$1:$G$135,4,FALSE),\"\")","v":""},{"$f":"IFERROR(VLOOKUP($B91,'Cls MG'!$A$1:$G$135,5,FALSE),\"\")","v":""}]
["2022-05-11","ENTRAINEMENT :        matchs amicaux",null,null,null,null,null,null,null,null,"2022-05-11","DIVISION 1"]
[null,null,null,null,null,null,null,null,null,null,null,117,{"$f":"'Calendrier MG'!C78","v":"STAN 3"},{"$f":"'Calendrier MG'!D78","v":"MASS 2"},"La Courneuve T3 A","14h20",{"$f":"'Calendrier MG'!G78","v":0},{"$f":"'Calendrier MG'!H78","v":0}]
[null,null,null,null,null,null,null,null,null,null,null,111,{"$f":"'Calendrier MG'!C79","v":"ROC "},{"$f":"'Calendrier MG'!D79","v":"ASVP"},"La Courneuve T3 A","14h20",{"$f":"'Calendrier MG'!G79","v":0},{"$f":"'Calendrier MG'!H79","v":1}]
[null,null,null,null,null,null,null,null,null,null,null,121,{"$f":"'Calendrier MG'!C80","v":"STAN 3"},{"$f":"'Calendrier MG'!D80","v":"ROC "},"La Courneuve T3 A","14h40",{"$f":"'Calendrier MG'!G80","v":0},{"$f":"'Calendrier MG'!H80","v":3}]
[null,null,null,null,null,null,null,null,null,null,null,96,{"$f":"'Calendrier MG'!C81","v":"ASVP"},{"$f":"'Calendrier MG'!D81","v":"BND"},"La Courneuve T3 A","14h40",{"$f":"'Calendrier MG'!G81","v":0},{"$f":"'Calendrier MG'!H81","v":1}]
[null,null,null,null,null,null,null,null,null,null,null,102,{"$f":"'Calendrier MG'!C82","v":"ASVP"},{"$f":"'Calendrier MG'!D82","v":"FEN 2"},"La Courneuve T3 A","15h",{"$f":"'Calendrier MG'!G82","v":1},{"$f":"'Calendrier MG'!H82","v":0}]
["2022-05-18","COUPE BG au Tremblay sur terrains SANO et MASS de 14h à 17h",null,null,null,null,null,null,null,null,null,104,{"$f":"'Calendrier MG'!C83","v":"ROC "},{"$f":"'Calendrier MG'!D83","v":"BND"},"La Courneuve T3 A","15h",{"$f":"'Calendrier MG'!G83","v":1},{"$f":"'Calendrier MG'!H83","v":1}]
[null,null,null,null,null,null,null,null,null,null,"2022-05-18","ENTRAINEMENT :        matchs amicaux"]
[]
[]
[]
[]
[]
[null,null,null,null,null,null,null,null,null,null,"2022-05-25","ASCENSION"]
[]
[]
[]
[]
[]
[null,null,null,null,null,null,null,null,null,null,"2022-06-01","COUPE MG au Tremblay sur terrains SANO et MASS de 14h à 17h"]

{"sheet":"Calendrier BG","index":1,"n_rows":102,"n_cols":27,"rows_kept":102,"cut":false,"hidden":false,"merged":[[56,1,56,8],[78,1,78,8],[85,1,85,8],[90,1,90,8],[78,0,94,0],[61,0,77,0],[73,1,73,8],[20,19,20,20],[20,25,20,26],[8,16,8,17],[20,13,20,14],[1,6,1,7],[8,10,8,11],[9,10,9,11],[8,22,8,23],[9,22,9,23],[17,1,17,8],[9,16,9,17],[0,10,0,27],[2,0,7,0],[2,1,2,8],[3,1,7,8],[8,1,8,8],[95,0,100,0],[95,1,100,8],[101,0,106,0],[101,1,106,8],[0,1,0,8],[21,1,21,8],[25,1,25,8],[35,1,35,8],[39,1,39,8],[8,0,24,0],[25,0,42,0],[43,0,60,0],[61,1,61,8],[66,1,66,8],[43,1,43,8],[51,1,51,8]]}
[null," CALENDRIER BENJAMINS",null,null,null,null,null,null,null,null,"POULES ET MATCHS BENJAMINS"]
["Date","Match","Equipe A","Equipe B","Lieux","Horaires","Résultats",null,"Indisponibilités"]
["2022-03-09","DIVISION 1"]
[null,"ENTRAINEMENT"]
[]
[]
[]
[]
["2022-03-16","DIVISION 1",null,null,null,null,null,null,null,null,"DIVISION 1",null,null,null,null,null,"DIVISION 2 ",null,null,null,null,null,"DIVISION 3"]
[null,55,{"$f":"VLOOKUP($B10,$K$22:$O$93,4)","v":"SJL 1"},{"$f":"VLOOKUP($B10,$K$22:$O$93,5)","v":"MASS 2"},"SJL TA","14h20",{"$f":"IFERROR(VLOOKUP($B10,'Cls B1'!$A$1:$G$75,4,FALSE),\"\")","v":10},{"$f":"IFERROR(VLOOKUP($B10,'Cls B1'!$A$1:$G$75,5,FALSE),\"\")","v":0},null,null,"Etablissements",null,null,null,null,null,"Etablissements",null,null,null,null,null,"Etablissements"]
[null,46,"SJL 2","MASS 1","SJL TB","14h20",{"$f":"IFERROR(VLOOKUP($B11,'Cls B1'!$A$1:$G$75,4,FALSE),\"\")","v":1},{"$f":"IFERROR(VLOOKUP($B11,'Cls B1'!$A$1:$G$75,5,FALSE),\"\")","v":6},null,null,1,"SJL 1",null,null,null,null,1,"SANO",null,null,null,null,1,"STAN 4"]
[null,38,"MASS 1","SJL 1","SJL TA","14h40",{"$f":"IFERROR(VLOOKUP($B12,'Cls B1'!$A$1:$G$75,4,FALSE),\"\")","v":0},{"$f":"IFERROR(VLOOKUP($B12,'Cls B1'!$A$1:$G$75,5,FALSE),\"\")","v":4},null,null,2,"SJL 2",null,null,null,null,2,"STAN 3",null,null,null,null,2,"ASVP"]
[null,58,"MASS 2","SJL 2","SJL TB","14h40",{"$f":"IFERROR(VLOOKUP($B13,'Cls B1'!$A$1:$G$75,4,FALSE),\"\")","v":1},{"$f":"IFERROR(VLOOKUP($B13,'Cls B1'!$A$1:$G$75,5,FALSE),\"\")","v":4},null,null,3,"STAN 1",null,null,null,null,3,"BND",null,null,null,null,3,"FEN 3"]
[null,67,"ROC 1","STAN 1","La Courneuve T5 B","14h20",{"$f":"IFERROR(VLOOKUP($B14,'Cls B1'!$A$1:$G$75,4,FALSE),\"\")","v":0},{"$f":"IFERROR(VLOOKUP($B14,'Cls B1'!$A$1:$G$75,5,FALSE),\"\")","v":2},null,null,4,"STAN 2",null,null,null,null,4,"FEN 2",null,null,null,null,4,"JBS 2"]
[null,39,"STAN 2","FEN 1","La Courneuve T5 B","14h40",{"$f":"IFERROR(VLOOKUP($B15,'Cls B1'!$A$1:$G$75,4,FALSE),\"\")","v":2},{"$f":"IFERROR(VLOOKUP($B15,'Cls B1'!$A$1:$G$75,5,FALSE),\"\")","v":5},null,null,5,"MASS 1",null,null,null,null,5,"SJL 3",null,null,null,null,5,"ROC 2"]
[null,56,"FEN 1","STAN 1","La Courneuve T5 B","15h",{"$f":"IFERROR(VLOOKUP($B16,'Cls B1'!$A$1:$G$75,4,FALSE),\"\")","v":0},{"$f":"IFERROR(VLOOKUP($B16,'Cls B1'!$A$1:$G$75,5,FALSE),\"\")","v":0},null,null,6,"MASS 2"]
[null,68,"ROC 1","STAN 2","La Courneuve T5 B","15h20",{"$f":"IFERROR(VLOOKUP($B17,'Cls B1'!$A$1:$G$75,4,FALSE),\"\")","v":1},{"$f":"IFERROR(VLOOKUP($B17,'Cls B1'!$A$1:$G$75,5,FALSE),\"\")","v":1},null,null,7,"FEN 1"]
[null,"DIVISION 2 ",null,null,null,null,null,null,null,null,8,"JBS 1"]
[null,115,{"$f":"VLOOKUP($B19,$Q$21:$U$41,4)","v":"SJL 3"},{"$f":"VLOOKUP($B19,$Q$21:$U$41,5)","v":"SANO"},"La Courneuve T5 A","14h20",{"$f":"IFERROR(VLOOKUP($B19,'Cls B2 et B3'!$A$52:$G$74,4,FALSE),\"\")","v":0},{"$f":"IFERROR(VLOOKUP($B19,'Cls B2 et B3'!$A$52:$G$74,5,FALSE),\"\")","v":2},null,null,9,"ROC 1"]
[null,120,{"$f":"VLOOKUP($B20,$Q$21:$U$41,4)","v":"FEN 2"},{"$f":"VLOOKUP($B20,$Q$21:$U$41,5)","v":"SANO"},"La Courneuve T5 A","14h40",{"$f":"IFERROR(VLOOKUP($B20,'Cls B2 et B3'!$A$52:$G$74,4,FALSE),\"\")","v":1},{"$f":"IFERROR(VLOOKUP($B20,'Cls B2 et B3'!$A$52:$G$74,5,FALSE),\"\")","v":0}]
[null,117,{"$f":"VLOOKUP($B21,$Q$21:$U$41,4)","v":"SJL 3"},{"$f":"VLOOKUP($B21,$Q$21:$U$41,5)","v":"FEN 2"},"La Courneuve T5 A","15h",{"$f":"IFERROR(VLOOKUP($B21,'Cls B2 et B3'!$A$52:$G$74,4,FALSE),\"\")","v":0},{"$f":"IFERROR(VLOOKUP($B21,'Cls B2 et B3'!$A$52:$G$74,5,FALSE),\"\")","v":4},null,null,"N° Match","Equipe A","Equipe B","Match",null,null,"N° Match","Equipe A","Equipe B","Match",null,null,"N° Match","Equipe A","Equipe B","Match"]
[null,"DIVISION 3",null,null,null,null,null,null,null,null,1,2,3,{"$f":"VLOOKUP(L22,$K$9:$L$19,2)","v":"SJL 2"},{"$f":"VLOOKUP(M22,$K$9:$L$19,2)","v":"STAN 1"},null,113,1,2,{"$f":"VLOOKUP(R22,$Q$9:$R$15,2)","v":"SANO"},{"$f":"VLOOKUP(S22,$Q$9:$R$15,2)","v":"STAN 3"},null,133,1,2,{"$f":"VLOOKUP(X22,$W$9:$X$15,2)","v":"STAN 4"},{"$f":"VLOOKUP(Y22,$W$9:$X$15,2)","v":"ASVP"}]
[null,136,{"$f":"VLOOKUP($B23,$W$21:$AA$41,4)","v":"ASVP"},{"$f":"VLOOKUP($B23,$W$21:$AA$41,5)","v":"FEN 3"},"La Courneuve T6 B","14h20",{"$f":"IFERROR(VLOOKUP($B23,'Cls B2 et B3'!$A$77:$G$99,4,FALSE),\"\")","v":3},{"$f":"IFERROR(VLOOKUP($B23,'Cls B2 et B3'!$A$77:$G$99,5,FALSE),\"\")","v":0},null,null,2,1,5,"SJL 1","MASS 1",null,114,3,4,"BND","FEN 2",null,134,3,4,"FEN 3","JBS 2"]
[null,141,{"$f":"VLOOKUP($B24,$W$21:$AA$41,4)","v":"FEN 3"},{"$f":"VLOOKUP($B24,$W$21:$AA$41,5)","v":"ROC 2"},"La Courneuve T6 B","14h40",{"$f":"IFERROR(VLOOKUP($B24,'Cls B2 et B3'!$A$77:$G$99,4,FALSE),\"\")","v":0},{"$f":"IFERROR(VLOOKUP($B24,'Cls B2 et B3'!$A$77:$G$99,5,FALSE),\"\")","v":2},null,null,3,7,4,"FEN 1","STAN 2",null,115,5,1,"SJL 3","SANO",null,135,5,1,"ROC 2","STAN 4"]
[null,139,{"$f":"VLOOKUP($B25,$W$21:$AA$41,4)","v":"ASVP"},{"$f":"VLOOKUP($B25,$W$21:$AA$41,5)","v":"ROC 2"},"La Courneuve T6 B","15h",{"$f":"IFERROR(VLOOKUP($B25,'Cls B2 et B3'!$A$77:$G$99,4,FALSE),\"\")","v":3},{"$f":"IFERROR(VLOOKUP($B25,'Cls B2 et B3'!$A$77:$G$99,5,FALSE),\"\")","v":2},null,null,4,6,8,"MASS 2","JBS 1",null,116,2,3,"STAN 3","BND",null,136,2,3,"ASVP","FEN 3"]
["2022-03-23","DIVISION 1",null,null,null,null,null,null,null,null,5,1,2,"SJL 1","SJL 2",null,117,5,4,"SJL 3","FEN 2",null,137,5,4,"ROC 2","JBS 2"]
[null,48,{"$f":"VLOOKUP($B27,$K$22:$O$93,4)","v":"FEN 1"},{"$f":"VLOOKUP($B27,$K$22:$O$93,5)","v":"MASS 2"},"La Courneuve T3A","14h",{"$f":"IFERROR(VLOOKUP($B27,'Cls B1'!$A$1:$G$75,4,FALSE),\"\")","v":2},{"$f":"IFERROR(VLOOKUP($B27,'Cls B1'!$A$1:$G$75,5,FALSE),\"\")","v":0},"SANO",null,6,3,4,"STAN 1","STAN 2",null,118,1,3,"SANO","BND",null,138,1,3,"STAN 4","FEN 3"]
[null,33,{"$f":"VLOOKUP($B28,$K$22:$O$93,4)","v":"MASS 1"},{"$f":"VLOOKUP($B28,$K$22:$O$93,5)","v":"ROC 1"},"La Courneuve T3A","14h20",{"$f":"IFERROR(VLOOKUP($B28,'Cls B1'!$A$1:$G$75,4,FALSE),\"\")","v":0},{"$f":"IFERROR(VLOOKUP($B28,'Cls B1'!$A$1:$G$75,5,FALSE),\"\")","v":0},null,null,7,5,6,"MASS 1","MASS 2",null,119,2,5,"STAN 3","SJL 3",null,139,2,5,"ASVP","ROC 2"]
[null,34,{"$f":"VLOOKUP($B29,$K$22:$O$93,4)","v":"MASS 2"},{"$f":"VLOOKUP($B29,$K$22:$O$93,5)","v":"ROC 1"},"La Courneuve T3A","14h40",{"$f":"IFERROR(VLOOKUP($B29,'Cls B1'!$A$1:$G$75,4,FALSE),\"\")","v":0},{"$f":"IFERROR(VLOOKUP($B29,'Cls B1'!$A$1:$G$75,5,FALSE),\"\")","v":1},null,null,8,8,7,"JBS 1","FEN 1",null,120,4,1,"FEN 2","SANO",null,140,4,1,"JBS 2","STAN 4"]
[null,51,{"$f":"VLOOKUP($B30,$K$22:$O$93,4)","v":"MASS 1"},{"$f":"VLOOKUP($B30,$K$22:$O$93,5)","v":"FEN 1"},"La Courneuve T3A","15h",{"$f":"IFERROR(VLOOKUP($B30,'Cls B1'!$A$1:$G$75,4,FALSE),\"\")","v":5},{"$f":"IFERROR(VLOOKUP($B30,'Cls B1'!$A$1:$G$75,5,FALSE),\"\")","v":1},null,null,9,4,1,"STAN 2","SJL 1",null,121,3,5,"BND","SJL 3",null,141,3,5,"FEN 3","ROC 2"]
[null,43,{"$f":"VLOOKUP($B31,$K$22:$O$93,4)","v":"MASS 2"},{"$f":"VLOOKUP($B31,$K$22:$O$93,5)","v":"MASS 1"},"La Courneuve T3A","15h20",{"$f":"IFERROR(VLOOKUP($B31,'Cls B1'!$A$1:$G$75,4,FALSE),\"\")","v":0},{"$f":"IFERROR(VLOOKUP($B31,'Cls B1'!$A$1:$G$75,5,FALSE),\"\")","v":3},null,null,10,5,2,"MASS 1","SJL 2",null,122,4,2,"FEN 2","STAN 3",null,142,4,2,"JBS 2","ASVP"]
[null,45,{"$f":"VLOOKUP($B32,$K$22:$O$93,4)","v":"SJL 1"},{"$f":"VLOOKUP($B32,$K$22:$O$93,5)","v":"STAN 2"},"SJL TA","14h20",{"$f":"IFERROR(VLOOKUP($B32,'Cls B1'!$A$1:$G$75,4,FALSE),\"\")","v":5},{"$f":"IFERROR(VLOOKUP($B32,'Cls B1'!$A$1:$G$75,5,FALSE),\"\")","v":1},null,null,11,8,3,"JBS 1","STAN 1",null,123,2,1,"STAN 3","SANO",null,143,2,1,"ASVP","STAN 4"]
[null,53,"JBS 1","SJL 2","SJL TB","14h20",{"$f":"IFERROR(VLOOKUP($B33,'Cls B1'!$A$1:$G$75,4,FALSE),\"\")","v":3},{"$f":"IFERROR(VLOOKUP($B33,'Cls B1'!$A$1:$G$75,5,FALSE),\"\")","v":1},null,null,12,6,7,"MASS 2","FEN 1",null,124,4,3,"FEN 2","BND",null,144,4,3,"JBS 2","FEN 3"]
[null,50,{"$f":"VLOOKUP($B34,$K$22:$O$93,4)","v":"SJL 1"},{"$f":"VLOOKUP($B34,$K$22:$O$93,5)","v":"JBS 1"},"SJL TA","14h40",{"$f":"IFERROR(VLOOKUP($B34,'Cls B1'!$A$1:$G$75,4,FALSE),\"\")","v":4},{"$f":"IFERROR(VLOOKUP($B34,'Cls B1'!$A$1:$G$75,5,FALSE),\"\")","v":1},null,null,13,4,2,"STAN 2","SJL 2",null,125,1,5,"SANO","SJL 3",null,145,1,5,"STAN 4","ROC 2"]
[null,49,{"$f":"VLOOKUP($B35,$K$22:$O$93,4)","v":"SJL 2"},{"$f":"VLOOKUP($B35,$K$22:$O$93,5)","v":"STAN 2"},"SJL TB","14h40",{"$f":"IFERROR(VLOOKUP($B35,'Cls B1'!$A$1:$G$75,4,FALSE),\"\")","v":1},{"$f":"IFERROR(VLOOKUP($B35,'Cls B1'!$A$1:$G$75,5,FALSE),\"\")","v":0},null,null,14,8,1,"JBS 1","SJL 1",null,126,3,2,"BND","STAN 3",null,146,3,2,"FEN 3","ASVP"]
[null,"DIVISION 2 ",null,null,null,null,null,null,null,null,15,7,5,"FEN 1","MASS 1",null,127,4,5,"FEN 2","SJL 3",null,147,4,5,"JBS 2","ROC 2"]
[null,114,{"$f":"VLOOKUP($B37,$Q$21:$U$41,4)","v":"BND"},{"$f":"VLOOKUP($B37,$Q$21:$U$41,5)","v":"FEN 2"},"La Courneuve T5A","14h20",{"$f":"IFERROR(VLOOKUP($B37,'Cls B2 et B3'!$A$52:$G$74,4,FALSE),\"\")","v":0},{"$f":"IFERROR(VLOOKUP($B37,'Cls B2 et B3'!$A$52:$G$74,5,FALSE),\"\")","v":2},null,null,16,3,6,"STAN 1","MASS 2",null,128,3,1,"BND","SANO",null,148,3,1,"FEN 3","STAN 4"]
[null,116,{"$f":"VLOOKUP($B38,$Q$21:$U$41,4)","v":"STAN 3"},{"$f":"VLOOKUP($B38,$Q$21:$U$41,5)","v":"BND"},"La Courneuve T5A","14h40",{"$f":"IFERROR(VLOOKUP($B38,'Cls B2 et B3'!$A$52:$G$74,4,FALSE),\"\")","v":0},{"$f":"IFERROR(VLOOKUP($B38,'Cls B2 et B3'!$A$52:$G$74,5,FALSE),\"\")","v":3},null,null,17,2,8,"SJL 2","JBS 1",null,129,5,2,"SJL 3","STAN 3",null,149,5,2,"ROC 2","ASVP"]
[null,122,{"$f":"VLOOKUP($B39,$Q$21:$U$41,4)","v":"FEN 2"},{"$f":"VLOOKUP($B39,$Q$21:$U$41,5)","v":"STAN 3"},"La Courneuve T5A","15h",{"$f":"IFERROR(VLOOKUP($B39,'Cls B2 et B3'!$A$52:$G$74,4,FALSE),\"\")","v":4},{"$f":"IFERROR(VLOOKUP($B39,'Cls B2 et B3'!$A$52:$G$74,5,FALSE),\"\")","v":1},null,null,18,5,4,"MASS 1","STAN 2",null,130,1,4,"SANO","FEN 2",null,150,1,4,"STAN 4","JBS 2"]
[null,"DIVISION 3",null,null,null,null,null,null,null,null,19,6,1,"MASS 2","SJL 1",null,131,5,3,"SJL 3","BND",null,151,5,3,"ROC 2","FEN 3"]
[null,151,{"$f":"VLOOKUP($B41,$W$21:$AA$41,4)","v":"ROC 2"},{"$f":"VLOOKUP($B41,$W$21:$AA$41,5)","v":"FEN 3"},"La Courneuve T5B","14h20",{"$f":"IFERROR(VLOOKUP($B41,'Cls B2 et B3'!$A$77:$G$99,4,FALSE),\"\")","v":0},{"$f":"IFERROR(VLOOKUP($B41,'Cls B2 et B3'!$A$77:$G$99,5,FALSE),\"\")","v":3},null,null,20,3,7,"STAN 1","FEN 1",null,132,2,4,"STAN 3","FEN 2",null,152,2,4,"ASVP","JBS 2"]
[null,138,{"$f":"VLOOKUP($B42,$W$21:$AA$41,4)","v":"STAN 4"},{"$f":"VLOOKUP($B42,$W$21:$AA$41,5)","v":"FEN 3"},"La Courneuve T5B","14h40",{"$f":"IFERROR(VLOOKUP($B42,'Cls B2 et B3'!$A$77:$G$99,4,FALSE),\"\")","v":0},{"$f":"IFERROR(VLOOKUP($B42,'Cls B2 et B3'!$A$77:$G$99,5,FALSE),\"\")","v":3},null,null,21,4,8,"STAN 2","JBS 1"]
[null,135,{"$f":"VLOOKUP($B43,$W$21:$AA$41,4)","v":"ROC 2"},{"$f":"VLOOKUP($B43,$W$21:$AA$41,5)","v":"STAN 4"},"La Courneuve T5B","15h",{"$f":"IFERROR(VLOOKUP($B43,'Cls B2 et B3'!$A$77:$G$99,4,FALSE),\"\")","v":3},{"$f":"IFERROR(VLOOKUP($B43,'Cls B2 et B3'!$A$77:$G$99,5,FALSE),\"\")","v":0},null,null,22,2,6,"SJL 2","MASS 2"]
["2022-03-30","DIVISION 1",null,null,null,null,null,null,null,null,23,3,5,"STAN 1","MASS 1"]
[null,null,null,null,null,null,{"$f":"IFERROR(VLOOKUP($B45,'Cls B1'!$A$1:$G$75,4,FALSE),\"\")","v":""},{"$f":"IFERROR(VLOOKUP($B45,'Cls B1'!$A$1:$G$75,5,FALSE),\"\")","v":""},"MASS",null,24,1,7,"SJL 1","FEN 1"]
[null,null,null,null,null,null,{"$f":"IFERROR(VLOOKUP($B46,'Cls B1'!$A$1:$G$75,4,FALSE),\"\")","v":""},{"$f":"IFERROR(VLOOKUP($B46,'Cls B1'!$A$1:$G$75,5,FALSE),\"\")","v":""},null,null,25,4,6,"STAN 2","MASS 2"]
[null,null,null,null,null,null,{"$f":"IFERROR(VLOOKUP($B47,'Cls B1'!$A$1:$G$75,4,FALSE),\"\")","v":""},{"$f":"IFERROR(VLOOKUP($B47,'Cls B1'!$A$1:$G$75,5,FALSE),\"\")","v":""},null,null,26,8,5,"JBS 1","MASS 1"]
[null,null,null,null,null,null,{"$f":"IFERROR(VLOOKUP($B48,'Cls B1'!$A$1:$G$75,4,FALSE),\"\")","v":""},{"$f":"IFERROR(VLOOKUP($B48,'Cls B1'!$A$1:$G$75,5,FALSE),\"\")","v":""},null,null,27,7,2,"FEN 1","SJL 2"]
[null,null,null,null,null,null,{"$f":"IFERROR(VLOOKUP($B49,'Cls B1'!$A$1:$G$75,4,FALSE),\"\")","v":""},{"$f":"IFERROR(VLOOKUP($B49,'Cls B1'!$A$1:$G$75,5,FALSE),\"\")","v":""},null,null,28,1,3,"SJL 1","STAN 1"]
[null,null,null,null,null,null,{"$f":"IFERROR(VLOOKUP($B50,'Cls B1'!$A$1:$G$75,4,FALSE),\"\")","v":""},{"$f":"IFERROR(VLOOKUP($B50,'Cls B1'!$A$1:$G$75,5,FALSE),\"\")","v":""},null,null,29,1,9,"SJL 1","ROC 1"]
[null,null,null,null,null,null,{"$f":"IFERROR(VLOOKUP($B51,'Cls B1'!$A$1:$G$75,4,FALSE),\"\")","v":""},{"$f":"IFERROR(VLOOKUP($B51,'Cls B1'!$A$1:$G$75,5,FALSE),\"\")","v":""},null,null,30,2,9,"SJL 2","ROC 1"]
[null,"DIVISION 2 ",null,null,null,null,null,null,null,null,31,3,9,"STAN 1","ROC 1"]
[null,113,{"$f":"VLOOKUP($B53,$Q$21:$U$41,4)","v":"SANO"},{"$f":"VLOOKUP($B53,$Q$21:$U$41,5)","v":"STAN 3"},"La Courneuve T5A","14h20",{"$f":"IFERROR(VLOOKUP($B53,'Cls B2 et B3'!$A$52:$G$74,4,FALSE),\"\")","v":7},{"$f":"IFERROR(VLOOKUP($B53,'Cls B2 et B3'!$A$52:$G$74,5,FALSE),\"\")","v":1},null,null,32,4,9,"STAN 2","ROC 1"]
[null,121,{"$f":"VLOOKUP($B54,$Q$21:$U$41,4)","v":"BND"},{"$f":"VLOOKUP($B54,$Q$21:$U$41,5)","v":"SJL 3"},"La Courneuve T5A","14h20",{"$f":"IFERROR(VLOOKUP($B54,'Cls B2 et B3'!$A$52:$G$74,4,FALSE),\"\")","v":0},{"$f":"IFERROR(VLOOKUP($B54,'Cls B2 et B3'!$A$52:$G$74,5,FALSE),\"\")","v":0},null,null,33,5,9,{"$f":"VLOOKUP(L54,$K$9:$L$19,2)","v":"MASS 1"},{"$f":"VLOOKUP(M54,$K$9:$L$19,2)","v":"ROC 1"}]
[null,119,{"$f":"VLOOKUP($B55,$Q$21:$U$41,4)","v":"STAN 3"},{"$f":"VLOOKUP($B55,$Q$21:$U$41,5)","v":"SJL 3"},"La Courneuve T5A","14h40",{"$f":"IFERROR(VLOOKUP($B55,'Cls B2 et B3'!$A$52:$G$74,4,FALSE),\"\")","v":1},{"$f":"IFERROR(VLOOKUP($B55,'Cls B2 et B3'!$A$52:$G$74,5,FALSE),\"\")","v":0},null,null,34,6,9,"MASS 2","ROC 1"]
[null,118,{"$f":"VLOOKUP($B56,$Q$21:$U$41,4)","v":"SANO"},{"$f":"VLOOKUP($B56,$Q$21:$U$41,5)","v":"BND"},"La Courneuve T5A","14h40",{"$f":"IFERROR(VLOOKUP($B56,'Cls B2 et B3'!$A$52:$G$74,4,FALSE),\"\")","v":2},{"$f":"IFERROR(VLOOKUP($B56,'Cls B2 et B3'!$A$52:$G$74,5,FALSE),\"\")","v":1},null,null,35,7,9,"FEN 1","ROC 1"]
[null,"DIVISION 3",null,null,null,null,null,null,null,null,36,8,9,"JBS 1","ROC 1"]
[null,137,{"$f":"VLOOKUP($B58,$W$21:$AA$41,4)","v":"ROC 2"},{"$f":"VLOOKUP($B58,$W$21:$AA$41,5)","v":"JBS 2"},"La Courneuve T5B","14h20",{"$f":"IFERROR(VLOOKUP($B58,'Cls B2 et B3'!$A$77:$G$99,4,FALSE),\"\")","v":2},{"$f":"IFERROR(VLOOKUP($B58,'Cls B2 et B3'!$A$77:$G$99,5,FALSE),\"\")","v":4},null,null,37,3,2,"STAN 1","SJL 2"]
[null,146,{"$f":"VLOOKUP($B59,$W$21:$AA$41,4)","v":"FEN 3"},{"$f":"VLOOKUP($B59,$W$21:$AA$41,5)","v":"ASVP"},"La Courneuve T5B","14h20",{"$f":"IFERROR(VLOOKUP($B59,'Cls B2 et B3'!$A$77:$G$99,4,FALSE),\"\")","v":0},{"$f":"IFERROR(VLOOKUP($B59,'Cls B2 et B3'!$A$77:$G$99,5,FALSE),\"\")","v":3},null,null,38,5,1,"MASS 1","SJL 1"]
[null,149,{"$f":"VLOOKUP($B60,$W$21:$AA$41,4)","v":"ROC 2"},{"$f":"VLOOKUP($B60,$W$21:$AA$41,5)","v":"ASVP"},"La Courneuve T5B","14h40",{"$f":"IFERROR(VLOOKUP($B60,'Cls B2 et B3'!$A$77:$G$99,4,FALSE),\"\")","v":3},{"$f":"IFERROR(VLOOKUP($B60,'Cls B2 et B3'!$A$77:$G$99,5,FALSE),\"\")","v":2},null,null,39,4,7,"STAN 2","FEN 1"]
[null,144,{"$f":"VLOOKUP($B61,$W$21:$AA$41,4)","v":"JBS 2"},{"$f":"VLOOKUP($B61,$W$21:$AA$41,5)","v":"FEN 3"},"La Courneuve T5B","14h40",{"$f":"IFERROR(VLOOKUP($B61,'Cls B2 et B3'!$A$77:$G$99,4,FALSE),\"\")","v":0},{"$f":"IFERROR(VLOOKUP($B61,'Cls B2 et B3'!$A$77:$G$99,5,FALSE),\"\")","v":2},null,null,40,8,6,"JBS 1","MASS 2"]
["2022-04-06","DIVISION 1",null,null,null,null,null,null,null,null,41,2,1,"SJL 2","SJL 1"]
[null,null,{"$f":"VLOOKUP($B63,$K$22:$O$93,4)","v":{"$error":"#N/A"}},{"$f":"VLOOKUP($B63,$K$22:$O$93,5)","v":{"$error":"#N/A"}},null,null,{"$f":"IFERROR(VLOOKUP($B63,'Cls B1'!$A$1:$G$75,4,FALSE),\"\")","v":""},{"$f":"IFERROR(VLOOKUP($B63,'Cls B1'!$A$1:$G$75,5,FALSE),\"\")","v":""},"MASS",null,42,4,3,"STAN 2","STAN 1"]
[null,null,{"$f":"VLOOKUP($B64,$K$22:$O$93,4)","v":{"$error":"#N/A"}},{"$f":"VLOOKUP($B64,$K$22:$O$93,5)","v":{"$error":"#N/A"}},null,null,{"$f":"IFERROR(VLOOKUP($B64,'Cls B1'!$A$1:$G$75,4,FALSE),\"\")","v":""},{"$f":"IFERROR(VLOOKUP($B64,'Cls B1'!$A$1:$G$75,5,FALSE),\"\")","v":""},null,null,43,6,5,"MASS 2","MASS 1"]
[null,null,{"$f":"VLOOKUP($B65,$K$22:$O$93,4)","v":{"$error":"#N/A"}},{"$f":"VLOOKUP($B65,$K$22:$O$93,5)","v":{"$error":"#N/A"}},null,null,{"$f":"IFERROR(VLOOKUP($B65,'Cls B1'!$A$1:$G$75,4,FALSE),\"\")","v":""},{"$f":"IFERROR(VLOOKUP($B65,'Cls B1'!$A$1:$G$75,5,FALSE),\"\")","v":""},null,null,44,7,8,"FEN 1","JBS 1"]
[null,null,{"$f":"VLOOKUP($B66,$K$22:$O$93,4)","v":{"$error":"#N/A"}},{"$f":"VLOOKUP($B66,$K$22:$O$93,5)","v":{"$error":"#N/A"}},null,null,{"$f":"IFERROR(VLOOKUP($B66,'Cls B1'!$A$1:$G$75,4,FALSE),\"\")","v":""},{"$f":"IFERROR(VLOOKUP($B66,'Cls B1'!$A$1:$G$75,5,FALSE),\"\")","v":""},null,null,45,1,4,"SJL 1","STAN 2"]
[null,"DIVISION 2 ",null,null,null,null,null,null,null,null,46,2,5,"SJL 2","MASS 1"]
[null,130,{"$f":"VLOOKUP($B68,$Q$21:$U$41,4)","v":"SANO"},{"$f":"VLOOKUP($B68,$Q$21:$U$41,5)","v":"FEN 2"},"La Courneuve T3A","14h",{"$f":"IFERROR(VLOOKUP($B68,'Cls B2 et B3'!$A$52:$G$74,4,FALSE),\"\")","v":1},{"$f":"IFERROR(VLOOKUP($B68,'Cls B2 et B3'!$A$52:$G$74,5,FALSE),\"\")","v":0},null,null,47,3,8,"STAN 1","JBS 1"]
[null,127,{"$f":"VLOOKUP($B69,$Q$21:$U$41,4)","v":"FEN 2"},{"$f":"VLOOKUP($B69,$Q$21:$U$41,5)","v":"SJL 3"},"La Courneuve T3A","14h20",{"$f":"IFERROR(VLOOKUP($B69,'Cls B2 et B3'!$A$52:$G$74,4,FALSE),\"\")","v":1},{"$f":"IFERROR(VLOOKUP($B69,'Cls B2 et B3'!$A$52:$G$74,5,FALSE),\"\")","v":0},null,null,48,7,6,"FEN 1","MASS 2"]
[null,128,{"$f":"VLOOKUP($B70,$Q$21:$U$41,4)","v":"BND"},{"$f":"VLOOKUP($B70,$Q$21:$U$41,5)","v":"SANO"},"La Courneuve T3A","14h40",{"$f":"IFERROR(VLOOKUP($B70,'Cls B2 et B3'!$A$52:$G$74,4,FALSE),\"\")","v":0},{"$f":"IFERROR(VLOOKUP($B70,'Cls B2 et B3'!$A$52:$G$74,5,FALSE),\"\")","v":4},null,null,49,2,4,"SJL 2","STAN 2"]
[null,129,{"$f":"VLOOKUP($B71,$Q$21:$U$41,4)","v":"SJL 3"},{"$f":"VLOOKUP($B71,$Q$21:$U$41,5)","v":"STAN 3"},"La Courneuve T3A","15h",{"$f":"IFERROR(VLOOKUP($B71,'Cls B2 et B3'!$A$52:$G$74,4,FALSE),\"\")","v":2},{"$f":"IFERROR(VLOOKUP($B71,'Cls B2 et B3'!$A$52:$G$74,5,FALSE),\"\")","v":1},null,null,50,1,8,"SJL 1","JBS 1"]
[null,124,"FEN 2","BND","La Courneuve T3A","15h20",{"$f":"IFERROR(VLOOKUP($B72,'Cls B2 et B3'!$A$52:$G$74,4,FALSE),\"\")","v":2},{"$f":"IFERROR(VLOOKUP($B72,'Cls B2 et B3'!$A$52:$G$74,5,FALSE),\"\")","v":0},null,null,51,5,7,"MASS 1","FEN 1"]
[null,132,{"$f":"VLOOKUP($B73,$Q$21:$U$41,4)","v":"STAN 3"},{"$f":"VLOOKUP($B73,$Q$21:$U$41,5)","v":"FEN 2"},"La Courneuve T3A","15h40",{"$f":"IFERROR(VLOOKUP($B73,'Cls B2 et B3'!$A$52:$G$74,4,FALSE),\"\")","v":0},{"$f":"IFERROR(VLOOKUP($B73,'Cls B2 et B3'!$A$52:$G$74,5,FALSE),\"\")","v":1},null,null,52,6,3,"MASS 2","STAN 1"]
[null,"DIVISION 3",null,null,null,null,null,null,null,null,53,8,2,"JBS 1","SJL 2"]
[null,134,{"$f":"VLOOKUP($B75,$W$21:$AA$41,4)","v":"FEN 3"},{"$f":"VLOOKUP($B75,$W$21:$AA$41,5)","v":"JBS 2"},"La Courneuve T5 A","14h",{"$f":"IFERROR(VLOOKUP($B75,'Cls B2 et B3'!$A$77:$G$99,4,FALSE),\"\")","v":1},{"$f":"IFERROR(VLOOKUP($B75,'Cls B2 et B3'!$A$77:$G$99,5,FALSE),\"\")","v":0},null,null,54,4,5,"STAN 2","MASS 1"]
[null,133,{"$f":"VLOOKUP($B76,$W$21:$AA$41,4)","v":"STAN 4"},{"$f":"VLOOKUP($B76,$W$21:$AA$41,5)","v":"ASVP"},"La Courneuve T5 A","14h20",{"$f":"IFERROR(VLOOKUP($B76,'Cls B2 et B3'!$A$77:$G$99,4,FALSE),\"\")","v":0},{"$f":"IFERROR(VLOOKUP($B76,'Cls B2 et B3'!$A$77:$G$99,5,FALSE),\"\")","v":4},null,null,55,1,6,"SJL 1","MASS 2"]
[null,140,{"$f":"VLOOKUP($B77,$W$21:$AA$41,4)","v":"JBS 2"},{"$f":"VLOOKUP($B77,$W$21:$AA$41,5)","v":"STAN 4"},"La Courneuve T5 A","14h40",{"$f":"IFERROR(VLOOKUP($B77,'Cls B2 et B3'!$A$77:$G$99,4,FALSE),\"\")","v":3},{"$f":"IFERROR(VLOOKUP($B77,'Cls B2 et B3'!$A$77:$G$99,5,FALSE),\"\")","v":1},null,null,56,7,3,"FEN 1","STAN 1"]
[null,142,"JBS 2","ASVP","La Courneuve T5 A","15h",{"$f":"IFERROR(VLOOKUP($B78,'Cls B2 et B3'!$A$77:$G$99,4,FALSE),\"\")","v":4},{"$f":"IFERROR(VLOOKUP($B78,'Cls B2 et B3'!$A$77:$G$99,5,FALSE),\"\")","v":1},null,null,57,8,4,"JBS 1","STAN 2"]
["2022-04-13","DIVISION 1",null,null,null,null,null,null,null,null,58,6,2,"MASS 2","SJL 2"]
[null,66,{"$f":"VLOOKUP($B80,$K$22:$O$93,4)","v":"ROC 1"},{"$f":"VLOOKUP($B80,$K$22:$O$93,5)","v":"SJL 2"},"SJL TA","14h",{"$f":"IFERROR(VLOOKUP($B80,'Cls B1'!$A$1:$G$75,4,FALSE),\"\")","v":0},{"$f":"IFERROR(VLOOKUP($B80,'Cls B1'!$A$1:$G$75,5,FALSE),\"\")","v":0},"STAN",null,59,5,3,"MASS 1","STAN 1"]
[null,62,"MASS 1","JBS 1","SJL TB","14h",{"$f":"IFERROR(VLOOKUP($B81,'Cls B1'!$A$1:$G$75,4,FALSE),\"\")","v":2},{"$f":"IFERROR(VLOOKUP($B81,'Cls B1'!$A$1:$G$75,5,FALSE),\"\")","v":2},null,null,60,7,1,"FEN 1","SJL 1"]
[null,69,"ROC 1","MASS 1","SJL TA","14h20",{"$f":"IFERROR(VLOOKUP($B82,'Cls B1'!$A$1:$G$75,4,FALSE),\"\")","v":0},{"$f":"IFERROR(VLOOKUP($B82,'Cls B1'!$A$1:$G$75,5,FALSE),\"\")","v":7},null,null,61,6,4,"MASS 2","STAN 2"]
[null,40,"JBS 1","MASS 2","SJL TB","14h20",{"$f":"IFERROR(VLOOKUP($B83,'Cls B1'!$A$1:$G$75,4,FALSE),\"\")","v":6},{"$f":"IFERROR(VLOOKUP($B83,'Cls B1'!$A$1:$G$75,5,FALSE),\"\")","v":0},null,null,62,5,8,"MASS 1","JBS 1"]
[null,70,"ROC 1","MASS 2","SJL TA","14h40",{"$f":"IFERROR(VLOOKUP($B84,'Cls B1'!$A$1:$G$75,4,FALSE),\"\")","v":5},{"$f":"IFERROR(VLOOKUP($B84,'Cls B1'!$A$1:$G$75,5,FALSE),\"\")","v":0},null,null,63,2,7,"SJL 2","FEN 1"]
[null,64,"STAN 1","SJL 1",null,null,{"$f":"IFERROR(VLOOKUP($B85,'Cls B1'!$A$1:$G$75,4,FALSE),\"\")","v":0},{"$f":"IFERROR(VLOOKUP($B85,'Cls B1'!$A$1:$G$75,5,FALSE),\"\")","v":2},null,null,64,3,1,"STAN 1","SJL 1"]
[null,"DIVISION 2 ",null,null,null,null,null,null,null,null,65,9,1,{"$f":"VLOOKUP(L86,$K$9:$L$19,2)","v":"ROC 1"},{"$f":"VLOOKUP(M86,$K$9:$L$19,2)","v":"SJL 1"}]
[null,131,{"$f":"VLOOKUP($B87,$Q$21:$U$41,4)","v":"SJL 3"},{"$f":"VLOOKUP($B87,$Q$21:$U$41,5)","v":"BND"},"Tremblay SANO TB","14h20",{"$f":"IFERROR(VLOOKUP($B87,'Cls B2 et B3'!$A$52:$G$74,4,FALSE),\"\")","v":3},{"$f":"IFERROR(VLOOKUP($B87,'Cls B2 et B3'!$A$52:$G$74,5,FALSE),\"\")","v":0},null,null,66,9,2,"ROC 1","SJL 2"]
[null,125,{"$f":"VLOOKUP($B88,$Q$21:$U$41,4)","v":"SANO"},{"$f":"VLOOKUP($B88,$Q$21:$U$41,5)","v":"SJL 3"},"Tremblay SANO TA","14h40",{"$f":"IFERROR(VLOOKUP($B88,'Cls B2 et B3'!$A$52:$G$74,4,FALSE),\"\")","v":6},{"$f":"IFERROR(VLOOKUP($B88,'Cls B2 et B3'!$A$52:$G$74,5,FALSE),\"\")","v":0},null,null,67,9,3,"ROC 1","STAN 1"]
[null,null,null,null,null,null,{"$f":"IFERROR(VLOOKUP($B89,'Cls B2 et B3'!$A$1:$G$23,4,FALSE),\"\")","v":""},{"$f":"IFERROR(VLOOKUP($B89,'Cls B2 et B3'!$A$1:$G$23,5,FALSE),\"\")","v":""},null,null,68,9,4,"ROC 1","STAN 2"]
[null,null,null,null,null,null,null,null,null,null,69,9,5,"ROC 1","MASS 1"]
[null,"DIVISION 3",null,null,null,null,null,null,null,null,70,9,6,"ROC 1","MASS 2"]
[null,null,{"$f":"VLOOKUP($B92,$W$21:$AA$41,4)","v":{"$error":"#N/A"}},{"$f":"VLOOKUP($B92,$W$21:$AA$41,5)","v":{"$error":"#N/A"}},null,null,null,null,null,null,71,9,7,"ROC 1","FEN 1"]
[null,null,{"$f":"VLOOKUP($B93,$W$21:$AA$41,4)","v":{"$error":"#N/A"}},{"$f":"VLOOKUP($B93,$W$21:$AA$41,5)","v":{"$error":"#N/A"}},null,null,null,null,null,null,72,9,8,"ROC 1","JBS 1"]
[null,null,{"$f":"VLOOKUP($B94,$W$21:$AA$41,4)","v":{"$error":"#N/A"}},{"$f":"VLOOKUP($B94,$W$21:$AA$41,5)","v":{"$error":"#N/A"}}]
[null,null,{"$f":"VLOOKUP($B95,$W$21:$AA$41,4)","v":{"$error":"#N/A"}},{"$f":"VLOOKUP($B95,$W$21:$AA$41,5)","v":{"$error":"#N/A"}}]
["2022-05-11","ENTRAINEMENT :        matchs amicaux"]
[]
[]
[]
[]
[]
["2022-05-18","COUPE BG au Tremblay sur terrains SANO et MASS de 14h à 17h"]

{"sheet":"Cls B1","index":2,"n_rows":75,"n_cols":20,"rows_kept":75,"cut":false,"hidden":false,"merged":[[2,3,2,4],[0,0,1,6]]}
["BENJAMINS DIVISION 1"]
[]
["N° Match","Equipe A","Equipe B","Scores",null,"Vainqueur","Perdant",null,null,"SIGLE","Etablissement","Matchs joués","Victoires","Nuls ","Défaites","Buts Pour","Buts Contre","Différence","Points"]
[1,{"$f":"'Calendrier BG'!N22","v":"SJL 2"},{"$f":"'Calendrier BG'!O22","v":"STAN 1"},0,7,{"$f":"IF(D4<>\"\",IF(D4>E4,B4,IF(D4<E4,C4,\"nul\")),\"\")","v":"STAN 1"},{"$f":"IF(E4<>\"\",IF(E4<D4,C4,IF(E4>D4,B4,\"nul\")),\"\")","v":"SJL 2"},null,{"$f":"RANK(T4,$T$4:$T$12)","v":1},"SJL 1","Saint Justin Levallois 1",{"$f":"COUNT(D5,D8,D12,D17,D22,D27,D58,D31,D32,D41,D44,D48,D68,D53,D63,D67)","v":16},{"$f":"COUNTIF($F$3:$F$75,J4)","v":16},{"$f":"L4-M4-O4","v":0},{"$f":"COUNTIF($G$4:$G$75,J4)","v":0},{"$f":"SUM(D5,D8,E12,E17,E22,D27,D58,D31,D32,E41,E44,D48,E68,D53,E63,E67)","v":68},{"$f":"SUM(E5,E8,D12,D17,D22,E27,E58,E31,E32,D41,D44,E48,D68,E53,D63,D67)","v":8},{"$f":"P4-Q4","v":60},{"$f":"M4*4+N4*2+O4*1","v":64},{"$f":"SUM(S4*1000000+R4*10000+P4*100+L4*10)","v":64606960}]
[2,{"$f":"'Calendrier BG'!N23","v":"SJL 1"},{"$f":"'Calendrier BG'!O23","v":"MASS 1"},4,0,{"$f":"IF(D5<>\"\",IF(D5>E5,B5,IF(D5<E5,C5,\"nul\")),\"\")","v":"SJL 1"},{"$f":"IF(E5<>\"\",IF(E5<D5,C5,IF(E5>D5,B5,\"nul\")),\"\")","v":"MASS 1"},null,{"$f":"RANK(T5,$T$4:$T$12)","v":6},"SJL 2","Saint Justin Levallois 2",{"$f":"COUNT(D4,D8,D13,D16,D20,D25,D56,D30,D33,D40,D44,D49,D69,D52,D61,D66)","v":16},6,{"$f":"L5-M5-O5","v":2},{"$f":"COUNTIF($G$4:$G$75,J5)","v":8},{"$f":"SUM(D4,E8,E13,E16,D20,D25,E56,E30,D33,E40,D44,D49,E69,D52,E61,D66)","v":22},{"$f":"SUM(E4,D8,D13,D16,E20,E25,D56,D30,E33,D40,E44,E49,D69,E52,D61,E66)","v":36},{"$f":"P5-Q5","v":-14},{"$f":"M5*4+N5*2+O5*1","v":36},{"$f":"SUM(S5*1000000+R5*10000+P5*100+L5*10)","v":35862360}]
[3,{"$f":"'Calendrier BG'!N24","v":"FEN 1"},{"$f":"'Calendrier BG'!O24","v":"STAN 2"},3,1,"FEN 1","STAN 2",null,3,"STAN 1","Stanislas 1",{"$f":"COUNT(D4,D9,D14,D19,D23,D26,D59,D31,D34,D40,D45,D50,D70,D55,D62,D67)","v":16},10,3,3,{"$f":"SUM(E4,D9,E14,D19,D23,D26,E59,E31,D34,D40,E45,D50,E70,E55,E62,D67)","v":41},{"$f":"SUM(D4,E9,D14,E19,E23,E26,D59,D31,E34,E40,D45,E50,D70,D55,D62,E67)","v":14},27,49,49274260]
[4,{"$f":"'Calendrier BG'!N25","v":"MASS 2"},{"$f":"'Calendrier BG'!O25","v":"JBS 1"},3,0,"MASS 2","JBS 1",null,8,"STAN 2","Stanislas 2",{"$f":"COUNT(D6,D9,D16,D21,D24,D28,D60,D42,D35,D45,D48,D52,D71,D57,D64,D12)","v":16},3,1,12,{"$f":"SUM(E6,E9,D16,E21,D24,D28,E60,D42,D35,D45,E48,E52,E71,D57,E64,D12)","v":12},{"$f":"SUM(D6,D9,E16,D21,E24,E28,D60,E42,E35,E45,D48,D52,D71,E57,D64,E12)","v":48},-36,26,25641360]
[5,{"$f":"'Calendrier BG'!N26","v":"SJL 1"},{"$f":"'Calendrier BG'!O26","v":"SJL 2"},6,0,"SJL 1","SJL 2",null,2,"MASS 1","Massillon 1",{"$f":"COUNT(D5,D10,D13,D18,D21,D26,D62,D29,D36,D46,D49,D54,D72,D57,D65,D41)","v":16},10,4,2,{"$f":"SUM(E5,D10,D13,E18,D21,E26,D62,E29,D36,E46,E49,D54,E72,E57,D65,D41)","v":39},{"$f":"SUM(D5,E10,E13,D18,E21,D26,E62,D29,E36,D46,D49,E54,D72,D57,E65,E41)","v":14},25,50,50254060]
[6,{"$f":"'Calendrier BG'!N27","v":"STAN 1"},{"$f":"'Calendrier BG'!O27","v":"STAN 2"},2,0,"STAN 1","STAN 2",null,9,"MASS 2","Massillon 2",{"$f":"COUNT(D7,D10,D15,D19,D22,D25,D58,D28,D37,D43,D46,D51,D73,D55,D61,D64)","v":16},1,0,15,{"$f":"SUM(D7,E10,D15,E19,D22,E25,D58,E28,D37,E43,D46,E51,E73,D55,D61,D64)","v":15},{"$f":"SUM(E7,D10,E15,D19,E22,D25,E58,D28,E37,D43,E46,D51,D73,E55,E61,E64)","v":48},-33,19,18671660]
[7,{"$f":"'Calendrier BG'!N28","v":"MASS 1"},{"$f":"'Calendrier BG'!O28","v":"MASS 2"},1,0,"MASS 1","MASS 2",null,4,"FEN 1","Fénelon Ste Marie 1",{"$f":"COUNT(D6,D11,D15,D18,D23,D27,D51,D30,D38,D42,D47,D54,D74,D59,D63,D66)","v":16},{"$f":"COUNTIF($F$3:$F$75,J10)","v":8},1,7,{"$f":"SUM(D6,E11,E15,D18,E23,E27,D51,D30,D38,D42,D47,E54,E74,D59,D63,E66)","v":33},{"$f":"SUM(E6,D11,D15,E18,D23,D27,E51,E30,E38,E42,E47,D54,D74,E59,E63,D66)","v":24},9,41,41093460]
[8,{"$f":"'Calendrier BG'!N29","v":"JBS 1"},{"$f":"'Calendrier BG'!O29","v":"FEN 1"},0,5,"FEN 1","JBS 1",null,5,"JBS 1","Jean Baptiste La Salle 1",{"$f":"COUNT(D7,D11,D17,D20,D24,D29,D60,D43,D39,D47,D50,D53,D75,D56,D65,D14)","v":16},6,2,8,{"$f":"SUM(E7,D11,D17,E20,E24,D29,D60,D43,D39,E47,E50,E53,E75,D56,E65,D14)","v":23},{"$f":"SUM(D7,E11,E17,D20,D24,E29,E60,E43,E39,D47,D50,D53,D75,E56,D65,E14)","v":35},-12,36,{"$f":"SUM(S11*1000000+R11*10000+P11*100+L11*10)","v":35882460}]
[9,{"$f":"'Calendrier BG'!N30","v":"STAN 2"},{"$f":"'Calendrier BG'!O30","v":"SJL 1"},2,9,{"$f":"IF(D12<>\"\",IF(D12>E12,B12,IF(D12<E12,C12,\"nul\")),\"\")","v":"SJL 1"},"STAN 2",null,7,"ROC 1","Rocroy St Vincent 1",{"$f":"COUNT(D36,D34,D33,D37,D32,D35,D69,D39,D68,D38,D74,D73,D72,D70,D71,D75)","v":16},4,3,9,{"$f":"SUM(E36,E34,E33,E37,E32,E35,D69,E39,D68,E38,D74,D73,D72,D70,D71,D75)","v":14},{"$f":"SUM(D36,D34,D33,D37,D32,D35,E69,D39,E68,D38,E74,E73,E72,E70,E71,E75)","v":26},-12,31,30881560]
[10,{"$f":"'Calendrier BG'!N31","v":"MASS 1"},{"$f":"'Calendrier BG'!O31","v":"SJL 2"},1,0,"MASS 1","SJL 2"]
[11,{"$f":"'Calendrier BG'!N32","v":"JBS 1"},{"$f":"'Calendrier BG'!O32","v":"STAN 1"},0,2,"STAN 1","JBS 1",null,"Classement","SIGLE","Etablissement","Matchs joués","Victoires","Nuls ","Défaites","Buts Pour","Buts Contre","Différence","Points"]
[12,{"$f":"'Calendrier BG'!N33","v":"MASS 2"},{"$f":"'Calendrier BG'!O33","v":"FEN 1"},0,6,"FEN 1","MASS 2",null,1,{"$f":"VLOOKUP($I15,$I$3:$S$12,COLUMNS($J14:J14)+1,FALSE)","v":"SJL 1"},{"$f":"VLOOKUP($I15,$I$3:$S$12,COLUMNS($J14:K14)+1,FALSE)","v":"Saint Justin Levallois 1"},{"$f":"VLOOKUP($I15,$I$3:$S$12,COLUMNS($J14:L14)+1,FALSE)","v":16},{"$f":"VLOOKUP($I15,$I$3:$S$12,COLUMNS($J14:M14)+1,FALSE)","v":16},{"$f":"VLOOKUP($I15,$I$3:$S$12,COLUMNS($J14:N14)+1,FALSE)","v":0},{"$f":"VLOOKUP($I15,$I$3:$S$12,COLUMNS($J14:O14)+1,FALSE)","v":0},{"$f":"VLOOKUP($I15,$I$3:$S$12,COLUMNS($J14:P14)+1,FALSE)","v":68},{"$f":"VLOOKUP($I15,$I$3:$S$12,COLUMNS($J14:Q14)+1,FALSE)","v":8},{"$f":"VLOOKUP($I15,$I$3:$S$12,COLUMNS($J14:R14)+1,FALSE)","v":60},{"$f":"VLOOKUP($I15,$I$3:$S$12,COLUMNS($J14:S14)+1,FALSE)","v":64}]
[13,{"$f":"'Calendrier BG'!N34","v":"STAN 2"},{"$f":"'Calendrier BG'!O34","v":"SJL 2"},0,8,"SJL 2","STAN 2",null,2,{"$f":"VLOOKUP($I16,$I$3:$S$12,COLUMNS($J15:J15)+1,FALSE)","v":"MASS 1"},{"$f":"VLOOKUP($I16,$I$3:$S$12,COLUMNS($J15:K15)+1,FALSE)","v":"Massillon 1"},{"$f":"VLOOKUP($I16,$I$3:$S$12,COLUMNS($J15:L15)+1,FALSE)","v":16},{"$f":"VLOOKUP($I16,$I$3:$S$12,COLUMNS($J15:M15)+1,FALSE)","v":10},{"$f":"VLOOKUP($I16,$I$3:$S$12,COLUMNS($J15:N15)+1,FALSE)","v":4},{"$f":"VLOOKUP($I16,$I$3:$S$12,COLUMNS($J15:O15)+1,FALSE)","v":2},{"$f":"VLOOKUP($I16,$I$3:$S$12,COLUMNS($J15:P15)+1,FALSE)","v":39},{"$f":"VLOOKUP($I16,$I$3:$S$12,COLUMNS($J15:Q15)+1,FALSE)","v":14},{"$f":"VLOOKUP($I16,$I$3:$S$12,COLUMNS($J15:R15)+1,FALSE)","v":25},{"$f":"VLOOKUP($I16,$I$3:$S$12,COLUMNS($J15:S15)+1,FALSE)","v":50}]
[14,{"$f":"'Calendrier BG'!N35","v":"JBS 1"},{"$f":"'Calendrier BG'!O35","v":"SJL 1"},0,3,"SJL 1","JBS 1",null,3,{"$f":"VLOOKUP($I17,$I$3:$S$12,COLUMNS($J16:J16)+1,FALSE)","v":"STAN 1"},{"$f":"VLOOKUP($I17,$I$3:$S$12,COLUMNS($J16:K16)+1,FALSE)","v":"Stanislas 1"},{"$f":"VLOOKUP($I17,$I$3:$S$12,COLUMNS($J16:L16)+1,FALSE)","v":16},{"$f":"VLOOKUP($I17,$I$3:$S$12,COLUMNS($J16:M16)+1,FALSE)","v":10},{"$f":"VLOOKUP($I17,$I$3:$S$12,COLUMNS($J16:N16)+1,FALSE)","v":3},{"$f":"VLOOKUP($I17,$I$3:$S$12,COLUMNS($J16:O16)+1,FALSE)","v":3},{"$f":"VLOOKUP($I17,$I$3:$S$12,COLUMNS($J16:P16)+1,FALSE)","v":41},{"$f":"VLOOKUP($I17,$I$3:$S$12,COLUMNS($J16:Q16)+1,FALSE)","v":14},{"$f":"VLOOKUP($I17,$I$3:$S$12,COLUMNS($J16:R16)+1,FALSE)","v":27},{"$f":"VLOOKUP($I17,$I$3:$S$12,COLUMNS($J16:S16)+1,FALSE)","v":49}]
[15,{"$f":"'Calendrier BG'!N36","v":"FEN 1"},{"$f":"'Calendrier BG'!O36","v":"MASS 1"},0,1,"MASS 1","FEN 1",null,4,{"$f":"VLOOKUP($I18,$I$3:$S$12,COLUMNS($J17:J17)+1,FALSE)","v":"FEN 1"},{"$f":"VLOOKUP($I18,$I$3:$S$12,COLUMNS($J17:K17)+1,FALSE)","v":"Fénelon Ste Marie 1"},{"$f":"VLOOKUP($I18,$I$3:$S$12,COLUMNS($J17:L17)+1,FALSE)","v":16},{"$f":"VLOOKUP($I18,$I$3:$S$12,COLUMNS($J17:M17)+1,FALSE)","v":8},{"$f":"VLOOKUP($I18,$I$3:$S$12,COLUMNS($J17:N17)+1,FALSE)","v":1},{"$f":"VLOOKUP($I18,$I$3:$S$12,COLUMNS($J17:O17)+1,FALSE)","v":7},{"$f":"VLOOKUP($I18,$I$3:$S$12,COLUMNS($J17:P17)+1,FALSE)","v":33},{"$f":"VLOOKUP($I18,$I$3:$S$12,COLUMNS($J17:Q17)+1,FALSE)","v":24},{"$f":"VLOOKUP($I18,$I$3:$S$12,COLUMNS($J17:R17)+1,FALSE)","v":9},{"$f":"VLOOKUP($I18,$I$3:$S$12,COLUMNS($J17:S17)+1,FALSE)","v":41}]
[16,{"$f":"'Calendrier BG'!N37","v":"STAN 1"},{"$f":"'Calendrier BG'!O37","v":"MASS 2"},5,0,"STAN 1","MASS 2",null,5,{"$f":"VLOOKUP($I19,$I$3:$S$12,COLUMNS($J18:J18)+1,FALSE)","v":"JBS 1"},{"$f":"VLOOKUP($I19,$I$3:$S$12,COLUMNS($J18:K18)+1,FALSE)","v":"Jean Baptiste La Salle 1"},{"$f":"VLOOKUP($I19,$I$3:$S$12,COLUMNS($J18:L18)+1,FALSE)","v":16},{"$f":"VLOOKUP($I19,$I$3:$S$12,COLUMNS($J18:M18)+1,FALSE)","v":6},{"$f":"VLOOKUP($I19,$I$3:$S$12,COLUMNS($J18:N18)+1,FALSE)","v":2},{"$f":"VLOOKUP($I19,$I$3:$S$12,COLUMNS($J18:O18)+1,FALSE)","v":8},{"$f":"VLOOKUP($I19,$I$3:$S$12,COLUMNS($J18:P18)+1,FALSE)","v":23},{"$f":"VLOOKUP($I19,$I$3:$S$12,COLUMNS($J18:Q18)+1,FALSE)","v":35},{"$f":"VLOOKUP($I19,$I$3:$S$12,COLUMNS($J18:R18)+1,FALSE)","v":-12},{"$f":"VLOOKUP($I19,$I$3:$S$12,COLUMNS($J18:S18)+1,FALSE)","v":36}]
[17,{"$f":"'Calendrier BG'!N38","v":"SJL 2"},{"$f":"'Calendrier BG'!O38","v":"JBS 1"},0,0,"nul","nul",null,6,{"$f":"VLOOKUP($I20,$I$3:$S$12,COLUMNS($J19:J19)+1,FALSE)","v":"SJL 2"},{"$f":"VLOOKUP($I20,$I$3:$S$12,COLUMNS($J19:K19)+1,FALSE)","v":"Saint Justin Levallois 2"},{"$f":"VLOOKUP($I20,$I$3:$S$12,COLUMNS($J19:L19)+1,FALSE)","v":16},{"$f":"VLOOKUP($I20,$I$3:$S$12,COLUMNS($J19:M19)+1,FALSE)","v":6},{"$f":"VLOOKUP($I20,$I$3:$S$12,COLUMNS($J19:N19)+1,FALSE)","v":2},{"$f":"VLOOKUP($I20,$I$3:$S$12,COLUMNS($J19:O19)+1,FALSE)","v":8},{"$f":"VLOOKUP($I20,$I$3:$S$12,COLUMNS($J19:P19)+1,FALSE)","v":22},{"$f":"VLOOKUP($I20,$I$3:$S$12,COLUMNS($J19:Q19)+1,FALSE)","v":36},{"$f":"VLOOKUP($I20,$I$3:$S$12,COLUMNS($J19:R19)+1,FALSE)","v":-14},{"$f":"VLOOKUP($I20,$I$3:$S$12,COLUMNS($J19:S19)+1,FALSE)","v":36}]
[18,{"$f":"'Calendrier BG'!N39","v":"MASS 1"},{"$f":"'Calendrier BG'!O39","v":"STAN 2"},2,0,"MASS 1","STAN 2",null,7,{"$f":"VLOOKUP($I21,$I$3:$S$12,COLUMNS($J20:J20)+1,FALSE)","v":"ROC 1"},{"$f":"VLOOKUP($I21,$I$3:$S$12,COLUMNS($J20:K20)+1,FALSE)","v":"Rocroy St Vincent 1"},{"$f":"VLOOKUP($I21,$I$3:$S$12,COLUMNS($J20:L20)+1,FALSE)","v":16},{"$f":"VLOOKUP($I21,$I$3:$S$12,COLUMNS($J20:M20)+1,FALSE)","v":4},{"$f":"VLOOKUP($I21,$I$3:$S$12,COLUMNS($J20:N20)+1,FALSE)","v":3},{"$f":"VLOOKUP($I21,$I$3:$S$12,COLUMNS($J20:O20)+1,FALSE)","v":9},{"$f":"VLOOKUP($I21,$I$3:$S$12,COLUMNS($J20:P20)+1,FALSE)","v":14},{"$f":"VLOOKUP($I21,$I$3:$S$12,COLUMNS($J20:Q20)+1,FALSE)","v":26},{"$f":"VLOOKUP($I21,$I$3:$S$12,COLUMNS($J20:R20)+1,FALSE)","v":-12},{"$f":"VLOOKUP($I21,$I$3:$S$12,COLUMNS($J20:S20)+1,FALSE)","v":31}]
[19,{"$f":"'Calendrier BG'!N40","v":"MASS 2"},{"$f":"'Calendrier BG'!O40","v":"SJL 1"},0,3,"SJL 1","MASS 2",null,8,{"$f":"VLOOKUP($I22,$I$3:$S$12,COLUMNS($J21:J21)+1,FALSE)","v":"STAN 2"},{"$f":"VLOOKUP($I22,$I$3:$S$12,COLUMNS($J21:K21)+1,FALSE)","v":"Stanislas 2"},{"$f":"VLOOKUP($I22,$I$3:$S$12,COLUMNS($J21:L21)+1,FALSE)","v":16},{"$f":"VLOOKUP($I22,$I$3:$S$12,COLUMNS($J21:M21)+1,FALSE)","v":3},{"$f":"VLOOKUP($I22,$I$3:$S$12,COLUMNS($J21:N21)+1,FALSE)","v":1},{"$f":"VLOOKUP($I22,$I$3:$S$12,COLUMNS($J21:O21)+1,FALSE)","v":12},{"$f":"VLOOKUP($I22,$I$3:$S$12,COLUMNS($J21:P21)+1,FALSE)","v":12},{"$f":"VLOOKUP($I22,$I$3:$S$12,COLUMNS($J21:Q21)+1,FALSE)","v":48},{"$f":"VLOOKUP($I22,$I$3:$S$12,COLUMNS($J21:R21)+1,FALSE)","v":-36},{"$f":"VLOOKUP($I22,$I$3:$S$12,COLUMNS($J21:S21)+1,FALSE)","v":26}]
[20,{"$f":"'Calendrier BG'!N41","v":"STAN 1"},{"$f":"'Calendrier BG'!O41","v":"FEN 1"},3,1,"STAN 1","FEN 1",null,9,{"$f":"VLOOKUP($I23,$I$3:$S$12,COLUMNS($J22:J22)+1,FALSE)","v":"MASS 2"},{"$f":"VLOOKUP($I23,$I$3:$S$12,COLUMNS($J22:K22)+1,FALSE)","v":"Massillon 2"},{"$f":"VLOOKUP($I23,$I$3:$S$12,COLUMNS($J22:L22)+1,FALSE)","v":16},{"$f":"VLOOKUP($I23,$I$3:$S$12,COLUMNS($J22:M22)+1,FALSE)","v":1},{"$f":"VLOOKUP($I23,$I$3:$S$12,COLUMNS($J22:N22)+1,FALSE)","v":0},{"$f":"VLOOKUP($I23,$I$3:$S$12,COLUMNS($J22:O22)+1,FALSE)","v":15},{"$f":"VLOOKUP($I23,$I$3:$S$12,COLUMNS($J22:P22)+1,FALSE)","v":15},{"$f":"VLOOKUP($I23,$I$3:$S$12,COLUMNS($J22:Q22)+1,FALSE)","v":48},{"$f":"VLOOKUP($I23,$I$3:$S$12,COLUMNS($J22:R22)+1,FALSE)","v":-33},{"$f":"VLOOKUP($I23,$I$3:$S$12,COLUMNS($J22:S22)+1,FALSE)","v":19}]
[21,{"$f":"'Calendrier BG'!N42","v":"STAN 2"},{"$f":"'Calendrier BG'!O42","v":"JBS 1"},0,1,"JBS 1","STAN 2"]
[22,{"$f":"'Calendrier BG'!N43","v":"SJL 2"},{"$f":"'Calendrier BG'!O43","v":"MASS 2"},2,1,"SJL 2","MASS 2"]
[23,{"$f":"'Calendrier BG'!N44","v":"STAN 1"},{"$f":"'Calendrier BG'!O44","v":"MASS 1"},1,1,"nul","nul"]
[24,{"$f":"'Calendrier BG'!N45","v":"SJL 1"},{"$f":"'Calendrier BG'!O45","v":"FEN 1"},2,1,"SJL 1","FEN 1"]
[25,{"$f":"'Calendrier BG'!N46","v":"STAN 2"},{"$f":"'Calendrier BG'!O46","v":"MASS 2"},1,0,"STAN 2","MASS 2"]
[26,{"$f":"'Calendrier BG'!N47","v":"JBS 1"},{"$f":"'Calendrier BG'!O47","v":"MASS 1"},0,6,"MASS 1","JBS 1"]
[27,{"$f":"'Calendrier BG'!N48","v":"FEN 1"},{"$f":"'Calendrier BG'!O48","v":"SJL 2"},5,1,"FEN 1","SJL 2"]
[28,{"$f":"'Calendrier BG'!N49","v":"SJL 1"},{"$f":"'Calendrier BG'!O49","v":"STAN 1"},5,2,"SJL 1","STAN 1"]
[29,{"$f":"'Calendrier BG'!N50","v":"SJL 1"},{"$f":"'Calendrier BG'!O50","v":"ROC 1"},1,0,"SJL 1","ROC 1"]
[30,{"$f":"'Calendrier BG'!N51","v":"SJL 2"},{"$f":"'Calendrier BG'!O51","v":"ROC 1"},3,0,"SJL 2","ROC 1"]
[31,{"$f":"'Calendrier BG'!N52","v":"STAN 1"},{"$f":"'Calendrier BG'!O52","v":"ROC 1"},2,1,"STAN 1","ROC 1"]
[32,{"$f":"'Calendrier BG'!N53","v":"STAN 2"},{"$f":"'Calendrier BG'!O53","v":"ROC 1"},1,0,"STAN 2","ROC 1"]
[33,{"$f":"'Calendrier BG'!N54","v":"MASS 1"},{"$f":"'Calendrier BG'!O54","v":"ROC 1"},0,0,"nul","nul"]
[34,{"$f":"'Calendrier BG'!N55","v":"MASS 2"},{"$f":"'Calendrier BG'!O55","v":"ROC 1"},0,1,"ROC 1","MASS 2"]
[35,{"$f":"'Calendrier BG'!N56","v":"FEN 1"},{"$f":"'Calendrier BG'!O56","v":"ROC 1"},2,0,"FEN 1","ROC 1"]
[36,{"$f":"'Calendrier BG'!N57","v":"JBS 1"},{"$f":"'Calendrier BG'!O57","v":"ROC 1"},1,3,"ROC 1","JBS 1"]
[37,{"$f":"'Calendrier BG'!N58","v":"STAN 1"},{"$f":"'Calendrier BG'!O58","v":"SJL 2"},2,0,"STAN 1","SJL 2"]
[38,{"$f":"'Calendrier BG'!N59","v":"MASS 1"},{"$f":"'Calendrier BG'!O59","v":"SJL 1"},0,4,"SJL 1","MASS 1"]
[39,{"$f":"'Calendrier BG'!N60","v":"STAN 2"},{"$f":"'Calendrier BG'!O60","v":"FEN 1"},2,5,"FEN 1","STAN 2"]
[40,{"$f":"'Calendrier BG'!N61","v":"JBS 1"},{"$f":"'Calendrier BG'!O61","v":"MASS 2"},6,0,"JBS 1","MASS 2"]
[41,{"$f":"'Calendrier BG'!N62","v":"SJL 2"},{"$f":"'Calendrier BG'!O62","v":"SJL 1"},0,4,"SJL 1","SJL 2"]
[42,{"$f":"'Calendrier BG'!N63","v":"STAN 2"},{"$f":"'Calendrier BG'!O63","v":"STAN 1"},0,4,"STAN 1","STAN 2"]
[43,{"$f":"'Calendrier BG'!N64","v":"MASS 2"},{"$f":"'Calendrier BG'!O64","v":"MASS 1"},0,3,{"$f":"IF(D46<>\"\",IF(D46>E46,B46,IF(D46<E46,C46,\"nul\")),\"\")","v":"MASS 1"},{"$f":"IF(E46<>\"\",IF(E46<D46,C46,IF(E46>D46,B46,\"nul\")),\"\")","v":"MASS 2"}]
[44,{"$f":"'Calendrier BG'!N65","v":"FEN 1"},{"$f":"'Calendrier BG'!O65","v":"JBS 1"},3,0,"FEN 1","JBS 1"]
[45,{"$f":"'Calendrier BG'!N66","v":"SJL 1"},{"$f":"'Calendrier BG'!O66","v":"STAN 2"},5,1,"SJL 1","STAN 2"]
[46,{"$f":"'Calendrier BG'!N67","v":"SJL 2"},{"$f":"'Calendrier BG'!O67","v":"MASS 1"},1,6,"MASS 1","SJL 2"]
[47,{"$f":"'Calendrier BG'!N68","v":"STAN 1"},{"$f":"'Calendrier BG'!O68","v":"JBS 1"},2,3,"JBS 1","STAN 1"]
[48,{"$f":"'Calendrier BG'!N69","v":"FEN 1"},{"$f":"'Calendrier BG'!O69","v":"MASS 2"},2,0,"FEN 1","MASS 2"]
[49,{"$f":"'Calendrier BG'!N70","v":"SJL 2"},{"$f":"'Calendrier BG'!O70","v":"STAN 2"},1,0,"SJL 2","STAN 2"]
[50,{"$f":"'Calendrier BG'!N71","v":"SJL 1"},{"$f":"'Calendrier BG'!O71","v":"JBS 1"},4,1,"SJL 1","JBS 1"]
[51,{"$f":"'Calendrier BG'!N72","v":"MASS 1"},{"$f":"'Calendrier BG'!O72","v":"FEN 1"},5,1,"MASS 1","FEN 1"]
[52,{"$f":"'Calendrier BG'!N73","v":"MASS 2"},{"$f":"'Calendrier BG'!O73","v":"STAN 1"},0,6,"STAN 1","MASS 2"]
[53,{"$f":"'Calendrier BG'!N74","v":"JBS 1"},{"$f":"'Calendrier BG'!O74","v":"SJL 2"},3,1,"JBS 1","SJL 2"]
[54,{"$f":"'Calendrier BG'!N75","v":"STAN 2"},{"$f":"'Calendrier BG'!O75","v":"MASS 1"},0,3,"MASS 1","STAN 2"]
[55,{"$f":"'Calendrier BG'!N76","v":"SJL 1"},{"$f":"'Calendrier BG'!O76","v":"MASS 2"},10,0,"SJL 1","MASS 2"]
[56,{"$f":"'Calendrier BG'!N77","v":"FEN 1"},{"$f":"'Calendrier BG'!O77","v":"STAN 1"},0,0,"nul","nul"]
[57,{"$f":"'Calendrier BG'!N78","v":"JBS 1"},{"$f":"'Calendrier BG'!O78","v":"STAN 2"},4,0,"JBS 1","STAN 2"]
[58,{"$f":"'Calendrier BG'!N79","v":"MASS 2"},{"$f":"'Calendrier BG'!O79","v":"SJL 2"},1,4,"SJL 2","MASS 2"]
[59,{"$f":"'Calendrier BG'!N80","v":"MASS 1"},{"$f":"'Calendrier BG'!O80","v":"STAN 1"},1,1,"nul","nul"]
[60,{"$f":"'Calendrier BG'!N81","v":"FEN 1"},{"$f":"'Calendrier BG'!O81","v":"SJL 1"},1,3,"SJL 1","FEN 1"]
[61,{"$f":"'Calendrier BG'!N82","v":"MASS 2"},{"$f":"'Calendrier BG'!O82","v":"STAN 2"},0,3,"STAN 2","MASS 2"]
[62,{"$f":"'Calendrier BG'!N83","v":"MASS 1"},{"$f":"'Calendrier BG'!O83","v":"JBS 1"},2,2,"nul","nul"]
[63,{"$f":"'Calendrier BG'!N84","v":"SJL 2"},{"$f":"'Calendrier BG'!O84","v":"FEN 1"},1,0,"SJL 2","FEN 1"]
[64,{"$f":"'Calendrier BG'!N85","v":"STAN 1"},{"$f":"'Calendrier BG'!O85","v":"SJL 1"},0,2,{"$f":"IF(D67<>\"\",IF(D67>E67,B67,IF(D67<E67,C67,\"nul\")),\"\")","v":"SJL 1"},{"$f":"IF(E67<>\"\",IF(E67<D67,C67,IF(E67>D67,B67,\"nul\")),\"\")","v":"STAN 1"}]
[65,{"$f":"'Calendrier BG'!N86","v":"ROC 1"},{"$f":"'Calendrier BG'!O86","v":"SJL 1"},0,3,"SJL 1","ROC 1"]
[66,{"$f":"'Calendrier BG'!N87","v":"ROC 1"},{"$f":"'Calendrier BG'!O87","v":"SJL 2"},0,0,"nul","nul"]
[67,{"$f":"'Calendrier BG'!N88","v":"ROC 1"},{"$f":"'Calendrier BG'!O88","v":"STAN 1"},0,2,"STAN 1","ROC 1"]
[68,{"$f":"'Calendrier BG'!N89","v":"ROC 1"},{"$f":"'Calendrier BG'!O89","v":"STAN 2"},1,1,"nul","nul"]
[69,{"$f":"'Calendrier BG'!N90","v":"ROC 1"},{"$f":"'Calendrier BG'!O90","v":"MASS 1"},0,7,"MASS 1","ROC 1"]
[70,{"$f":"'Calendrier BG'!N91","v":"ROC 1"},{"$f":"'Calendrier BG'!O91","v":"MASS 2"},5,0,"ROC 1","MASS 2"]
[71,{"$f":"'Calendrier BG'!N92","v":"ROC 1"},{"$f":"'Calendrier BG'!O92","v":"FEN 1"},2,1,"ROC 1","FEN 1"]
[72,{"$f":"'Calendrier BG'!N93","v":"ROC 1"},{"$f":"'Calendrier BG'!O93","v":"JBS 1"},1,2,"JBS 1","ROC 1"]

{"sheet":"Cls B2 et B3","index":3,"n_rows":99,"n_cols":20,"rows_kept":99,"cut":false,"hidden":false,"merged":[[78,1,78,2],[78,3,78,4],[2,1,2,2],[2,3,2,4],[0,0,1,6],[25,0,26,6],[27,1,27,2],[27,3,27,4],[48,0,50,19],[51,0,52,6],[53,1,53,2],[53,3,53,4],[76,0,77,6]]}
["BENJAMINS DIVISION 2 POULE A"]
[]
["N° Match","Match",null,"Scores",null,"Vainqueur","Perdant",null,null,"SIGLE","Etablissement","Matchs joués","Victoires","Nuls ","Défaites","Buts Pour","Buts Contre","Différence","Points"]
[73,{"$f":"'Calendrier BG'!T22","v":"SANO"},{"$f":"'Calendrier BG'!U22","v":"STAN 3"},4,1,{"$f":"IF(D4<>\"\",IF(D4>E4,B4,IF(D4<E4,C4,\"nul\")),\"\")","v":"SANO"},{"$f":"IF(E4<>\"\",IF(E4<D4,C4,IF(E4>D4,B4,\"nul\")),\"\")","v":"STAN 3"},null,{"$f":"RANK(T4,$T$4:$T$8)","v":1},"SANO","Saint André Nogent ",{"$f":"COUNT(D4,D6,D9,D11,D14,D16,D19,D21)","v":8},{"$f":"COUNTIF($F$3:$F$37,J4)","v":7},{"$f":"L4-M4-O4","v":1},{"$f":"COUNTIF(G3:G37,J4)","v":0},{"$f":"SUM(D4,E6,D9,E11,E14,D16,E19,D21)","v":31},{"$f":"SUM(E4,D6,E9,D11,D14,E16,D19,E21)","v":3},{"$f":"P4-Q4","v":28},{"$f":"M4*4+N4*2+O4*1","v":30},{"$f":"SUM(S4*1000000+R4*10000+P4*100+L4*10)","v":30283180}]
[74,{"$f":"'Calendrier BG'!T23","v":"BND"},{"$f":"'Calendrier BG'!U23","v":"FEN 2"},3,0,{"$f":"IF(D5<>\"\",IF(D5>E5,B5,IF(D5<E5,C5,\"nul\")),\"\")","v":"BND"},{"$f":"IF(E5<>\"\",IF(E5<D5,C5,IF(E5>D5,B5,\"nul\")),\"\")","v":"FEN 2"},null,{"$f":"RANK(T5,$T$4:$T$8)","v":2},"BND","Bossuet Notre Dame",{"$f":"COUNT(D4,D7,D10,D13,D14,D17,D20,D23)","v":8},{"$f":"COUNTIF($F$3:$F$37,J5)","v":5},2,{"$f":"COUNTIF(G3:G38,J5)","v":1},{"$f":"SUM(E4,D7,D10,E13,D14,E17,E20,D23)","v":16},{"$f":"SUM(D4,E7,E10,D13,E14,D17,D20,E23)","v":18},{"$f":"P5-Q5","v":-2},{"$f":"M5*4+N5*2+O5*1","v":25},{"$f":"SUM(S5*1000000+R5*10000+P5*100+L5*10)","v":24981680}]
[75,{"$f":"'Calendrier BG'!T24","v":"SJL 3"},{"$f":"'Calendrier BG'!U24","v":"SANO"},0,3,"SANO","SJL 3",null,{"$f":"RANK(T6,$T$4:$T$8)","v":5},"STAN 3","Stanislas 3",{"$f":"COUNT(D5,D7,D9,D12,D15,D17,D19,D22)","v":8},{"$f":"COUNTIF($F$3:$F$37,J6)","v":3},1,{"$f":"COUNTIF(G3:G39,J6)","v":4},{"$f":"SUM(D5,E7,E9,D12,E15,D17,D19,E22)","v":15},{"$f":"SUM(E5,D7,D9,E12,D15,E17,E19,D22)","v":9},{"$f":"P6-Q6","v":6},18,18061580]
[76,{"$f":"'Calendrier BG'!T25","v":"STAN 3"},{"$f":"'Calendrier BG'!U25","v":"BND"},1,2,"BND","STAN 3",null,{"$f":"RANK(T7,$T$4:$T$8)","v":4},"STAN 4","Stanislas 4",{"$f":"COUNT(D5,D8,D11,D13,D15,D18,D21,D23)","v":8},{"$f":"COUNTIF($F$3:$F$37,J7)","v":3},3,{"$f":"COUNTIF(G3:G40,J7)","v":2},{"$f":"SUM(E5,E8,D11,D13,D15,D18,E21,E23)","v":8},{"$f":"SUM(D5,D8,E11,E13,E15,E18,D21,D23)","v":26},-18,20,19820880]
[77,{"$f":"'Calendrier BG'!T26","v":"SJL 3"},{"$f":"'Calendrier BG'!U26","v":"FEN 2"},1,2,"FEN 2","SJL 3",null,{"$f":"RANK(T8,$T$4:$T$8)","v":3},"ASVP","Saint Vincent de Paul",{"$f":"COUNT(D6,D10,D12,D16,D18,D20,D22,D8)","v":8},{"$f":"COUNTIF($F$3:$F$37,J8)","v":3},5,{"$f":"COUNTIF(G3:G41,J8)","v":0},{"$f":"SUM(D6,E10,E12,E16,E18,D20,D22,D8)","v":5},{"$f":"SUM(E6,D10,D12,D16,D18,E20,E22,E8)","v":19},-14,22,21860580]
[78,{"$f":"'Calendrier BG'!T27","v":"SANO"},{"$f":"'Calendrier BG'!U27","v":"BND"},4,0,"SANO","BND"]
[79,{"$f":"'Calendrier BG'!T28","v":"STAN 3"},{"$f":"'Calendrier BG'!U28","v":"SJL 3"},4,2,"STAN 3","SJL 3",null,"Classement","SIGLE","Etablissement","Matchs joués","Victoires","Nuls ","Défaites","Buts Pour","Buts Contre","Différence","Points"]
[80,{"$f":"'Calendrier BG'!T29","v":"FEN 2"},{"$f":"'Calendrier BG'!U29","v":"SANO"},0,7,"SANO","FEN 2",null,1,{"$f":"VLOOKUP($I11,$I$3:$S$8,COLUMNS($J10:J10)+1,FALSE)","v":"SANO"},{"$f":"VLOOKUP($I11,$I$3:$S$8,COLUMNS($J10:K10)+1,FALSE)","v":"Saint André Nogent "},{"$f":"VLOOKUP($I11,$I$3:$S$8,COLUMNS($J10:L10)+1,FALSE)","v":8},{"$f":"VLOOKUP($I11,$I$3:$S$8,COLUMNS($J10:M10)+1,FALSE)","v":7},{"$f":"VLOOKUP($I11,$I$3:$S$8,COLUMNS($J10:N10)+1,FALSE)","v":1},{"$f":"VLOOKUP($I11,$I$3:$S$8,COLUMNS($J10:O10)+1,FALSE)","v":0},{"$f":"VLOOKUP($I11,$I$3:$S$8,COLUMNS($J10:P10)+1,FALSE)","v":31},{"$f":"VLOOKUP($I11,$I$3:$S$8,COLUMNS($J10:Q10)+1,FALSE)","v":3},{"$f":"VLOOKUP($I11,$I$3:$S$8,COLUMNS($J10:R10)+1,FALSE)","v":28},{"$f":"VLOOKUP($I11,$I$3:$S$8,COLUMNS($J10:S10)+1,FALSE)","v":30}]
[81,{"$f":"'Calendrier BG'!T30","v":"BND"},{"$f":"'Calendrier BG'!U30","v":"SJL 3"},2,0,"BND","SJL 3",null,2,{"$f":"VLOOKUP($I12,$I$3:$S$8,COLUMNS($J11:J11)+1,FALSE)","v":"BND"},{"$f":"VLOOKUP($I12,$I$3:$S$8,COLUMNS($J11:K11)+1,FALSE)","v":"Bossuet Notre Dame"},{"$f":"VLOOKUP($I12,$I$3:$S$8,COLUMNS($J11:L11)+1,FALSE)","v":8},{"$f":"VLOOKUP($I12,$I$3:$S$8,COLUMNS($J11:M11)+1,FALSE)","v":5},{"$f":"VLOOKUP($I12,$I$3:$S$8,COLUMNS($J11:N11)+1,FALSE)","v":2},{"$f":"VLOOKUP($I12,$I$3:$S$8,COLUMNS($J11:O11)+1,FALSE)","v":1},{"$f":"VLOOKUP($I12,$I$3:$S$8,COLUMNS($J11:P11)+1,FALSE)","v":16},{"$f":"VLOOKUP($I12,$I$3:$S$8,COLUMNS($J11:Q11)+1,FALSE)","v":18},{"$f":"VLOOKUP($I12,$I$3:$S$8,COLUMNS($J11:R11)+1,FALSE)","v":-2},{"$f":"VLOOKUP($I12,$I$3:$S$8,COLUMNS($J11:S11)+1,FALSE)","v":25}]
[82,{"$f":"'Calendrier BG'!T31","v":"FEN 2"},{"$f":"'Calendrier BG'!U31","v":"STAN 3"},3,3,"nul","nul",null,3,{"$f":"VLOOKUP($I13,$I$3:$S$8,COLUMNS($J12:J12)+1,FALSE)","v":"ASVP"},{"$f":"VLOOKUP($I13,$I$3:$S$8,COLUMNS($J12:K12)+1,FALSE)","v":"Saint Vincent de Paul"},{"$f":"VLOOKUP($I13,$I$3:$S$8,COLUMNS($J12:L12)+1,FALSE)","v":8},{"$f":"VLOOKUP($I13,$I$3:$S$8,COLUMNS($J12:M12)+1,FALSE)","v":3},{"$f":"VLOOKUP($I13,$I$3:$S$8,COLUMNS($J12:N12)+1,FALSE)","v":5},{"$f":"VLOOKUP($I13,$I$3:$S$8,COLUMNS($J12:O12)+1,FALSE)","v":0},{"$f":"VLOOKUP($I13,$I$3:$S$8,COLUMNS($J12:P12)+1,FALSE)","v":5},{"$f":"VLOOKUP($I13,$I$3:$S$8,COLUMNS($J12:Q12)+1,FALSE)","v":19},{"$f":"VLOOKUP($I13,$I$3:$S$8,COLUMNS($J12:R12)+1,FALSE)","v":-14},{"$f":"VLOOKUP($I13,$I$3:$S$8,COLUMNS($J12:S12)+1,FALSE)","v":22}]
[83,{"$f":"'Calendrier BG'!T32","v":"STAN 3"},{"$f":"'Calendrier BG'!U32","v":"SANO"},1,3,"SANO","STAN 3",null,4,{"$f":"VLOOKUP($I14,$I$3:$S$8,COLUMNS($J13:J13)+1,FALSE)","v":"STAN 4"},{"$f":"VLOOKUP($I14,$I$3:$S$8,COLUMNS($J13:K13)+1,FALSE)","v":"Stanislas 4"},{"$f":"VLOOKUP($I14,$I$3:$S$8,COLUMNS($J13:L13)+1,FALSE)","v":8},{"$f":"VLOOKUP($I14,$I$3:$S$8,COLUMNS($J13:M13)+1,FALSE)","v":3},{"$f":"VLOOKUP($I14,$I$3:$S$8,COLUMNS($J13:N13)+1,FALSE)","v":3},{"$f":"VLOOKUP($I14,$I$3:$S$8,COLUMNS($J13:O13)+1,FALSE)","v":2},{"$f":"VLOOKUP($I14,$I$3:$S$8,COLUMNS($J13:P13)+1,FALSE)","v":8},{"$f":"VLOOKUP($I14,$I$3:$S$8,COLUMNS($J13:Q13)+1,FALSE)","v":26},{"$f":"VLOOKUP($I14,$I$3:$S$8,COLUMNS($J13:R13)+1,FALSE)","v":-18},{"$f":"VLOOKUP($I14,$I$3:$S$8,COLUMNS($J13:S13)+1,FALSE)","v":20}]
[84,{"$f":"'Calendrier BG'!T33","v":"FEN 2"},{"$f":"'Calendrier BG'!U33","v":"BND"},1,1,"nul","nul",null,5,{"$f":"VLOOKUP($I15,$I$3:$S$8,COLUMNS($J14:J14)+1,FALSE)","v":"STAN 3"},{"$f":"VLOOKUP($I15,$I$3:$S$8,COLUMNS($J14:K14)+1,FALSE)","v":"Stanislas 3"},{"$f":"VLOOKUP($I15,$I$3:$S$8,COLUMNS($J14:L14)+1,FALSE)","v":8},{"$f":"VLOOKUP($I15,$I$3:$S$8,COLUMNS($J14:M14)+1,FALSE)","v":3},{"$f":"VLOOKUP($I15,$I$3:$S$8,COLUMNS($J14:N14)+1,FALSE)","v":1},{"$f":"VLOOKUP($I15,$I$3:$S$8,COLUMNS($J14:O14)+1,FALSE)","v":4},{"$f":"VLOOKUP($I15,$I$3:$S$8,COLUMNS($J14:P14)+1,FALSE)","v":15},{"$f":"VLOOKUP($I15,$I$3:$S$8,COLUMNS($J14:Q14)+1,FALSE)","v":9},{"$f":"VLOOKUP($I15,$I$3:$S$8,COLUMNS($J14:R14)+1,FALSE)","v":6},{"$f":"VLOOKUP($I15,$I$3:$S$8,COLUMNS($J14:S14)+1,FALSE)","v":18}]
[85,{"$f":"'Calendrier BG'!T34","v":"SANO"},{"$f":"'Calendrier BG'!U34","v":"SJL 3"},3,0,"SANO","SJL 3"]
[86,{"$f":"'Calendrier BG'!T35","v":"BND"},{"$f":"'Calendrier BG'!U35","v":"STAN 3"},4,1,"BND","STAN 3"]
[87,{"$f":"'Calendrier BG'!T36","v":"FEN 2"},{"$f":"'Calendrier BG'!U36","v":"SJL 3"},2,1,"FEN 2","SJL 3"]
[88,{"$f":"'Calendrier BG'!T37","v":"BND"},{"$f":"'Calendrier BG'!U37","v":"SANO"},1,1,"nul","nul"]
[89,{"$f":"'Calendrier BG'!T38","v":"SJL 3"},{"$f":"'Calendrier BG'!U38","v":"STAN 3"},0,1,"STAN 3","SJL 3"]
[90,{"$f":"'Calendrier BG'!T39","v":"SANO"},{"$f":"'Calendrier BG'!U39","v":"FEN 2"},6,0,"SANO","FEN 2"]
[91,{"$f":"'Calendrier BG'!T40","v":"SJL 3"},{"$f":"'Calendrier BG'!U40","v":"BND"},1,2,"BND","SJL 3"]
[92,{"$f":"'Calendrier BG'!T41","v":"STAN 3"},{"$f":"'Calendrier BG'!U41","v":"FEN 2"},4,0,"STAN 3","FEN 2"]
[]
[]
["BENJAMINS DIVISION 2 POULE B"]
[]
["N° Match","Match",null,"Scores",null,"Vainqueur","Perdant",null,null,"SIGLE","Etablissement","Matchs joués","Victoires","Nuls ","Défaites","Buts Pour","Buts Contre","Différence","Points"]
[93,{"$f":"'Calendrier BG'!Z22","v":"STAN 4"},{"$f":"'Calendrier BG'!AA22","v":"ASVP"},0,2,{"$f":"IF(D29<>\"\",IF(D29>E29,B29,IF(D29<E29,C29,\"nul\")),\"\")","v":"ASVP"},{"$f":"IF(E29<>\"\",IF(E29<D29,C29,IF(E29>D29,B29,\"nul\")),\"\")","v":"STAN 4"},null,{"$f":"RANK(T29,$T$29:$T$33)","v":2},"SJL 3","Saint Justin Levallois 3",{"$f":"COUNT(D29,D31,D34,D36,D39,D41,D44,D46)","v":8},{"$f":"COUNTIF($F$29:$F$48,J29)","v":0},{"$f":"L29-M29-O29","v":8},{"$f":"COUNTIF(G28:G48,J29)","v":0},{"$f":"SUM(D29,E31,D34,E36,E39,D41,E44,D46)","v":20},{"$f":"SUM(E29,D31,E34,D36,D39,E41,D44,E46)","v":11},{"$f":"P29-Q29","v":9},{"$f":"M29*4+N29*2+O29*1","v":16},{"$f":"SUM(S29*1000000+R29*10000+P29*100+L29*10)","v":16092080}]
[94,{"$f":"'Calendrier BG'!Z23","v":"FEN 3"},{"$f":"'Calendrier BG'!AA23","v":"JBS 2"},2,2,{"$f":"IF(D30<>\"\",IF(D30>E30,B30,IF(D30<E30,C30,\"nul\")),\"\")","v":"nul"},{"$f":"IF(E30<>\"\",IF(E30<D30,C30,IF(E30>D30,B30,\"nul\")),\"\")","v":"nul"},null,{"$f":"RANK(T30,$T$29:$T$35)","v":1},"FEN 2","Fénelon Ste Marie 2",{"$f":"COUNT(D29,D32,D35,D38,D39,D42,D45,D48)","v":8},{"$f":"COUNTIF($F$29:$F$48,J30)","v":0},{"$f":"L30-M30-O30","v":8},{"$f":"COUNTIF(G29:G49,J30)","v":0},{"$f":"SUM(E29,D32,D35,E38,D39,E42,E45,D48)","v":18},{"$f":"SUM(D29,E32,E35,D38,E39,D42,D45,E48)","v":1},{"$f":"P30-Q30","v":17},{"$f":"M30*4+N30*2+O30*1","v":16},{"$f":"SUM(S30*1000000+R30*10000+P30*100+L30*10)","v":16171880}]
[95,{"$f":"'Calendrier BG'!Z24","v":"ROC 2"},{"$f":"'Calendrier BG'!AA24","v":"STAN 4"},3,6,"STAN 4","ROC 2",null,{"$f":"RANK(T31,$T$29:$T$35)","v":4},"FEN 3","Fénelon Ste Marie 3",{"$f":"COUNT(D30,D32,D34,D37,D40,D42,D44,D47)","v":8},1,3,4,{"$f":"SUM(D30,E32,E34,D37,E40,D42,D44,E47)","v":10},{"$f":"SUM(E30,D32,D34,E37,D40,E42,E44,D47)","v":14},{"$f":"P31-Q31","v":-4},14,13961080]
[96,{"$f":"'Calendrier BG'!Z25","v":"ASVP"},{"$f":"'Calendrier BG'!AA25","v":"FEN 3"},3,0,"ASVP","FEN 3",null,{"$f":"RANK(T32,$T$29:$T$35)","v":3},"JBS 2","Jean Baptiste La Salle 2",{"$f":"COUNT(D30,D33,D36,D38,D40,D43,D46,D48)","v":8},2,1,5,{"$f":"SUM(E30,E33,D36,D38,D40,D43,E46,E48)","v":12},{"$f":"SUM(D30,D33,E36,E38,E40,E43,D46,D48)","v":22},{"$f":"P32-Q32","v":-10},15,14901280]
[97,{"$f":"'Calendrier BG'!Z26","v":"ROC 2"},{"$f":"'Calendrier BG'!AA26","v":"JBS 2"},4,0,"ROC 2","JBS 2",null,{"$f":"RANK(T33,$T$29:$T$35)","v":5},"ROC 2","Rocroy 2",{"$f":"COUNT(D31,D35,D37,D41,D43,D45,D47,D33)","v":8},1,2,5,{"$f":"SUM(D31,E35,E37,E41,E43,D45,D47,D33)","v":8},{"$f":"SUM(E31,D35,D37,D41,D43,E45,E47,E33)","v":20},-12,13,12880880]
[98,{"$f":"'Calendrier BG'!Z27","v":"STAN 4"},{"$f":"'Calendrier BG'!AA27","v":"FEN 3"},2,0,"STAN 4","FEN 3"]
[99,{"$f":"'Calendrier BG'!Z28","v":"ASVP"},{"$f":"'Calendrier BG'!AA28","v":"ROC 2"},1,0,"ASVP","ROC 2",null,"Classement","SIGLE","Etablissement","Matchs joués","Victoires","Nuls ","Défaites","Buts Pour","Buts Contre","Différence","Points"]
[100,{"$f":"'Calendrier BG'!Z29","v":"JBS 2"},{"$f":"'Calendrier BG'!AA29","v":"STAN 4"},2,5,"STAN 4","JBS 2",null,1,{"$f":"VLOOKUP($I36,$I$28:$S$33,COLUMNS($J35:J35)+1,FALSE)","v":"FEN 2"},{"$f":"VLOOKUP($I36,$I$28:$S$33,COLUMNS($J35:K35)+1,FALSE)","v":"Fénelon Ste Marie 2"},{"$f":"VLOOKUP($I36,$I$28:$S$33,COLUMNS($J35:L35)+1,FALSE)","v":8},{"$f":"VLOOKUP($I36,$I$28:$S$33,COLUMNS($J35:M35)+1,FALSE)","v":0},{"$f":"VLOOKUP($I36,$I$28:$S$33,COLUMNS($J35:N35)+1,FALSE)","v":8},{"$f":"VLOOKUP($I36,$I$28:$S$33,COLUMNS($J35:O35)+1,FALSE)","v":0},{"$f":"VLOOKUP($I36,$I$28:$S$33,COLUMNS($J35:P35)+1,FALSE)","v":18},{"$f":"VLOOKUP($I36,$I$28:$S$33,COLUMNS($J35:Q35)+1,FALSE)","v":1},{"$f":"VLOOKUP($I36,$I$28:$S$33,COLUMNS($J35:R35)+1,FALSE)","v":17},{"$f":"VLOOKUP($I36,$I$28:$S$33,COLUMNS($J35:S35)+1,FALSE)","v":16}]
[101,{"$f":"'Calendrier BG'!Z30","v":"FEN 3"},{"$f":"'Calendrier BG'!AA30","v":"ROC 2"},1,1,"nul","nul",null,2,{"$f":"VLOOKUP($I37,$I$28:$S$33,COLUMNS($J36:J36)+1,FALSE)","v":"SJL 3"},{"$f":"VLOOKUP($I37,$I$28:$S$33,COLUMNS($J36:K36)+1,FALSE)","v":"Saint Justin Levallois 3"},{"$f":"VLOOKUP($I37,$I$28:$S$33,COLUMNS($J36:L36)+1,FALSE)","v":8},{"$f":"VLOOKUP($I37,$I$28:$S$33,COLUMNS($J36:M36)+1,FALSE)","v":0},{"$f":"VLOOKUP($I37,$I$28:$S$33,COLUMNS($J36:N36)+1,FALSE)","v":8},{"$f":"VLOOKUP($I37,$I$28:$S$33,COLUMNS($J36:O36)+1,FALSE)","v":0},{"$f":"VLOOKUP($I37,$I$28:$S$33,COLUMNS($J36:P36)+1,FALSE)","v":20},{"$f":"VLOOKUP($I37,$I$28:$S$33,COLUMNS($J36:Q36)+1,FALSE)","v":11},{"$f":"VLOOKUP($I37,$I$28:$S$33,COLUMNS($J36:R36)+1,FALSE)","v":9},{"$f":"VLOOKUP($I37,$I$28:$S$33,COLUMNS($J36:S36)+1,FALSE)","v":16}]
[102,{"$f":"'Calendrier BG'!Z31","v":"JBS 2"},{"$f":"'Calendrier BG'!AA31","v":"ASVP"},0,4,"ASVP","JBS 2",null,3,{"$f":"VLOOKUP($I38,$I$28:$S$33,COLUMNS($J37:J37)+1,FALSE)","v":"JBS 2"},{"$f":"VLOOKUP($I38,$I$28:$S$33,COLUMNS($J37:K37)+1,FALSE)","v":"Jean Baptiste La Salle 2"},{"$f":"VLOOKUP($I38,$I$28:$S$33,COLUMNS($J37:L37)+1,FALSE)","v":8},{"$f":"VLOOKUP($I38,$I$28:$S$33,COLUMNS($J37:M37)+1,FALSE)","v":2},{"$f":"VLOOKUP($I38,$I$28:$S$33,COLUMNS($J37:N37)+1,FALSE)","v":1},{"$f":"VLOOKUP($I38,$I$28:$S$33,COLUMNS($J37:O37)+1,FALSE)","v":5},{"$f":"VLOOKUP($I38,$I$28:$S$33,COLUMNS($J37:P37)+1,FALSE)","v":12},{"$f":"VLOOKUP($I38,$I$28:$S$33,COLUMNS($J37:Q37)+1,FALSE)","v":22},{"$f":"VLOOKUP($I38,$I$28:$S$33,COLUMNS($J37:R37)+1,FALSE)","v":-10},{"$f":"VLOOKUP($I38,$I$28:$S$33,COLUMNS($J37:S37)+1,FALSE)","v":15}]
[103,{"$f":"'Calendrier BG'!Z32","v":"ASVP"},{"$f":"'Calendrier BG'!AA32","v":"STAN 4"},2,0,"ASVP","STAN 4",null,4,{"$f":"VLOOKUP($I39,$I$28:$S$33,COLUMNS($J38:J38)+1,FALSE)","v":"FEN 3"},{"$f":"VLOOKUP($I39,$I$28:$S$33,COLUMNS($J38:K38)+1,FALSE)","v":"Fénelon Ste Marie 3"},{"$f":"VLOOKUP($I39,$I$28:$S$33,COLUMNS($J38:L38)+1,FALSE)","v":8},{"$f":"VLOOKUP($I39,$I$28:$S$33,COLUMNS($J38:M38)+1,FALSE)","v":1},{"$f":"VLOOKUP($I39,$I$28:$S$33,COLUMNS($J38:N38)+1,FALSE)","v":3},{"$f":"VLOOKUP($I39,$I$28:$S$33,COLUMNS($J38:O38)+1,FALSE)","v":4},{"$f":"VLOOKUP($I39,$I$28:$S$33,COLUMNS($J38:P38)+1,FALSE)","v":10},{"$f":"VLOOKUP($I39,$I$28:$S$33,COLUMNS($J38:Q38)+1,FALSE)","v":14},{"$f":"VLOOKUP($I39,$I$28:$S$33,COLUMNS($J38:R38)+1,FALSE)","v":-4},{"$f":"VLOOKUP($I39,$I$28:$S$33,COLUMNS($J38:S38)+1,FALSE)","v":14}]
[104,{"$f":"'Calendrier BG'!Z33","v":"JBS 2"},{"$f":"'Calendrier BG'!AA33","v":"FEN 3"},2,1,"JBS 2","FEN 3",null,5,{"$f":"VLOOKUP($I40,$I$28:$S$33,COLUMNS($J39:J39)+1,FALSE)","v":"ROC 2"},{"$f":"VLOOKUP($I40,$I$28:$S$33,COLUMNS($J39:K39)+1,FALSE)","v":"Rocroy 2"},{"$f":"VLOOKUP($I40,$I$28:$S$33,COLUMNS($J39:L39)+1,FALSE)","v":8},{"$f":"VLOOKUP($I40,$I$28:$S$33,COLUMNS($J39:M39)+1,FALSE)","v":1},{"$f":"VLOOKUP($I40,$I$28:$S$33,COLUMNS($J39:N39)+1,FALSE)","v":2},{"$f":"VLOOKUP($I40,$I$28:$S$33,COLUMNS($J39:O39)+1,FALSE)","v":5},{"$f":"VLOOKUP($I40,$I$28:$S$33,COLUMNS($J39:P39)+1,FALSE)","v":8},{"$f":"VLOOKUP($I40,$I$28:$S$33,COLUMNS($J39:Q39)+1,FALSE)","v":20},{"$f":"VLOOKUP($I40,$I$28:$S$33,COLUMNS($J39:R39)+1,FALSE)","v":-12},{"$f":"VLOOKUP($I40,$I$28:$S$33,COLUMNS($J39:S39)+1,FALSE)","v":13}]
[105,{"$f":"'Calendrier BG'!Z34","v":"STAN 4"},{"$f":"'Calendrier BG'!AA34","v":"ROC 2"},2,0,"STAN 4","ROC 2"]
[106,{"$f":"'Calendrier BG'!Z35","v":"FEN 3"},{"$f":"'Calendrier BG'!AA35","v":"ASVP"},1,4,"ASVP","FEN 3"]
[107,{"$f":"'Calendrier BG'!Z36","v":"JBS 2"},{"$f":"'Calendrier BG'!AA36","v":"ROC 2"},4,0,"JBS 2","ROC 2"]
[108,{"$f":"'Calendrier BG'!Z37","v":"FEN 3"},{"$f":"'Calendrier BG'!AA37","v":"STAN 4"},0,0,"nul","nul"]
[109,{"$f":"'Calendrier BG'!Z38","v":"ROC 2"},{"$f":"'Calendrier BG'!AA38","v":"ASVP"},0,1,"ASVP","ROC 2"]
[110,{"$f":"'Calendrier BG'!Z39","v":"STAN 4"},{"$f":"'Calendrier BG'!AA39","v":"JBS 2"},5,2,"STAN 4","JBS 2"]
[111,{"$f":"'Calendrier BG'!Z40","v":"ROC 2"},{"$f":"'Calendrier BG'!AA40","v":"FEN 3"},0,5,"FEN 3","ROC 2"]
[112,{"$f":"'Calendrier BG'!Z41","v":"ASVP"},{"$f":"'Calendrier BG'!AA41","v":"JBS 2"},1,0,"ASVP","JBS 2"]
["PROMOTION / RELEGUATION"]
[]
[]
["BENJAMINS DIVISION 2 "]
[]
["N° Match","Match",null,"Scores",null,"Vainqueur","Perdant",null,null,"SIGLE","Etablissement","Matchs joués","Victoires","Nuls ","Défaites","Buts Pour","Buts Contre","Différence","Points"]
[113,{"$f":"'Calendrier BG'!T22","v":"SANO"},{"$f":"'Calendrier BG'!U22","v":"STAN 3"},7,1,{"$f":"IF(D55<>\"\",IF(D55>E55,B55,IF(D55<E55,C55,\"nul\")),\"\")","v":"SANO"},{"$f":"IF(E55<>\"\",IF(E55<D55,C55,IF(E55>D55,B55,\"nul\")),\"\")","v":"STAN 3"},null,{"$f":"RANK(T55,$T$55:$T$59)","v":1},"SANO","Saint André Nogent ",{"$f":"COUNT(D55,D57,D60,D62,D65,D67,D70,D72)","v":8},{"$f":"COUNTIF($F$54:$F$74,J55)","v":7},{"$f":"L55-M55-O55","v":0},{"$f":"COUNTIF($G$54:$G$74,J55)","v":1},{"$f":"SUM(D55,E57,D60,E62,E65,D67,E70,D72)","v":29},{"$f":"SUM(E55,D57,E60,D62,D65,E67,D70,E72)","v":4},{"$f":"P55-Q55","v":25},{"$f":"M55*4+N55*2+O55*1","v":29},{"$f":"SUM(S55*1000000+R55*10000+P55*100+L55*10)","v":29252980}]
[114,{"$f":"'Calendrier BG'!T23","v":"BND"},{"$f":"'Calendrier BG'!U23","v":"FEN 2"},0,2,{"$f":"IF(D56<>\"\",IF(D56>E56,B56,IF(D56<E56,C56,\"nul\")),\"\")","v":"FEN 2"},{"$f":"IF(E56<>\"\",IF(E56<D56,C56,IF(E56>D56,B56,\"nul\")),\"\")","v":"BND"},null,{"$f":"RANK(T56,$T$55:$T$59)","v":5},"STAN 3","Stanislas 3",{"$f":"COUNT(D55,D58,D61,D64,D65,D68,D71,D74)","v":8},{"$f":"COUNTIF($F$54:$F$74,J56)","v":1},0,{"$f":"COUNTIF($G$54:$G$74,J56)","v":7},{"$f":"SUM(E55,D58,D61,E64,D65,E68,E71,D74)","v":5},{"$f":"SUM(D55,E58,E61,D64,E65,D68,D71,E74)","v":27},{"$f":"P56-Q56","v":-22},{"$f":"M56*4+N56*2+O56*1","v":11},{"$f":"SUM(S56*1000000+R56*10000+P56*100+L56*10)","v":10780580}]
[115,{"$f":"'Calendrier BG'!T24","v":"SJL 3"},{"$f":"'Calendrier BG'!U24","v":"SANO"},0,2,"SANO","SJL 3",null,3,"BND","Bossuet Notre Dame",{"$f":"COUNT(D56,D58,D60,D63,D66,D68,D70,D73)","v":8},2,1,5,{"$f":"SUM(D56,E58,E60,D63,E66,D68,D70,E73)","v":7},{"$f":"SUM(E56,D58,D60,E63,D66,E68,E70,D73)","v":13},{"$f":"P57-Q57","v":-6},15,14940780]
[116,{"$f":"'Calendrier BG'!T25","v":"STAN 3"},{"$f":"'Calendrier BG'!U25","v":"BND"},0,3,"BND","STAN 3",null,2,"FEN 2","Fénelon Ste Marie 2",{"$f":"COUNT(D56,D59,D62,D64,D66,D69,D72,D74)","v":8},7,0,1,{"$f":"SUM(E56,E59,D62,D64,D66,D69,E72,E74)","v":15},{"$f":"SUM(D56,D59,E62,E64,E66,E69,D72,D74)","v":2},{"$f":"P58-Q58","v":13},29,29131580]
[117,{"$f":"'Calendrier BG'!T26","v":"SJL 3"},{"$f":"'Calendrier BG'!U26","v":"FEN 2"},0,4,"FEN 2","SJL 3",null,4,"SJL 3","Saint Justin Levallois 3",{"$f":"COUNT(D57,D61,D63,D67,D69,D71,D73,D59)","v":8},2,1,5,{"$f":"SUM(D57,E61,E63,E67,E69,D71,D73,D59)","v":5},{"$f":"SUM(E57,D61,D63,D67,D69,E71,E73,E59)","v":15},-10,15,14900580]
[118,{"$f":"'Calendrier BG'!T27","v":"SANO"},{"$f":"'Calendrier BG'!U27","v":"BND"},2,1,"SANO","BND"]
[119,{"$f":"'Calendrier BG'!T28","v":"STAN 3"},{"$f":"'Calendrier BG'!U28","v":"SJL 3"},1,0,"STAN 3","SJL 3",null,"Classement","SIGLE","Etablissement","Matchs joués","Victoires","Nuls ","Défaites","Buts Pour","Buts Contre","Différence","Points"]
[120,{"$f":"'Calendrier BG'!T29","v":"FEN 2"},{"$f":"'Calendrier BG'!U29","v":"SANO"},1,0,"FEN 2","SANO",null,1,{"$f":"VLOOKUP($I62,$I$54:$S$59,COLUMNS($J61:J61)+1,FALSE)","v":"SANO"},{"$f":"VLOOKUP($I62,$I$54:$S$59,COLUMNS($J61:K61)+1,FALSE)","v":"Saint André Nogent "},{"$f":"VLOOKUP($I62,$I$54:$S$59,COLUMNS($J61:L61)+1,FALSE)","v":8},{"$f":"VLOOKUP($I62,$I$54:$S$59,COLUMNS($J61:M61)+1,FALSE)","v":7},{"$f":"VLOOKUP($I62,$I$54:$S$59,COLUMNS($J61:N61)+1,FALSE)","v":0},{"$f":"VLOOKUP($I62,$I$54:$S$59,COLUMNS($J61:O61)+1,FALSE)","v":1},{"$f":"VLOOKUP($I62,$I$54:$S$59,COLUMNS($J61:P61)+1,FALSE)","v":29},{"$f":"VLOOKUP($I62,$I$54:$S$59,COLUMNS($J61:Q61)+1,FALSE)","v":4},{"$f":"VLOOKUP($I62,$I$54:$S$59,COLUMNS($J61:R61)+1,FALSE)","v":25},{"$f":"VLOOKUP($I62,$I$54:$S$59,COLUMNS($J61:S61)+1,FALSE)","v":29}]
[121,{"$f":"'Calendrier BG'!T30","v":"BND"},{"$f":"'Calendrier BG'!U30","v":"SJL 3"},0,0,"nul","nul",null,2,{"$f":"VLOOKUP($I63,$I$54:$S$59,COLUMNS($J62:J62)+1,FALSE)","v":"FEN 2"},{"$f":"VLOOKUP($I63,$I$54:$S$59,COLUMNS($J62:K62)+1,FALSE)","v":"Fénelon Ste Marie 2"},{"$f":"VLOOKUP($I63,$I$54:$S$59,COLUMNS($J62:L62)+1,FALSE)","v":8},{"$f":"VLOOKUP($I63,$I$54:$S$59,COLUMNS($J62:M62)+1,FALSE)","v":7},{"$f":"VLOOKUP($I63,$I$54:$S$59,COLUMNS($J62:N62)+1,FALSE)","v":0},{"$f":"VLOOKUP($I63,$I$54:$S$59,COLUMNS($J62:O62)+1,FALSE)","v":1},{"$f":"VLOOKUP($I63,$I$54:$S$59,COLUMNS($J62:P62)+1,FALSE)","v":15},{"$f":"VLOOKUP($I63,$I$54:$S$59,COLUMNS($J62:Q62)+1,FALSE)","v":2},{"$f":"VLOOKUP($I63,$I$54:$S$59,COLUMNS($J62:R62)+1,FALSE)","v":13},{"$f":"VLOOKUP($I63,$I$54:$S$59,COLUMNS($J62:S62)+1,FALSE)","v":29}]
[122,{"$f":"'Calendrier BG'!T31","v":"FEN 2"},{"$f":"'Calendrier BG'!U31","v":"STAN 3"},4,1,"FEN 2","STAN 3",null,3,{"$f":"VLOOKUP($I64,$I$54:$S$59,COLUMNS($J63:J63)+1,FALSE)","v":"BND"},{"$f":"VLOOKUP($I64,$I$54:$S$59,COLUMNS($J63:K63)+1,FALSE)","v":"Bossuet Notre Dame"},{"$f":"VLOOKUP($I64,$I$54:$S$59,COLUMNS($J63:L63)+1,FALSE)","v":8},{"$f":"VLOOKUP($I64,$I$54:$S$59,COLUMNS($J63:M63)+1,FALSE)","v":2},{"$f":"VLOOKUP($I64,$I$54:$S$59,COLUMNS($J63:N63)+1,FALSE)","v":1},{"$f":"VLOOKUP($I64,$I$54:$S$59,COLUMNS($J63:O63)+1,FALSE)","v":5},{"$f":"VLOOKUP($I64,$I$54:$S$59,COLUMNS($J63:P63)+1,FALSE)","v":7},{"$f":"VLOOKUP($I64,$I$54:$S$59,COLUMNS($J63:Q63)+1,FALSE)","v":13},{"$f":"VLOOKUP($I64,$I$54:$S$59,COLUMNS($J63:R63)+1,FALSE)","v":-6},{"$f":"VLOOKUP($I64,$I$54:$S$59,COLUMNS($J63:S63)+1,FALSE)","v":15}]
[123,{"$f":"'Calendrier BG'!T32","v":"STAN 3"},{"$f":"'Calendrier BG'!U32","v":"SANO"},1,7,"SANO","STAN 3",null,4,{"$f":"VLOOKUP($I65,$I$54:$S$59,COLUMNS($J64:J64)+1,FALSE)","v":"SJL 3"},{"$f":"VLOOKUP($I65,$I$54:$S$59,COLUMNS($J64:K64)+1,FALSE)","v":"Saint Justin Levallois 3"},{"$f":"VLOOKUP($I65,$I$54:$S$59,COLUMNS($J64:L64)+1,FALSE)","v":8},{"$f":"VLOOKUP($I65,$I$54:$S$59,COLUMNS($J64:M64)+1,FALSE)","v":2},{"$f":"VLOOKUP($I65,$I$54:$S$59,COLUMNS($J64:N64)+1,FALSE)","v":1},{"$f":"VLOOKUP($I65,$I$54:$S$59,COLUMNS($J64:O64)+1,FALSE)","v":5},{"$f":"VLOOKUP($I65,$I$54:$S$59,COLUMNS($J64:P64)+1,FALSE)","v":5},{"$f":"VLOOKUP($I65,$I$54:$S$59,COLUMNS($J64:Q64)+1,FALSE)","v":15},{"$f":"VLOOKUP($I65,$I$54:$S$59,COLUMNS($J64:R64)+1,FALSE)","v":-10},{"$f":"VLOOKUP($I65,$I$54:$S$59,COLUMNS($J64:S64)+1,FALSE)","v":15}]
[124,{"$f":"'Calendrier BG'!T33","v":"FEN 2"},{"$f":"'Calendrier BG'!U33","v":"BND"},2,0,"FEN 2","BND",null,5,{"$f":"VLOOKUP($I66,$I$54:$S$59,COLUMNS($J65:J65)+1,FALSE)","v":"STAN 3"},{"$f":"VLOOKUP($I66,$I$54:$S$59,COLUMNS($J65:K65)+1,FALSE)","v":"Stanislas 3"},{"$f":"VLOOKUP($I66,$I$54:$S$59,COLUMNS($J65:L65)+1,FALSE)","v":8},{"$f":"VLOOKUP($I66,$I$54:$S$59,COLUMNS($J65:M65)+1,FALSE)","v":1},{"$f":"VLOOKUP($I66,$I$54:$S$59,COLUMNS($J65:N65)+1,FALSE)","v":0},{"$f":"VLOOKUP($I66,$I$54:$S$59,COLUMNS($J65:O65)+1,FALSE)","v":7},{"$f":"VLOOKUP($I66,$I$54:$S$59,COLUMNS($J65:P65)+1,FALSE)","v":5},{"$f":"VLOOKUP($I66,$I$54:$S$59,COLUMNS($J65:Q65)+1,FALSE)","v":27},{"$f":"VLOOKUP($I66,$I$54:$S$59,COLUMNS($J65:R65)+1,FALSE)","v":-22},{"$f":"VLOOKUP($I66,$I$54:$S$59,COLUMNS($J65:S65)+1,FALSE)","v":11}]
[125,{"$f":"'Calendrier BG'!T34","v":"SANO"},{"$f":"'Calendrier BG'!U34","v":"SJL 3"},6,0,"SANO","SJL 3"]
[126,{"$f":"'Calendrier BG'!T35","v":"BND"},{"$f":"'Calendrier BG'!U35","v":"STAN 3"},3,0,"BND","STAN 3"]
[127,{"$f":"'Calendrier BG'!T36","v":"FEN 2"},{"$f":"'Calendrier BG'!U36","v":"SJL 3"},1,0,"FEN 2","SJL 3"]
[128,{"$f":"'Calendrier BG'!T37","v":"BND"},{"$f":"'Calendrier BG'!U37","v":"SANO"},0,4,"SANO","BND"]
[129,{"$f":"'Calendrier BG'!T38","v":"SJL 3"},{"$f":"'Calendrier BG'!U38","v":"STAN 3"},2,1,"SJL 3","STAN 3"]
[130,{"$f":"'Calendrier BG'!T39","v":"SANO"},{"$f":"'Calendrier BG'!U39","v":"FEN 2"},1,0,"SANO","FEN 2"]
[131,{"$f":"'Calendrier BG'!T40","v":"SJL 3"},{"$f":"'Calendrier BG'!U40","v":"BND"},3,0,"SJL 3","BND"]
[132,{"$f":"'Calendrier BG'!T41","v":"STAN 3"},{"$f":"'Calendrier BG'!U41","v":"FEN 2"},0,1,"FEN 2","STAN 3"]
[]
[]
["BENJAMINS DIVISION 3"]
[]
["N° Match","Match",null,"Scores",null,"Vainqueur","Perdant",null,null,"SIGLE","Etablissement","Matchs joués","Victoires","Nuls ","Défaites","Buts Pour","Buts Contre","Différence","Points"]
[133,{"$f":"'Calendrier BG'!Z22","v":"STAN 4"},{"$f":"'Calendrier BG'!AA22","v":"ASVP"},0,4,{"$f":"IF(D80<>\"\",IF(D80>E80,B80,IF(D80<E80,C80,\"nul\")),\"\")","v":"ASVP"},{"$f":"IF(E80<>\"\",IF(E80<D80,C80,IF(E80>D80,B80,\"nul\")),\"\")","v":"STAN 4"},null,{"$f":"RANK(T80,$T$80:$T$84)","v":5},"STAN 4","Stanislas 4",{"$f":"COUNT(D80,D82,D85,D87,D90,D92,D95,D97)","v":8},{"$f":"COUNTIF($F$79:$F$99,J80)","v":0},{"$f":"L80-M80-O80","v":0},{"$f":"COUNTIF($G$79:$G$99,J80)","v":8},{"$f":"SUM(D80,E82,D85,E87,E90,D92,E95,D97)","v":2},{"$f":"SUM(E80,D82,E85,D87,D90,E92,D95,E97)","v":26},{"$f":"P80-Q80","v":-24},{"$f":"M80*4+N80*2+O80*1","v":8},{"$f":"SUM(S80*1000000+R80*10000+P80*100+L80*10)","v":7760280}]
[134,{"$f":"'Calendrier BG'!Z23","v":"FEN 3"},{"$f":"'Calendrier BG'!AA23","v":"JBS 2"},1,0,{"$f":"IF(D81<>\"\",IF(D81>E81,B81,IF(D81<E81,C81,\"nul\")),\"\")","v":"FEN 3"},{"$f":"IF(E81<>\"\",IF(E81<D81,C81,IF(E81>D81,B81,\"nul\")),\"\")","v":"JBS 2"},null,{"$f":"RANK(T81,$T$80:$T$84)","v":2},"ASVP","Saint Vincent de Paul",{"$f":"COUNT(D80,D83,D86,D89,D90,D93,D96,D99)","v":8},{"$f":"COUNTIF($F$79:$F$99,J81)","v":5},{"$f":"L81-M81-O81","v":0},{"$f":"COUNTIF($G$79:$G$99,J81)","v":3},{"$f":"SUM(E80,D83,D86,E89,D90,E93,E96,D99)","v":21},{"$f":"SUM(D80,E83,E86,D89,E90,D93,D96,E99)","v":13},{"$f":"P81-Q81","v":8},{"$f":"M81*4+N81*2+O81*1","v":23},{"$f":"SUM(S81*1000000+R81*10000+P81*100+L81*10)","v":23082180}]
[135,{"$f":"'Calendrier BG'!Z24","v":"ROC 2"},{"$f":"'Calendrier BG'!AA24","v":"STAN 4"},3,0,"ROC 2","STAN 4",null,3,"FEN 3","Fénelon Ste Marie 3",{"$f":"COUNT(D81,D83,D85,D88,D91,D93,D95,D98)","v":8},5,0,3,{"$f":"SUM(D81,E83,E85,D88,E91,D93,D95,E98)","v":12},{"$f":"SUM(E81,D83,D85,E88,D91,E93,E95,D98)","v":8},{"$f":"P82-Q82","v":4},23,23041280]
[136,{"$f":"'Calendrier BG'!Z25","v":"ASVP"},{"$f":"'Calendrier BG'!AA25","v":"FEN 3"},3,0,"ASVP","FEN 3",null,1,"JBS 2","Jean Baptiste La Salle 2",{"$f":"COUNT(D81,D84,D87,D89,D91,D94,D97,D99)","v":8},6,0,2,{"$f":"SUM(E81,E84,D87,D89,D91,D94,E97,E99)","v":22},{"$f":"SUM(D81,D84,E87,E89,E91,E94,D97,D99)","v":11},{"$f":"P83-Q83","v":11},26,26112280]
[137,{"$f":"'Calendrier BG'!Z26","v":"ROC 2"},{"$f":"'Calendrier BG'!AA26","v":"JBS 2"},2,4,"JBS 2","ROC 2",null,4,"ROC 2","Rocroy 2",{"$f":"COUNT(D82,D86,D88,D92,D94,D96,D98,D84)","v":8},4,0,4,{"$f":"SUM(D82,E86,E88,E92,E94,D96,D98,D84)","v":17},{"$f":"SUM(E82,D86,D88,D92,D94,E96,E98,E84)","v":16},1,20,20011780]
[138,{"$f":"'Calendrier BG'!Z27","v":"STAN 4"},{"$f":"'Calendrier BG'!AA27","v":"FEN 3"},0,3,"FEN 3","STAN 4"]
[139,{"$f":"'Calendrier BG'!Z28","v":"ASVP"},{"$f":"'Calendrier BG'!AA28","v":"ROC 2"},3,2,"ASVP","ROC 2",null,"Classement","SIGLE","Etablissement","Matchs joués","Victoires","Nuls ","Défaites","Buts Pour","Buts Contre","Différence","Points"]
[140,{"$f":"'Calendrier BG'!Z29","v":"JBS 2"},{"$f":"'Calendrier BG'!AA29","v":"STAN 4"},3,1,"JBS 2","STAN 4",null,1,{"$f":"VLOOKUP($I87,$I$79:$S$84,COLUMNS($J86:J86)+1,FALSE)","v":"JBS 2"},{"$f":"VLOOKUP($I87,$I$79:$S$84,COLUMNS($J86:K86)+1,FALSE)","v":"Jean Baptiste La Salle 2"},{"$f":"VLOOKUP($I87,$I$79:$S$84,COLUMNS($J86:L86)+1,FALSE)","v":8},{"$f":"VLOOKUP($I87,$I$79:$S$84,COLUMNS($J86:M86)+1,FALSE)","v":6},{"$f":"VLOOKUP($I87,$I$79:$S$84,COLUMNS($J86:N86)+1,FALSE)","v":0},{"$f":"VLOOKUP($I87,$I$79:$S$84,COLUMNS($J86:O86)+1,FALSE)","v":2},{"$f":"VLOOKUP($I87,$I$79:$S$84,COLUMNS($J86:P86)+1,FALSE)","v":22},{"$f":"VLOOKUP($I87,$I$79:$S$84,COLUMNS($J86:Q86)+1,FALSE)","v":11},{"$f":"VLOOKUP($I87,$I$79:$S$84,COLUMNS($J86:R86)+1,FALSE)","v":11},{"$f":"VLOOKUP($I87,$I$79:$S$84,COLUMNS($J86:S86)+1,FALSE)","v":26}]
[141,{"$f":"'Calendrier BG'!Z30","v":"FEN 3"},{"$f":"'Calendrier BG'!AA30","v":"ROC 2"},0,2,"ROC 2","FEN 3",null,2,{"$f":"VLOOKUP($I88,$I$79:$S$84,COLUMNS($J87:J87)+1,FALSE)","v":"ASVP"},{"$f":"VLOOKUP($I88,$I$79:$S$84,COLUMNS($J87:K87)+1,FALSE)","v":"Saint Vincent de Paul"},{"$f":"VLOOKUP($I88,$I$79:$S$84,COLUMNS($J87:L87)+1,FALSE)","v":8},{"$f":"VLOOKUP($I88,$I$79:$S$84,COLUMNS($J87:M87)+1,FALSE)","v":5},{"$f":"VLOOKUP($I88,$I$79:$S$84,COLUMNS($J87:N87)+1,FALSE)","v":0},{"$f":"VLOOKUP($I88,$I$79:$S$84,COLUMNS($J87:O87)+1,FALSE)","v":3},{"$f":"VLOOKUP($I88,$I$79:$S$84,COLUMNS($J87:P87)+1,FALSE)","v":21},{"$f":"VLOOKUP($I88,$I$79:$S$84,COLUMNS($J87:Q87)+1,FALSE)","v":13},{"$f":"VLOOKUP($I88,$I$79:$S$84,COLUMNS($J87:R87)+1,FALSE)","v":8},{"$f":"VLOOKUP($I88,$I$79:$S$84,COLUMNS($J87:S87)+1,FALSE)","v":23}]
[142,{"$f":"'Calendrier BG'!Z31","v":"JBS 2"},{"$f":"'Calendrier BG'!AA31","v":"ASVP"},4,1,"JBS 2","ASVP",null,3,{"$f":"VLOOKUP($I89,$I$79:$S$84,COLUMNS($J88:J88)+1,FALSE)","v":"FEN 3"},{"$f":"VLOOKUP($I89,$I$79:$S$84,COLUMNS($J88:K88)+1,FALSE)","v":"Fénelon Ste Marie 3"},{"$f":"VLOOKUP($I89,$I$79:$S$84,COLUMNS($J88:L88)+1,FALSE)","v":8},{"$f":"VLOOKUP($I89,$I$79:$S$84,COLUMNS($J88:M88)+1,FALSE)","v":5},{"$f":"VLOOKUP($I89,$I$79:$S$84,COLUMNS($J88:N88)+1,FALSE)","v":0},{"$f":"VLOOKUP($I89,$I$79:$S$84,COLUMNS($J88:O88)+1,FALSE)","v":3},{"$f":"VLOOKUP($I89,$I$79:$S$84,COLUMNS($J88:P88)+1,FALSE)","v":12},{"$f":"VLOOKUP($I89,$I$79:$S$84,COLUMNS($J88:Q88)+1,FALSE)","v":8},{"$f":"VLOOKUP($I89,$I$79:$S$84,COLUMNS($J88:R88)+1,FALSE)","v":4},{"$f":"VLOOKUP($I89,$I$79:$S$84,COLUMNS($J88:S88)+1,FALSE)","v":23}]
[143,{"$f":"'Calendrier BG'!Z32","v":"ASVP"},{"$f":"'Calendrier BG'!AA32","v":"STAN 4"},4,0,"ASVP","STAN 4",null,4,{"$f":"VLOOKUP($I90,$I$79:$S$84,COLUMNS($J89:J89)+1,FALSE)","v":"ROC 2"},{"$f":"VLOOKUP($I90,$I$79:$S$84,COLUMNS($J89:K89)+1,FALSE)","v":"Rocroy 2"},{"$f":"VLOOKUP($I90,$I$79:$S$84,COLUMNS($J89:L89)+1,FALSE)","v":8},{"$f":"VLOOKUP($I90,$I$79:$S$84,COLUMNS($J89:M89)+1,FALSE)","v":4},{"$f":"VLOOKUP($I90,$I$79:$S$84,COLUMNS($J89:N89)+1,FALSE)","v":0},{"$f":"VLOOKUP($I90,$I$79:$S$84,COLUMNS($J89:O89)+1,FALSE)","v":4},{"$f":"VLOOKUP($I90,$I$79:$S$84,COLUMNS($J89:P89)+1,FALSE)","v":17},{"$f":"VLOOKUP($I90,$I$79:$S$84,COLUMNS($J89:Q89)+1,FALSE)","v":16},{"$f":"VLOOKUP($I90,$I$79:$S$84,COLUMNS($J89:R89)+1,FALSE)","v":1},{"$f":"VLOOKUP($I90,$I$79:$S$84,COLUMNS($J89:S89)+1,FALSE)","v":20}]
[144,{"$f":"'Calendrier BG'!Z33","v":"JBS 2"},{"$f":"'Calendrier BG'!AA33","v":"FEN 3"},0,2,"FEN 3","JBS 2",null,5,{"$f":"VLOOKUP($I91,$I$79:$S$84,COLUMNS($J90:J90)+1,FALSE)","v":"STAN 4"},{"$f":"VLOOKUP($I91,$I$79:$S$84,COLUMNS($J90:K90)+1,FALSE)","v":"Stanislas 4"},{"$f":"VLOOKUP($I91,$I$79:$S$84,COLUMNS($J90:L90)+1,FALSE)","v":8},{"$f":"VLOOKUP($I91,$I$79:$S$84,COLUMNS($J90:M90)+1,FALSE)","v":0},{"$f":"VLOOKUP($I91,$I$79:$S$84,COLUMNS($J90:N90)+1,FALSE)","v":0},{"$f":"VLOOKUP($I91,$I$79:$S$84,COLUMNS($J90:O90)+1,FALSE)","v":8},{"$f":"VLOOKUP($I91,$I$79:$S$84,COLUMNS($J90:P90)+1,FALSE)","v":2},{"$f":"VLOOKUP($I91,$I$79:$S$84,COLUMNS($J90:Q90)+1,FALSE)","v":26},{"$f":"VLOOKUP($I91,$I$79:$S$84,COLUMNS($J90:R90)+1,FALSE)","v":-24},{"$f":"VLOOKUP($I91,$I$79:$S$84,COLUMNS($J90:S90)+1,FALSE)","v":8}]
[145,{"$f":"'Calendrier BG'!Z34","v":"STAN 4"},{"$f":"'Calendrier BG'!AA34","v":"ROC 2"},0,3,"ROC 2","STAN 4"]
[146,{"$f":"'Calendrier BG'!Z35","v":"FEN 3"},{"$f":"'Calendrier BG'!AA35","v":"ASVP"},0,3,"ASVP","FEN 3"]
[147,{"$f":"'Calendrier BG'!Z36","v":"JBS 2"},{"$f":"'Calendrier BG'!AA36","v":"ROC 2"},4,2,"JBS 2","ROC 2"]
[148,{"$f":"'Calendrier BG'!Z37","v":"FEN 3"},{"$f":"'Calendrier BG'!AA37","v":"STAN 4"},3,0,"FEN 3","STAN 4"]
[149,{"$f":"'Calendrier BG'!Z38","v":"ROC 2"},{"$f":"'Calendrier BG'!AA38","v":"ASVP"},3,2,"ROC 2","ASVP"]
[150,{"$f":"'Calendrier BG'!Z39","v":"STAN 4"},{"$f":"'Calendrier BG'!AA39","v":"JBS 2"},1,3,"JBS 2","STAN 4"]
[151,{"$f":"'Calendrier BG'!Z40","v":"ROC 2"},{"$f":"'Calendrier BG'!AA40","v":"FEN 3"},0,3,"FEN 3","ROC 2"]
[152,{"$f":"'Calendrier BG'!Z41","v":"ASVP"},{"$f":"'Calendrier BG'!AA41","v":"JBS 2"},1,4,"JBS 2","ASVP"]

{"sheet":"Calendrier MG","index":4,"n_rows":149,"n_cols":15,"rows_kept":149,"cut":false,"hidden":false,"merged":[[69,1,69,8],[69,0,75,0],[46,1,46,8],[59,1,59,8],[59,0,68,0],[46,0,58,0],[16,13,16,14],[33,0,45,0],[33,1,33,8],[21,0,32,0],[21,1,21,8],[0,1,0,8],[1,10,1,11],[2,10,2,11],[0,10,0,27],[1,6,1,7],[2,0,10,0],[2,1,2,8],[3,1,10,8],[11,1,11,8],[11,0,20,0],[89,0,94,0],[89,1,94,8],[95,0,100,0],[95,1,100,8],[76,1,76,8],[76,0,82,0],[83,0,88,0],[83,1,88,8]]}
[null," CALENDRIER MINIMES",null,null,null,null,null,null,null,null,"POULES ET MATCHS MINIMES"]
["Date","Match","Equipe A","Equipe B","Lieux","Horaires","Résultats",null,"Indisponibilités",null,"DIVISION 1"]
["2022-03-09","DIVISION 1",null,null,null,null,null,null,null,null,"Etablissements"]
[null,"ENTRAINEMENT",null,null,null,null,null,null,null,null,1,"SANO"]
[null,null,null,null,null,null,null,null,null,null,2,"BND"]
[null,null,null,null,null,null,null,null,null,null,3,"STAN 1"]
[null,null,null,null,null,null,null,null,null,null,4,"STAN 2"]
[null,null,null,null,null,null,null,null,null,null,5,"MASS 1"]
[null,null,null,null,null,null,null,null,null,null,6,"MASS 2"]
[null,null,null,null,null,null,null,null,null,null,7,"FEN 1"]
[null,null,null,null,null,null,null,null,null,null,8,"FEN 2"]
["2022-03-16","DIVISION 1",null,null,null,null,null,null,null,null,9,"ASVP"]
[null,32,{"$f":"VLOOKUP($B13,$K$18:$O$149,4)","v":"STAN 2"},{"$f":"VLOOKUP($B13,$K$18:$O$149,5)","v":"ASVP"},"La Courneuve T3 A","14h20",{"$f":"IFERROR(VLOOKUP($B13,'Cls MG'!$A$1:$G$135,4,FALSE),\"\")","v":3},{"$f":"IFERROR(VLOOKUP($B13,'Cls MG'!$A$1:$G$135,5,FALSE),\"\")","v":1},null,null,10,"ROC "]
[null,37,"SANO","ROC ","La Courneuve T3 A","14h40",{"$f":"IFERROR(VLOOKUP($B14,'Cls MG'!$A$1:$G$135,4,FALSE),\"\")","v":6},{"$f":"IFERROR(VLOOKUP($B14,'Cls MG'!$A$1:$G$135,5,FALSE),\"\")","v":0},null,null,11,"STAN 3"]
[null,54,"ASVP","STAN 3","La Courneuve T3 A","15h",{"$f":"IFERROR(VLOOKUP($B15,'Cls MG'!$A$1:$G$135,4,FALSE),\"\")","v":1},{"$f":"IFERROR(VLOOKUP($B15,'Cls MG'!$A$1:$G$135,5,FALSE),\"\")","v":2},null,null,12,"JBS"]
[null,55,"ROC ","STAN 3","La Courneuve T3 A","15h20",{"$f":"IFERROR(VLOOKUP($B16,'Cls MG'!$A$1:$G$135,4,FALSE),\"\")","v":0},{"$f":"IFERROR(VLOOKUP($B16,'Cls MG'!$A$1:$G$135,5,FALSE),\"\")","v":1}]
[null,75,"SANO","STAN 2","La Courneuve T3 A","15h40",{"$f":"IFERROR(VLOOKUP($B17,'Cls MG'!$A$1:$G$135,4,FALSE),\"\")","v":2},{"$f":"IFERROR(VLOOKUP($B17,'Cls MG'!$A$1:$G$135,5,FALSE),\"\")","v":4},null,null,"N° Match","Equipe A","Equipe B","Match"]
[null,92,"MASS 1","FEN 2","La Courneuve T6 A","14h20",{"$f":"IFERROR(VLOOKUP($B18,'Cls MG'!$A$1:$G$135,4,FALSE),\"\")","v":6},{"$f":"IFERROR(VLOOKUP($B18,'Cls MG'!$A$1:$G$135,5,FALSE),\"\")","v":0},null,null,1,2,3,{"$f":"VLOOKUP(L18,$K$2:$L$15,2)","v":"BND"},{"$f":"VLOOKUP(M18,$K$2:$L$15,2)","v":"STAN 1"}]
[null,78,"FEN 1","MASS 2","La Courneuve T6 A","14h40",{"$f":"IFERROR(VLOOKUP($B19,'Cls MG'!$A$1:$G$135,4,FALSE),\"\")","v":4},{"$f":"IFERROR(VLOOKUP($B19,'Cls MG'!$A$1:$G$135,5,FALSE),\"\")","v":4},null,null,2,1,5,{"$f":"VLOOKUP(L19,$K$2:$L$15,2)","v":"SANO"},{"$f":"VLOOKUP(M19,$K$2:$L$15,2)","v":"MASS 1"}]
[null,81,"MASS 1","FEN 1","La Courneuve T6 A","15h",{"$f":"IFERROR(VLOOKUP($B20,'Cls MG'!$A$1:$G$135,4,FALSE),\"\")","v":2},{"$f":"IFERROR(VLOOKUP($B20,'Cls MG'!$A$1:$G$135,5,FALSE),\"\")","v":2},null,null,3,7,4,"FEN 1","STAN 2"]
[null,70,"FEN 2","MASS 2","La Courneuve T6 A","15h20",{"$f":"IFERROR(VLOOKUP($B21,'Cls MG'!$A$1:$G$135,4,FALSE),\"\")","v":2},{"$f":"IFERROR(VLOOKUP($B21,'Cls MG'!$A$1:$G$135,5,FALSE),\"\")","v":3},null,null,4,6,8,"MASS 2","FEN 2"]
["2022-03-23","DIVISION 1",null,null,null,null,null,null,null,null,5,1,2,"SANO","BND"]
[null,69,"STAN 2","FEN 1","La Courneuve T6 A","14h",{"$f":"IFERROR(VLOOKUP($B23,'Cls MG'!$A$1:$G$135,4,FALSE),\"\")","v":0},{"$f":"IFERROR(VLOOKUP($B23,'Cls MG'!$A$1:$G$135,5,FALSE),\"\")","v":1},"SANO",null,6,3,4,"STAN 1","STAN 2"]
[null,77,"STAN 1","FEN 2","La Courneuve T6 B","14h",{"$f":"IFERROR(VLOOKUP($B24,'Cls MG'!$A$1:$G$135,4,FALSE),\"\")","v":3},{"$f":"IFERROR(VLOOKUP($B24,'Cls MG'!$A$1:$G$135,5,FALSE),\"\")","v":0},null,null,7,5,6,"MASS 1","MASS 2"]
[null,107,"ROC ","MASS 1","La Courneuve T6 A","14h20",{"$f":"IFERROR(VLOOKUP($B25,'Cls MG'!$A$1:$G$135,4,FALSE),\"\")","v":0},{"$f":"IFERROR(VLOOKUP($B25,'Cls MG'!$A$1:$G$135,5,FALSE),\"\")","v":3},null,null,8,8,7,"FEN 2","FEN 1"]
[null,88,"MASS 2","BND","La Courneuve T6 B","14h20",{"$f":"IFERROR(VLOOKUP($B26,'Cls MG'!$A$1:$G$135,4,FALSE),\"\")","v":3},{"$f":"IFERROR(VLOOKUP($B26,'Cls MG'!$A$1:$G$135,5,FALSE),\"\")","v":1},null,null,9,4,1,"STAN 2","SANO"]
[null,100,"ASVP","MASS 2","La Courneuve T6 A","14h40",{"$f":"IFERROR(VLOOKUP($B27,'Cls MG'!$A$1:$G$135,4,FALSE),\"\")","v":0},{"$f":"IFERROR(VLOOKUP($B27,'Cls MG'!$A$1:$G$135,5,FALSE),\"\")","v":2},null,null,10,5,2,"MASS 1","BND"]
[null,76,"BND","MASS 1","La Courneuve T6 B","14h40",{"$f":"IFERROR(VLOOKUP($B28,'Cls MG'!$A$1:$G$135,4,FALSE),\"\")","v":0},{"$f":"IFERROR(VLOOKUP($B28,'Cls MG'!$A$1:$G$135,5,FALSE),\"\")","v":4},null,null,11,8,3,"FEN 2","STAN 1"]
[null,119,"STAN 3","FEN 2","La Courneuve T6 A","15h",{"$f":"IFERROR(VLOOKUP($B29,'Cls MG'!$A$1:$G$135,4,FALSE),\"\")","v":1},{"$f":"IFERROR(VLOOKUP($B29,'Cls MG'!$A$1:$G$135,5,FALSE),\"\")","v":1},null,null,12,6,7,"MASS 2","FEN 1"]
[null,118,"STAN 3","FEN 1","La Courneuve T6 B","15h",{"$f":"IFERROR(VLOOKUP($B30,'Cls MG'!$A$1:$G$135,4,FALSE),\"\")","v":0},{"$f":"IFERROR(VLOOKUP($B30,'Cls MG'!$A$1:$G$135,5,FALSE),\"\")","v":3},null,null,13,4,2,"STAN 2","BND"]
[null,108,"ROC ","MASS 2","La Courneuve T6 A","15h20",{"$f":"IFERROR(VLOOKUP($B31,'Cls MG'!$A$1:$G$135,4,FALSE),\"\")","v":0},{"$f":"IFERROR(VLOOKUP($B31,'Cls MG'!$A$1:$G$135,5,FALSE),\"\")","v":3},null,null,14,8,1,"FEN 2","SANO"]
[null,99,"ASVP","MASS 1","La Courneuve T6 B","15h20",{"$f":"IFERROR(VLOOKUP($B32,'Cls MG'!$A$1:$G$135,4,FALSE),\"\")","v":0},{"$f":"IFERROR(VLOOKUP($B32,'Cls MG'!$A$1:$G$135,5,FALSE),\"\")","v":3},null,null,15,7,5,"FEN 1","MASS 1"]
[null,72,"STAN 2","STAN 1","La Courneuve T6 B","15h40",{"$f":"IFERROR(VLOOKUP($B33,'Cls MG'!$A$1:$G$135,4,FALSE),\"\")","v":1},{"$f":"IFERROR(VLOOKUP($B33,'Cls MG'!$A$1:$G$135,5,FALSE),\"\")","v":0},null,null,16,3,6,"STAN 1","MASS 2"]
["2022-03-30","DIVISION 1",null,null,null,null,null,null,null,null,17,2,8,"BND","FEN 2"]
[null,74,"FEN 1","FEN 2","La Courneuve T3 A","14h",{"$f":"IFERROR(VLOOKUP($B35,'Cls MG'!$A$1:$G$135,4,FALSE),\"\")","v":3},{"$f":"IFERROR(VLOOKUP($B35,'Cls MG'!$A$1:$G$135,5,FALSE),\"\")","v":0},"MASS",null,18,5,4,"MASS 1","STAN 2"]
[null,80,"SANO","FEN 2","La Courneuve T3 A","14h20",{"$f":"IFERROR(VLOOKUP($B36,'Cls MG'!$A$1:$G$135,4,FALSE),\"\")","v":3},{"$f":"IFERROR(VLOOKUP($B36,'Cls MG'!$A$1:$G$135,5,FALSE),\"\")","v":0},null,null,19,6,1,"MASS 2","SANO"]
[null,67,"STAN 1","BND","La Courneuve T3 A","14h40",{"$f":"IFERROR(VLOOKUP($B37,'Cls MG'!$A$1:$G$135,4,FALSE),\"\")","v":4},{"$f":"IFERROR(VLOOKUP($B37,'Cls MG'!$A$1:$G$135,5,FALSE),\"\")","v":0},null,null,20,3,7,"STAN 1","FEN 1"]
[null,71,"BND","SANO","La Courneuve T3 A","15h",{"$f":"IFERROR(VLOOKUP($B38,'Cls MG'!$A$1:$G$135,4,FALSE),\"\")","v":0},{"$f":"IFERROR(VLOOKUP($B38,'Cls MG'!$A$1:$G$135,5,FALSE),\"\")","v":0},null,null,21,4,8,"STAN 2","FEN 2"]
[null,86,"FEN 1","STAN 1","La Courneuve T3 A","15h20",{"$f":"IFERROR(VLOOKUP($B39,'Cls MG'!$A$1:$G$135,4,FALSE),\"\")","v":0},{"$f":"IFERROR(VLOOKUP($B39,'Cls MG'!$A$1:$G$135,5,FALSE),\"\")","v":0},null,null,22,2,6,"BND","MASS 2"]
[null,null,{"$error":"#N/A"},{"$error":"#N/A"},null,null,{"$f":"IFERROR(VLOOKUP($B40,'Cls MG'!$A$1:$G$135,4,FALSE),\"\")","v":""},{"$f":"IFERROR(VLOOKUP($B40,'Cls MG'!$A$1:$G$135,5,FALSE),\"\")","v":""},null,null,23,3,5,"STAN 1","MASS 1"]
[null,null,{"$error":"#N/A"},{"$error":"#N/A"},null,null,{"$f":"IFERROR(VLOOKUP($B41,'Cls MG'!$A$1:$G$135,4,FALSE),\"\")","v":""},{"$f":"IFERROR(VLOOKUP($B41,'Cls MG'!$A$1:$G$135,5,FALSE),\"\")","v":""},null,null,24,1,7,"SANO","FEN 1"]
[null,null,{"$error":"#N/A"},{"$error":"#N/A"},null,null,{"$f":"IFERROR(VLOOKUP($B42,'Cls MG'!$A$1:$G$135,4,FALSE),\"\")","v":""},{"$f":"IFERROR(VLOOKUP($B42,'Cls MG'!$A$1:$G$135,5,FALSE),\"\")","v":""},null,null,25,4,6,"STAN 2","MASS 2"]
[null,null,{"$error":"#N/A"},{"$error":"#N/A"},null,null,{"$f":"IFERROR(VLOOKUP($B43,'Cls MG'!$A$1:$G$135,4,FALSE),\"\")","v":""},{"$f":"IFERROR(VLOOKUP($B43,'Cls MG'!$A$1:$G$135,5,FALSE),\"\")","v":""},null,null,26,8,5,"FEN 2","MASS 1"]
[null,null,{"$error":"#N/A"},{"$error":"#N/A"},null,null,{"$f":"IFERROR(VLOOKUP($B44,'Cls MG'!$A$1:$G$135,4,FALSE),\"\")","v":""},{"$f":"IFERROR(VLOOKUP($B44,'Cls MG'!$A$1:$G$135,5,FALSE),\"\")","v":""},null,null,27,7,2,"FEN 1","BND"]
[null,null,{"$error":"#N/A"},{"$error":"#N/A"},null,null,{"$f":"IFERROR(VLOOKUP($B45,'Cls MG'!$A$1:$G$135,4,FALSE),\"\")","v":""},{"$f":"IFERROR(VLOOKUP($B45,'Cls MG'!$A$1:$G$135,5,FALSE),\"\")","v":""},null,null,28,1,3,"SANO","STAN 1"]
[null,null,{"$error":"#N/A"},{"$error":"#N/A"},null,null,{"$f":"IFERROR(VLOOKUP($B46,'Cls MG'!$A$1:$G$135,4,FALSE),\"\")","v":""},{"$f":"IFERROR(VLOOKUP($B46,'Cls MG'!$A$1:$G$135,5,FALSE),\"\")","v":""},null,null,29,1,9,"SANO","ASVP"]
["2022-04-06","DIVISION 1",null,null,null,null,null,null,null,null,30,2,9,"BND","ASVP"]
[null,87,"FEN 2","STAN 2","La Courneuve T6 A","14h",{"$f":"IFERROR(VLOOKUP($B48,'Cls MG'!$A$1:$G$135,4,FALSE),\"\")","v":0},{"$f":"IFERROR(VLOOKUP($B48,'Cls MG'!$A$1:$G$135,5,FALSE),\"\")","v":3},"MASS",null,31,3,9,"STAN 1","ASVP"]
[null,114,"STAN 3","STAN 1","La Courneuve T6 B","14h",{"$f":"IFERROR(VLOOKUP($B49,'Cls MG'!$A$1:$G$135,4,FALSE),\"\")","v":1},{"$f":"IFERROR(VLOOKUP($B49,'Cls MG'!$A$1:$G$135,5,FALSE),\"\")","v":3},null,null,32,4,9,"STAN 2","ASVP"]
[null,103,"ROC ","SANO","La Courneuve T6 A","14h20",{"$f":"IFERROR(VLOOKUP($B50,'Cls MG'!$A$1:$G$135,4,FALSE),\"\")","v":0},{"$f":"IFERROR(VLOOKUP($B50,'Cls MG'!$A$1:$G$135,5,FALSE),\"\")","v":4},null,null,33,5,9,"MASS 1","ASVP"]
[null,83,"FEN 2","BND","La Courneuve T6 B","14h20",{"$f":"IFERROR(VLOOKUP($B51,'Cls MG'!$A$1:$G$135,4,FALSE),\"\")","v":0},{"$f":"IFERROR(VLOOKUP($B51,'Cls MG'!$A$1:$G$135,5,FALSE),\"\")","v":0},null,null,34,6,9,"MASS 2","ASVP"]
[null,120,"STAN 3","ASVP","La Courneuve T6 A","14h40",{"$f":"IFERROR(VLOOKUP($B52,'Cls MG'!$A$1:$G$135,4,FALSE),\"\")","v":1},{"$f":"IFERROR(VLOOKUP($B52,'Cls MG'!$A$1:$G$135,5,FALSE),\"\")","v":1},null,null,35,7,9,"FEN 1","ASVP"]
[null,109,"ROC ","FEN 1","La Courneuve T6 B","14h40",{"$f":"IFERROR(VLOOKUP($B53,'Cls MG'!$A$1:$G$135,4,FALSE),\"\")","v":1},{"$f":"IFERROR(VLOOKUP($B53,'Cls MG'!$A$1:$G$135,5,FALSE),\"\")","v":2},null,null,36,8,9,"FEN 2","ASVP"]
[null,79,"BND","STAN 2","La Courneuve T6 A","15h",{"$f":"IFERROR(VLOOKUP($B54,'Cls MG'!$A$1:$G$135,4,FALSE),\"\")","v":1},{"$f":"IFERROR(VLOOKUP($B54,'Cls MG'!$A$1:$G$135,5,FALSE),\"\")","v":8},null,null,37,1,10,"SANO","ROC "]
[null,90,"FEN 1","SANO","La Courneuve T6 B","15h",{"$f":"IFERROR(VLOOKUP($B55,'Cls MG'!$A$1:$G$135,4,FALSE),\"\")","v":0},{"$f":"IFERROR(VLOOKUP($B55,'Cls MG'!$A$1:$G$135,5,FALSE),\"\")","v":1},null,null,38,2,10,"BND","ROC "]
[null,101,"ASVP","FEN 1",null,null,{"$f":"IFERROR(VLOOKUP($B56,'Cls MG'!$A$1:$G$135,4,FALSE),\"\")","v":0},{"$f":"IFERROR(VLOOKUP($B56,'Cls MG'!$A$1:$G$135,5,FALSE),\"\")","v":3},null,null,39,3,10,"STAN 1","ROC "]
[null,93,"BND","FEN 1",null,null,{"$f":"IFERROR(VLOOKUP($B57,'Cls MG'!$A$1:$G$135,4,FALSE),\"\")","v":1},{"$f":"IFERROR(VLOOKUP($B57,'Cls MG'!$A$1:$G$135,5,FALSE),\"\")","v":1},null,null,40,4,10,"STAN 2","ROC "]
[null,113,"STAN 3","BND",null,null,{"$f":"IFERROR(VLOOKUP($B58,'Cls MG'!$A$1:$G$135,4,FALSE),\"\")","v":1},{"$f":"IFERROR(VLOOKUP($B58,'Cls MG'!$A$1:$G$135,5,FALSE),\"\")","v":0},null,null,41,5,10,"MASS 1","ROC "]
[null,97,"ASVP","STAN 1","La Courneuve T6 A","15h20",{"$f":"IFERROR(VLOOKUP($B59,'Cls MG'!$A$1:$G$135,4,FALSE),\"\")","v":0},{"$f":"IFERROR(VLOOKUP($B59,'Cls MG'!$A$1:$G$135,5,FALSE),\"\")","v":4},null,null,42,6,10,"MASS 2","ROC "]
["2022-04-13","DIVISION 1",null,null,null,null,null,null,null,null,43,7,10,"FEN 1","ROC "]
[null,68,"MASS 1","SANO","Tremblay MASS TA","14h",{"$f":"IFERROR(VLOOKUP($B61,'Cls MG'!$A$1:$G$135,4,FALSE),\"\")","v":2},{"$f":"IFERROR(VLOOKUP($B61,'Cls MG'!$A$1:$G$135,5,FALSE),\"\")","v":2},null,null,44,8,10,"FEN 2","ROC "]
[null,91,"MASS 2","STAN 2","Tremblay MASS TB","14h",{"$f":"IFERROR(VLOOKUP($B62,'Cls MG'!$A$1:$G$135,4,FALSE),\"\")","v":0},{"$f":"IFERROR(VLOOKUP($B62,'Cls MG'!$A$1:$G$135,5,FALSE),\"\")","v":4},null,null,45,9,10,"ASVP","ROC "]
[null,89,"MASS 1","STAN 1","Tremblay MASS TA","14h20",{"$f":"IFERROR(VLOOKUP($B63,'Cls MG'!$A$1:$G$135,4,FALSE),\"\")","v":1},{"$f":"IFERROR(VLOOKUP($B63,'Cls MG'!$A$1:$G$135,5,FALSE),\"\")","v":0},null,null,46,1,11,"SANO","STAN 3"]
[null,94,"STAN 1","SANO","Tremblay MASS TB","14h20",{"$f":"IFERROR(VLOOKUP($B64,'Cls MG'!$A$1:$G$135,4,FALSE),\"\")","v":0},{"$f":"IFERROR(VLOOKUP($B64,'Cls MG'!$A$1:$G$135,5,FALSE),\"\")","v":3},null,null,47,2,11,"BND","STAN 3"]
[null,73,"MASS 2","MASS 1","Tremblay MASS TA","14h40",{"$f":"IFERROR(VLOOKUP($B65,'Cls MG'!$A$1:$G$135,4,FALSE),\"\")","v":0},{"$f":"IFERROR(VLOOKUP($B65,'Cls MG'!$A$1:$G$135,5,FALSE),\"\")","v":4},null,null,48,3,11,"STAN 1","STAN 3"]
[null,112,"STAN 3","SANO","Tremblay MASS TB","14h40",{"$f":"IFERROR(VLOOKUP($B66,'Cls MG'!$A$1:$G$135,4,FALSE),\"\")","v":0},{"$f":"IFERROR(VLOOKUP($B66,'Cls MG'!$A$1:$G$135,5,FALSE),\"\")","v":3},null,null,49,4,11,"STAN 2","STAN 3"]
[null,85,"SANO","MASS 2","Tremblay MASS TA","15h",{"$f":"IFERROR(VLOOKUP($B67,'Cls MG'!$A$1:$G$135,4,FALSE),\"\")","v":1},{"$f":"IFERROR(VLOOKUP($B67,'Cls MG'!$A$1:$G$135,5,FALSE),\"\")","v":1},null,null,50,5,11,"MASS 1","STAN 3"]
[null,115,"STAN 3","STAN 2","Tremblay MASS TB","15h",{"$f":"IFERROR(VLOOKUP($B68,'Cls MG'!$A$1:$G$135,4,FALSE),\"\")","v":0},{"$f":"IFERROR(VLOOKUP($B68,'Cls MG'!$A$1:$G$135,5,FALSE),\"\")","v":3},null,null,51,6,11,"MASS 2","STAN 3"]
[null,null,null,null,null,null,{"$f":"IFERROR(VLOOKUP($B69,'Cls MG'!$A$1:$G$135,4,FALSE),\"\")","v":""},{"$f":"IFERROR(VLOOKUP($B69,'Cls MG'!$A$1:$G$135,5,FALSE),\"\")","v":""},null,null,52,7,11,"FEN 1","STAN 3"]
["2022-04-20","DIVISION 1",null,null,null,null,null,null,null,null,53,8,11,"FEN 2","STAN 3"]
[null,null,"MASS 1","FEN 1","Tremblay SANO TA","14h20",{"$f":"IFERROR(VLOOKUP($B71,'Cls MG'!$A$1:$G$135,4,FALSE),\"\")","v":""},{"$f":"IFERROR(VLOOKUP($B71,'Cls MG'!$A$1:$G$135,5,FALSE),\"\")","v":""},null,null,54,9,11,"ASVP","STAN 3"]
[null,null,"SANO ","STAN 2","Tremblay SANO TB","14h20",{"$f":"IFERROR(VLOOKUP($B72,'Cls MG'!$A$1:$G$135,4,FALSE),\"\")","v":""},{"$f":"IFERROR(VLOOKUP($B72,'Cls MG'!$A$1:$G$135,5,FALSE),\"\")","v":""},null,null,55,10,11,"ROC ","STAN 3"]
[null,null,"MASS 1","SANO","Tremblay SANO TA","14h40",{"$f":"IFERROR(VLOOKUP($B73,'Cls MG'!$A$1:$G$135,4,FALSE),\"\")","v":""},{"$f":"IFERROR(VLOOKUP($B73,'Cls MG'!$A$1:$G$135,5,FALSE),\"\")","v":""},null,null,56,1,12,"SANO","JBS"]
[null,null,"FEN 1","STAN 2","Tremblay SANO TB","14h40",{"$f":"IFERROR(VLOOKUP($B74,'Cls MG'!$A$1:$G$135,4,FALSE),\"\")","v":""},{"$f":"IFERROR(VLOOKUP($B74,'Cls MG'!$A$1:$G$135,5,FALSE),\"\")","v":""},null,null,57,2,12,"BND","JBS"]
[null,null,"MASS 1","STAN 2","Tremblay SANO TA","15h",{"$f":"IFERROR(VLOOKUP($B75,'Cls MG'!$A$1:$G$135,4,FALSE),\"\")","v":""},{"$f":"IFERROR(VLOOKUP($B75,'Cls MG'!$A$1:$G$135,5,FALSE),\"\")","v":""},null,null,58,3,12,"STAN 1","JBS"]
[null,null,"SANO","FEN 1","Tremblay SANO TB","15h",{"$f":"IFERROR(VLOOKUP($B76,'Cls MG'!$A$1:$G$135,4,FALSE),\"\")","v":""},{"$f":"IFERROR(VLOOKUP($B76,'Cls MG'!$A$1:$G$135,5,FALSE),\"\")","v":""},null,null,59,4,12,"STAN 2","JBS"]
["2022-05-11","DIVISION 1",null,null,null,null,null,null,null,null,60,5,12,"MASS 1","JBS"]
[null,117,{"$f":"VLOOKUP($B78,$K$18:$O$149,4)","v":"STAN 3"},{"$f":"VLOOKUP($B78,$K$18:$O$149,5)","v":"MASS 2"},"La Courneuve T3 A","14h20",{"$f":"IFERROR(VLOOKUP($B78,'Cls MG'!$A$1:$G$135,4,FALSE),\"\")","v":0},{"$f":"IFERROR(VLOOKUP($B78,'Cls MG'!$A$1:$G$135,5,FALSE),\"\")","v":0},null,null,61,6,12,"MASS 2","JBS"]
[null,111,"ROC ","ASVP","La Courneuve T3 A","14h20",{"$f":"IFERROR(VLOOKUP($B79,'Cls MG'!$A$1:$G$135,4,FALSE),\"\")","v":0},{"$f":"IFERROR(VLOOKUP($B79,'Cls MG'!$A$1:$G$135,5,FALSE),\"\")","v":1},null,null,62,7,12,"FEN 1","JBS"]
[null,121,"STAN 3","ROC ","La Courneuve T3 A","14h40",{"$f":"IFERROR(VLOOKUP($B80,'Cls MG'!$A$1:$G$135,4,FALSE),\"\")","v":0},{"$f":"IFERROR(VLOOKUP($B80,'Cls MG'!$A$1:$G$135,5,FALSE),\"\")","v":3},null,null,63,8,12,"FEN 2","JBS"]
[null,96,"ASVP","BND","La Courneuve T3 A","14h40",{"$f":"IFERROR(VLOOKUP($B81,'Cls MG'!$A$1:$G$135,4,FALSE),\"\")","v":0},{"$f":"IFERROR(VLOOKUP($B81,'Cls MG'!$A$1:$G$135,5,FALSE),\"\")","v":1},null,null,64,9,12,"ASVP","JBS"]
[null,102,"ASVP","FEN 2","La Courneuve T3 A","15h",{"$f":"IFERROR(VLOOKUP($B82,'Cls MG'!$A$1:$G$135,4,FALSE),\"\")","v":1},{"$f":"IFERROR(VLOOKUP($B82,'Cls MG'!$A$1:$G$135,5,FALSE),\"\")","v":0},null,null,65,10,12,"ROC ","JBS"]
[null,104,"ROC ","BND","La Courneuve T3 A","15h",{"$f":"IFERROR(VLOOKUP($B83,'Cls MG'!$A$1:$G$135,4,FALSE),\"\")","v":1},{"$f":"IFERROR(VLOOKUP($B83,'Cls MG'!$A$1:$G$135,5,FALSE),\"\")","v":1},null,null,66,11,12,{"$f":"VLOOKUP(L83,$K$2:$L$15,2)","v":"STAN 3"},{"$f":"VLOOKUP(M83,$K$2:$L$15,2)","v":"JBS"}]
["2022-05-18","ENTRAINEMENT :        matchs amicaux",null,null,null,null,null,null,null,null,67,3,2,"STAN 1","BND"]
[null,null,null,null,null,null,null,null,null,null,68,5,1,"MASS 1","SANO"]
[null,null,null,null,null,null,null,null,null,null,69,4,7,"STAN 2","FEN 1"]
[null,null,null,null,null,null,null,null,null,null,70,8,6,"FEN 2","MASS 2"]
[null,null,null,null,null,null,null,null,null,null,71,2,1,"BND","SANO"]
[null,null,null,null,null,null,null,null,null,null,72,4,3,"STAN 2","STAN 1"]
["2022-05-25","ASCENSION",null,null,null,null,null,null,null,null,73,6,5,"MASS 2","MASS 1"]
[null,null,null,null,null,null,null,null,null,null,74,7,8,"FEN 1","FEN 2"]
[null,null,null,null,null,null,null,null,null,null,75,1,4,"SANO","STAN 2"]
[null,null,null,null,null,null,null,null,null,null,76,2,5,"BND","MASS 1"]
[null,null,null,null,null,null,null,null,null,null,77,3,8,"STAN 1","FEN 2"]
[null,null,null,null,null,null,null,null,null,null,78,7,6,"FEN 1","MASS 2"]
["2022-06-01","COUPE MG au Tremblay sur terrains SANO et MASS de 14h à 17h",null,null,null,null,null,null,null,null,79,2,4,"BND","STAN 2"]
[null,null,null,null,null,null,null,null,null,null,80,1,8,"SANO","FEN 2"]
[null,null,null,null,null,null,null,null,null,null,81,5,7,"MASS 1","FEN 1"]
[null,null,null,null,null,null,null,null,null,null,82,6,3,"MASS 2","STAN 1"]
[null,null,null,null,null,null,null,null,null,null,83,8,2,"FEN 2","BND"]
[null,null,null,null,null,null,null,null,null,null,84,4,5,"STAN 2","MASS 1"]
[null,null,null,null,null,null,null,null,null,null,85,1,6,"SANO","MASS 2"]
[null,null,null,null,null,null,null,null,null,null,86,7,3,"FEN 1","STAN 1"]
[null,null,null,null,null,null,null,null,null,null,87,8,4,"FEN 2","STAN 2"]
[null,null,null,null,null,null,null,null,null,null,88,6,2,"MASS 2","BND"]
[null,null,null,null,null,null,null,null,null,null,89,5,3,"MASS 1","STAN 1"]
[null,null,null,null,null,null,null,null,null,null,90,7,1,"FEN 1","SANO"]
[null,null,null,null,null,null,null,null,null,null,91,6,4,"MASS 2","STAN 2"]
[null,null,null,null,null,null,null,null,null,null,92,5,8,"MASS 1","FEN 2"]
[null,null,null,null,null,null,null,null,null,null,93,2,7,"BND","FEN 1"]
[null,null,null,null,null,null,null,null,null,null,94,3,1,"STAN 1","SANO"]
[null,null,null,null,null,null,null,null,null,null,95,9,1,"ASVP","SANO"]
[null,null,null,null,null,null,null,null,null,null,96,9,2,"ASVP","BND"]
[null,null,null,null,null,null,null,null,null,null,97,9,3,"ASVP","STAN 1"]
[null,null,null,null,null,null,null,null,null,null,98,9,4,"ASVP","STAN 2"]
[null,null,null,null,null,null,null,null,null,null,99,9,5,"ASVP","MASS 1"]
[null,null,null,null,null,null,null,null,null,null,100,9,6,"ASVP","MASS 2"]
[null,null,null,null,null,null,null,null,null,null,101,9,7,"ASVP","FEN 1"]
[null,null,null,null,null,null,null,null,null,null,102,9,8,"ASVP","FEN 2"]
[null,null,null,null,null,null,null,null,null,null,103,10,1,"ROC ","SANO"]
[null,null,null,null,null,null,null,null,null,null,104,10,2,"ROC ","BND"]
[null,null,null,null,null,null,null,null,null,null,105,10,3,"ROC ","STAN 1"]
[null,null,null,null,null,null,null,null,null,null,106,10,4,"ROC ","STAN 2"]
[null,null,null,null,null,null,null,null,null,null,107,10,5,"ROC ","MASS 1"]
[null,null,null,null,null,null,null,null,null,null,108,10,6,"ROC ","MASS 2"]
[null,null,null,null,null,null,null,null,null,null,109,10,7,"ROC ","FEN 1"]
[null,null,null,null,null,null,null,null,null,null,110,10,8,"ROC ","FEN 2"]
[null,null,null,null,null,null,null,null,null,null,111,10,9,"ROC ","ASVP"]
[null,null,null,null,null,null,null,null,null,null,112,11,1,"STAN 3","SANO"]
[null,null,null,null,null,null,null,null,null,null,113,11,2,"STAN 3","BND"]
[null,null,null,null,null,null,null,null,null,null,114,11,3,"STAN 3","STAN 1"]
[null,null,null,null,null,null,null,null,null,null,115,11,4,"STAN 3","STAN 2"]
[null,null,null,null,null,null,null,null,null,null,116,11,5,"STAN 3","MASS 1"]
[null,null,null,null,null,null,null,null,null,null,117,11,6,"STAN 3","MASS 2"]
[null,null,null,null,null,null,null,null,null,null,118,11,7,"STAN 3","FEN 1"]
[null,null,null,null,null,null,null,null,null,null,119,11,8,"STAN 3","FEN 2"]
[null,null,null,null,null,null,null,null,null,null,120,11,9,"STAN 3","ASVP"]
[null,null,null,null,null,null,null,null,null,null,121,11,10,"STAN 3","ROC "]
[null,null,null,null,null,null,null,null,null,null,122,12,1,{"$f":"VLOOKUP(L139,$K$2:$L$15,2)","v":"JBS"},{"$f":"VLOOKUP(M139,$K$2:$L$15,2)","v":"SANO"}]
[null,null,null,null,null,null,null,null,null,null,123,12,2,"JBS","BND"]
[null,null,null,null,null,null,null,null,null,null,124,12,3,"JBS","STAN 1"]
[null,null,null,null,null,null,null,null,null,null,125,12,4,"JBS","STAN 2"]
[null,null,null,null,null,null,null,null,null,null,126,12,5,"JBS","MASS 1"]
[null,null,null,null,null,null,null,null,null,null,127,12,6,"JBS","MASS 2"]
[null,null,null,null,null,null,null,null,null,null,128,12,7,"JBS","FEN 1"]
[null,null,null,null,null,null,null,null,null,null,129,12,8,"JBS","FEN 2"]
[null,null,null,null,null,null,null,null,null,null,130,12,9,"JBS","ASVP"]
[null,null,null,null,null,null,null,null,null,null,131,12,10,"JBS","ROC "]
[null,null,null,null,null,null,null,null,null,null,132,12,11,"JBS","STAN 3"]

{"sheet":"Cls MG","index":5,"n_rows":135,"n_cols":20,"rows_kept":135,"cut":false,"hidden":false,"merged":[[0,0,1,6],[2,3,2,4]]}
["MINIMES DIVISION 1 "]
[]
["N° Match","Equipe A","Equipe B","Scores",null,"Vainqueur","Perdant",null,null,"SIGLE","Etablissement","Matchs joués","Victoires","Nuls ","Défaites","Buts Pour","Buts Contre","Différence","Points"]
[1,{"$f":"'Calendrier MG'!N18","v":"BND"},{"$f":"'Calendrier MG'!O18","v":"STAN 1"},0,9,{"$f":"IF(D4<>\"\",IF(D4>E4,B4,IF(D4<E4,C4,\"nul\")),\"\")","v":"STAN 1"},{"$f":"IF(E4<>\"\",IF(E4<D4,C4,IF(E4>D4,B4,\"nul\")),\"\")","v":"BND"},null,{"$f":"RANK(T4,$T$4:$T$15)","v":3},"SANO","Saint André de Nogent",{"$f":"COUNT(D5,D8,D12,D17,D22,D27,D31,D32,D40,D49,D59,D71,D74,D78,D83,D88,D93,D97,D98,D106,D115,D125)","v":22},{"$f":"COUNTIF($F$3:$F$135,J4)","v":15},{"$f":"L4-M4-O4","v":4},{"$f":"COUNTIF(G3:G135,J4)","v":3},{"$f":"SUM(D5+D8+E12+E17+E22+D27+D31+D32+D40+D49+D59+E71+E74+D78+D83+D88+E93+E97+E98+E106+E115+E125)","v":53},{"$f":"SUM(E5+E8+D12+D17+D22+E27+E31+E32+E40+E49+E59+D71+D74+E78+E83+E88+D93+D97+D98+D106+D115+D125)","v":13},{"$f":"P4-Q4","v":40},{"$f":"M4*4+N4*2+O4*1","v":71},{"$f":"SUM(S4*1000000+R4*10000+P4*100+L4*10)","v":71405520}]
[2,{"$f":"'Calendrier MG'!N19","v":"SANO"},{"$f":"'Calendrier MG'!O19","v":"MASS 1"},0,0,{"$f":"IF(D5<>\"\",IF(D5>E5,B5,IF(D5<E5,C5,\"nul\")),\"\")","v":"nul"},{"$f":"IF(E5<>\"\",IF(E5<D5,C5,IF(E5>D5,B5,\"nul\")),\"\")","v":"nul"},null,{"$f":"RANK(T5,$T$4:$T$15)","v":7},"BND","Bossuet Notre Dame",{"$f":"COUNT(D4,D8,D13,D16,D20,D25,D30,D33,D41,D50,D60,D70,D74,D79,D82,D86,D91,D96,D99,D107,D116,D126)","v":22},{"$f":"COUNTIF($F$3:$F$135,J5)","v":6},{"$f":"L5-M5-O5","v":4},{"$f":"COUNTIF(G4:G136,J5)","v":12},{"$f":"SUM(D4+E8+E13+E16+D20+D25+E30+D33+D41+D50+D60+E70+D74+D79+D82+E86+E91+D96+E99+E107+E116+E126)","v":25},{"$f":"SUM(E4+D8+D13+D16+E20+E25+D30+E33+E41+E50+E60+D70+E74+E79+E82+D86+D91+E96+D99+D107+D116+D126)","v":49},{"$f":"P5-Q5","v":-24},{"$f":"M5*4+N5*2+O5*1","v":44},{"$f":"SUM(S5*1000000+R5*10000+P5*100+L5*10)","v":43762720}]
[3,{"$f":"'Calendrier MG'!N20","v":"FEN 1"},{"$f":"'Calendrier MG'!O20","v":"STAN 2"},2,0,"FEN 1","STAN 2",null,5,"STAN 1","Stanislas 1",{"$f":"COUNT(D4,D9,D14,D19,D23,D26,D31,D34,D42,D51,D61,D70,D75,D80,D85,D89,D92,D97,D100,D108,D117,D127)","v":22},15,1,{"$f":"COUNTIF(G5:G137,J6)","v":6},{"$f":"SUM(E4,D9,E14,D19,D23,D26,E31,D34,D42,D51,D61,D70,E75,D80,E85,E89,E92,D97,E100,E108,E117,E127)","v":55},{"$f":"SUM(D4,E9,D14,E19,E23,E26,D31,E34,E42,E51,E61,E70,D75,E80,D85,D89,D92,E97,D100,D108,D117,D127)","v":12},43,68,68435720]
[4,{"$f":"'Calendrier MG'!N21","v":"MASS 2"},{"$f":"'Calendrier MG'!O21","v":"FEN 2"},2,0,"MASS 2","FEN 2",null,2,"STAN 2","Stanislas 2",{"$f":"COUNT(D6,D9,D12,D16,D21,D24,D28,D35,D43,D52,D62,D72,D75,D78,D82,D87,D90,D94,D101,D109,D118,D128)","v":22},19,0,3,{"$f":"SUM(E6,E9,D12,D16,E21,D24,D28,D35,D43,D52,D62,D72,D75,E78,E82,D87,E90,E94,E101,E109,E118,E128)","v":62},{"$f":"SUM(D6,D9,E12,E16,D21,E24,E28,E35,E43,E52,E62,E72,E75,D78,D82,E87,D90,D94,D101,D109,D118,D128)","v":12},50,79,79506420]
[5,{"$f":"'Calendrier MG'!N22","v":"SANO"},{"$f":"'Calendrier MG'!O22","v":"BND"},5,0,"SANO","BND",null,1,"MASS 1","Massillon 1",{"$f":"COUNT(D5,D10,D13,D18,D21,D26,D29,D36,D44,D53,D63,D71,D76,D79,D84,D87,D92,D95,D102,D110,D119,D129)","v":22},18,3,1,{"$f":"SUM(E5,D10,D13,E18,D21,E26,E29,D36,D44,D53,D63,D71,E76,E79,D84,E87,D92,D95,E102,E110,E119,E129)","v":66},{"$f":"SUM(D5,E10,E13,D18,E21,D26,D29,E36,E44,E53,E63,E71,D76,D79,E84,D87,E92,E95,D102,D110,D119,D129)","v":7},59,79,79596820]
[6,{"$f":"'Calendrier MG'!N23","v":"STAN 1"},{"$f":"'Calendrier MG'!O23","v":"STAN 2"},0,1,"STAN 2","STAN 1",null,6,"MASS 2","Massillon 2",{"$f":"COUNT(D7,D10,D15,D19,D22,D25,D28,D37,D45,D54,D64,D73,D76,D81,D85,D88,D91,D94,D103,D111,D120,D130)","v":22},9,3,10,{"$f":"SUM(D7,E10,D15,E19,D22,E25,E28,D37,D45,D54,D64,E73,D76,E81,D85,E88,D91,D94,E103,E111,E120,E130)","v":29},{"$f":"SUM(E7,D10,E15,D19,E22,D25,D28,E37,E45,E54,E64,D73,E76,D81,E85,D88,E91,E94,D103,D111,D120,D130)","v":40},-11,52,{"$f":"SUM(S9*1000000+R9*10000+P9*100+L9*10)","v":51893120}]
[7,{"$f":"'Calendrier MG'!N24","v":"MASS 1"},{"$f":"'Calendrier MG'!O24","v":"MASS 2"},4,0,"MASS 1","MASS 2",null,4,"FEN 1","Fénelon Sainte Marie 1",{"$f":"COUNT(D6,D11,D15,D18,D23,D27,D30,D38,D46,D55,D65,D72,D77,D81,D84,D89,D93,D96,D104,D112,D121,D131)","v":22},15,4,3,{"$f":"SUM(D6,E11,E15,D18,E23,E27,D30,D38,D46,D55,D65,E72,D77,D81,E84,D89,D93,E96,E104,E112,E121,E131)","v":59},{"$f":"SUM(E6,D11,D15,E18,D23,D27,E30,E38,E46,E55,E65,D72,E77,E81,D84,E89,E93,D96,E104,D112,D121,D131)","v":22},37,71,71376120]
[8,{"$f":"'Calendrier MG'!N25","v":"FEN 2"},{"$f":"'Calendrier MG'!O25","v":"FEN 1"},0,3,"FEN 1","FEN 2",null,11,"FEN 2","Fénelon Sainte Marie 2",{"$f":"COUNT(D7,D11,D14,D17,D20,D24,D29,D39,D47,D56,D66,D73,D80,D83,D86,D90,D95,D77,D105,D113,D122,D132)","v":22},4,3,15,{"$f":"SUM(E7,D11,D14,D17,E20,E24,D29,D39,D47,D56,D66,D73,E80,E83,D86,D90,E95,E77,E105,E113,E122,E132)","v":17},{"$f":"SUM(D7,E11,E14,E17,D20,D4,E29,E39,E47,E56,E66,E73,D80,D83,E86,E90,D95,D77,D105,D113,D122,D132)","v":49},-32,37,36681920]
[9,{"$f":"'Calendrier MG'!N26","v":"STAN 2"},{"$f":"'Calendrier MG'!O26","v":"SANO"},2,1,{"$f":"IF(D12<>\"\",IF(D12>E12,B12,IF(D12<E12,C12,\"nul\")),\"\")","v":"STAN 2"},"SANO",null,10,"ASVP","Saint Vincent de Paul",{"$f":"COUNT(D32,D33,D34,D36,D37,D35,D39,D38,D48,D57,D67,D103,D102,D100,D99,D98,D101,D105,D104,D114,D123,D133)","v":22},5,1,16,{"$f":"SUM(E32,E33,E34,E36,E37,E35,E39,E38,D48,D57,D67,D103,D102,D100,D99,D98,D101,D105,D104,E114,E123,E133)","v":22},{"$f":"SUM(D32,D33,D34,D36,D37,D35,D39,D38,E48,E57,E67,E103,E102,E100,E99,E98,E101,E105,E104,D114,D123,D133)","v":44},-22,38,37782420]
[10,{"$f":"'Calendrier MG'!N27","v":"MASS 1"},{"$f":"'Calendrier MG'!O27","v":"BND"},3,0,"MASS 1","BND",null,9,"ROC ","Rocroy Saint Vincent",{"$f":"COUNT(D43,D44,D45,D46,D47,D42,D40,D41,D48,D58,D68,D108,D109,D110,D106,D111,D112,D113,D107,D114,D124,D134)","v":22},6,1,15,{"$f":"SUM(E43,E44,E45,E46,E47,E42,E40,E41,E48,D58,D68,D108,D109,D110,D106,D111,D112,D113,D107,D114,E124,E134)","v":26},{"$f":"SUM(D43,D44,D45,D46,D47,D42,D40,D41,D48,E58,E68,E108,E109,E110,E106,E111,E112,E113,E107,E114,D124,D134)","v":63},-37,41,40632820]
[11,{"$f":"'Calendrier MG'!N28","v":"FEN 2"},{"$f":"'Calendrier MG'!O28","v":"STAN 1"},0,4,"STAN 1","FEN 2",null,8,"STAN 3","Stanislas 3",{"$f":"COUNT(D52,D53,D56,D49,D51,D58,D54,D55,D50,D57,D69,D115,D117,D118,D119,D120,D121,D122,D123,D116,D124,D135)","v":22},6,3,13,{"$f":"SUM(E52,E53,E56,E49,E51,E58,E54,E55,E50,E57,D69,D115,D117,D118,D119,D120,D121,D122,D123,D116,D124,E135)","v":16},{"$f":"SUM(D52,D53,D56,D49,D51,D58,D54,D55,D50,D57,E69,E115,E117,E118,E119,E120,E121,E122,E123,E116,E124,D135)","v":40},-24,43,42761820]
[12,{"$f":"'Calendrier MG'!N29","v":"MASS 2"},{"$f":"'Calendrier MG'!O29","v":"FEN 1"},0,1,"FEN 1","MASS 2",null,12,"JBS","Jean Baptiste La Salle Saint-Denis",{"$f":"COUNT(D63,D64,D67,D68,D66,D59,D61,D62,D65,D60,D69,D132,D131,D133,D125,D127,D128,D129,D130,D134,D126,D135)","v":22},1,0,21,{"$f":"SUM(E63,E64,E67,E68,E66,E59,E61,E62,E65,E60,E69,D132,D131,D133,D125,D127,D128,D129,D130,D134,D126,D135)","v":11},{"$f":"SUM(D63,D64,D67,D68,D66,D59,D61,D62,D65,D60,D69,E132,E131,E133,E125,E127,E128,E129,E130,E134,E126,E135)","v":91},-80,25,24201320]
[13,{"$f":"'Calendrier MG'!N30","v":"STAN 2"},{"$f":"'Calendrier MG'!O30","v":"BND"},3,1,"STAN 2","BND"]
[14,{"$f":"'Calendrier MG'!N31","v":"FEN 2"},{"$f":"'Calendrier MG'!O31","v":"SANO"},0,4,"SANO","FEN 2"]
[15,{"$f":"'Calendrier MG'!N32","v":"FEN 1"},{"$f":"'Calendrier MG'!O32","v":"MASS 1"},0,4,"MASS 1","FEN 1",null,"Classement","SIGLE","Etablissement","Matchs joués","Victoires","Nuls ","Défaites","Buts Pour","Buts Contre","Différence","Points"]
[16,{"$f":"'Calendrier MG'!N33","v":"STAN 1"},{"$f":"'Calendrier MG'!O33","v":"MASS 2"},2,0,"STAN 1","MASS 2",null,1,{"$f":"VLOOKUP($I19,$I$3:$S$15,COLUMNS($J18:J18)+1,FALSE)","v":"MASS 1"},{"$f":"VLOOKUP($I19,$I$3:$S$15,COLUMNS($J18:K18)+1,FALSE)","v":"Massillon 1"},{"$f":"VLOOKUP($I19,$I$3:$S$15,COLUMNS($J18:L18)+1,FALSE)","v":22},{"$f":"VLOOKUP($I19,$I$3:$S$15,COLUMNS($J18:M18)+1,FALSE)","v":18},{"$f":"VLOOKUP($I19,$I$3:$S$15,COLUMNS($J18:N18)+1,FALSE)","v":3},{"$f":"VLOOKUP($I19,$I$3:$S$15,COLUMNS($J18:O18)+1,FALSE)","v":1},{"$f":"VLOOKUP($I19,$I$3:$S$15,COLUMNS($J18:P18)+1,FALSE)","v":66},{"$f":"VLOOKUP($I19,$I$3:$S$15,COLUMNS($J18:Q18)+1,FALSE)","v":7},{"$f":"VLOOKUP($I19,$I$3:$S$15,COLUMNS($J18:R18)+1,FALSE)","v":59},{"$f":"VLOOKUP($I19,$I$3:$S$15,COLUMNS($J18:S18)+1,FALSE)","v":79}]
[17,{"$f":"'Calendrier MG'!N34","v":"BND"},{"$f":"'Calendrier MG'!O34","v":"FEN 2"},5,0,"BND","FEN 2",null,2,{"$f":"VLOOKUP($I20,$I$3:$S$15,COLUMNS($J19:J19)+1,FALSE)","v":"STAN 2"},{"$f":"VLOOKUP($I20,$I$3:$S$15,COLUMNS($J19:K19)+1,FALSE)","v":"Stanislas 2"},{"$f":"VLOOKUP($I20,$I$3:$S$15,COLUMNS($J19:L19)+1,FALSE)","v":22},{"$f":"VLOOKUP($I20,$I$3:$S$15,COLUMNS($J19:M19)+1,FALSE)","v":19},{"$f":"VLOOKUP($I20,$I$3:$S$15,COLUMNS($J19:N19)+1,FALSE)","v":0},{"$f":"VLOOKUP($I20,$I$3:$S$15,COLUMNS($J19:O19)+1,FALSE)","v":3},{"$f":"VLOOKUP($I20,$I$3:$S$15,COLUMNS($J19:P19)+1,FALSE)","v":62},{"$f":"VLOOKUP($I20,$I$3:$S$15,COLUMNS($J19:Q19)+1,FALSE)","v":12},{"$f":"VLOOKUP($I20,$I$3:$S$15,COLUMNS($J19:R19)+1,FALSE)","v":50},{"$f":"VLOOKUP($I20,$I$3:$S$15,COLUMNS($J19:S19)+1,FALSE)","v":79}]
[18,{"$f":"'Calendrier MG'!N35","v":"MASS 1"},{"$f":"'Calendrier MG'!O35","v":"STAN 2"},0,1,"STAN 2","MASS 1",null,3,{"$f":"VLOOKUP($I21,$I$3:$S$15,COLUMNS($J20:J20)+1,FALSE)","v":"SANO"},{"$f":"VLOOKUP($I21,$I$3:$S$15,COLUMNS($J20:K20)+1,FALSE)","v":"Saint André de Nogent"},{"$f":"VLOOKUP($I21,$I$3:$S$15,COLUMNS($J20:L20)+1,FALSE)","v":22},{"$f":"VLOOKUP($I21,$I$3:$S$15,COLUMNS($J20:M20)+1,FALSE)","v":15},{"$f":"VLOOKUP($I21,$I$3:$S$15,COLUMNS($J20:N20)+1,FALSE)","v":4},{"$f":"VLOOKUP($I21,$I$3:$S$15,COLUMNS($J20:O20)+1,FALSE)","v":3},{"$f":"VLOOKUP($I21,$I$3:$S$15,COLUMNS($J20:P20)+1,FALSE)","v":53},{"$f":"VLOOKUP($I21,$I$3:$S$15,COLUMNS($J20:Q20)+1,FALSE)","v":13},{"$f":"VLOOKUP($I21,$I$3:$S$15,COLUMNS($J20:R20)+1,FALSE)","v":40},{"$f":"VLOOKUP($I21,$I$3:$S$15,COLUMNS($J20:S20)+1,FALSE)","v":71}]
[19,{"$f":"'Calendrier MG'!N36","v":"MASS 2"},{"$f":"'Calendrier MG'!O36","v":"SANO"},1,3,"SANO","MASS 2",null,4,{"$f":"VLOOKUP($I22,$I$3:$S$15,COLUMNS($J21:J21)+1,FALSE)","v":"FEN 1"},{"$f":"VLOOKUP($I22,$I$3:$S$15,COLUMNS($J21:K21)+1,FALSE)","v":"Fénelon Sainte Marie 1"},{"$f":"VLOOKUP($I22,$I$3:$S$15,COLUMNS($J21:L21)+1,FALSE)","v":22},{"$f":"VLOOKUP($I22,$I$3:$S$15,COLUMNS($J21:M21)+1,FALSE)","v":15},{"$f":"VLOOKUP($I22,$I$3:$S$15,COLUMNS($J21:N21)+1,FALSE)","v":4},{"$f":"VLOOKUP($I22,$I$3:$S$15,COLUMNS($J21:O21)+1,FALSE)","v":3},{"$f":"VLOOKUP($I22,$I$3:$S$15,COLUMNS($J21:P21)+1,FALSE)","v":59},{"$f":"VLOOKUP($I22,$I$3:$S$15,COLUMNS($J21:Q21)+1,FALSE)","v":22},{"$f":"VLOOKUP($I22,$I$3:$S$15,COLUMNS($J21:R21)+1,FALSE)","v":37},{"$f":"VLOOKUP($I22,$I$3:$S$15,COLUMNS($J21:S21)+1,FALSE)","v":71}]
[20,{"$f":"'Calendrier MG'!N37","v":"STAN 1"},{"$f":"'Calendrier MG'!O37","v":"FEN 1"},2,3,"FEN 1","STAN 1",null,5,{"$f":"VLOOKUP($I23,$I$3:$S$15,COLUMNS($J22:J22)+1,FALSE)","v":"STAN 1"},{"$f":"VLOOKUP($I23,$I$3:$S$15,COLUMNS($J22:K22)+1,FALSE)","v":"Stanislas 1"},{"$f":"VLOOKUP($I23,$I$3:$S$15,COLUMNS($J22:L22)+1,FALSE)","v":22},{"$f":"VLOOKUP($I23,$I$3:$S$15,COLUMNS($J22:M22)+1,FALSE)","v":15},{"$f":"VLOOKUP($I23,$I$3:$S$15,COLUMNS($J22:N22)+1,FALSE)","v":1},{"$f":"VLOOKUP($I23,$I$3:$S$15,COLUMNS($J22:O22)+1,FALSE)","v":6},{"$f":"VLOOKUP($I23,$I$3:$S$15,COLUMNS($J22:P22)+1,FALSE)","v":55},{"$f":"VLOOKUP($I23,$I$3:$S$15,COLUMNS($J22:Q22)+1,FALSE)","v":12},{"$f":"VLOOKUP($I23,$I$3:$S$15,COLUMNS($J22:R22)+1,FALSE)","v":43},{"$f":"VLOOKUP($I23,$I$3:$S$15,COLUMNS($J22:S22)+1,FALSE)","v":68}]
[21,{"$f":"'Calendrier MG'!N38","v":"STAN 2"},{"$f":"'Calendrier MG'!O38","v":"FEN 2"},2,0,"STAN 2","FEN 2",null,6,{"$f":"VLOOKUP($I24,$I$3:$S$15,COLUMNS($J23:J23)+1,FALSE)","v":"MASS 2"},{"$f":"VLOOKUP($I24,$I$3:$S$15,COLUMNS($J23:K23)+1,FALSE)","v":"Massillon 2"},{"$f":"VLOOKUP($I24,$I$3:$S$15,COLUMNS($J23:L23)+1,FALSE)","v":22},{"$f":"VLOOKUP($I24,$I$3:$S$15,COLUMNS($J23:M23)+1,FALSE)","v":9},{"$f":"VLOOKUP($I24,$I$3:$S$15,COLUMNS($J23:N23)+1,FALSE)","v":3},{"$f":"VLOOKUP($I24,$I$3:$S$15,COLUMNS($J23:O23)+1,FALSE)","v":10},{"$f":"VLOOKUP($I24,$I$3:$S$15,COLUMNS($J23:P23)+1,FALSE)","v":29},{"$f":"VLOOKUP($I24,$I$3:$S$15,COLUMNS($J23:Q23)+1,FALSE)","v":40},{"$f":"VLOOKUP($I24,$I$3:$S$15,COLUMNS($J23:R23)+1,FALSE)","v":-11},{"$f":"VLOOKUP($I24,$I$3:$S$15,COLUMNS($J23:S23)+1,FALSE)","v":52}]
[22,{"$f":"'Calendrier MG'!N39","v":"BND"},{"$f":"'Calendrier MG'!O39","v":"MASS 2"},1,2,{"$f":"IF(D25<>\"\",IF(D25>E25,B25,IF(D25<E25,C25,\"nul\")),\"\")","v":"MASS 2"},{"$f":"IF(E25<>\"\",IF(E25<D25,C25,IF(E25>D25,B25,\"nul\")),\"\")","v":"BND"},null,7,{"$f":"VLOOKUP($I25,$I$3:$S$15,COLUMNS($J24:J24)+1,FALSE)","v":"BND"},{"$f":"VLOOKUP($I25,$I$3:$S$15,COLUMNS($J24:K24)+1,FALSE)","v":"Bossuet Notre Dame"},{"$f":"VLOOKUP($I25,$I$3:$S$15,COLUMNS($J24:L24)+1,FALSE)","v":22},{"$f":"VLOOKUP($I25,$I$3:$S$15,COLUMNS($J24:M24)+1,FALSE)","v":6},{"$f":"VLOOKUP($I25,$I$3:$S$15,COLUMNS($J24:N24)+1,FALSE)","v":4},{"$f":"VLOOKUP($I25,$I$3:$S$15,COLUMNS($J24:O24)+1,FALSE)","v":12},{"$f":"VLOOKUP($I25,$I$3:$S$15,COLUMNS($J24:P24)+1,FALSE)","v":25},{"$f":"VLOOKUP($I25,$I$3:$S$15,COLUMNS($J24:Q24)+1,FALSE)","v":49},{"$f":"VLOOKUP($I25,$I$3:$S$15,COLUMNS($J24:R24)+1,FALSE)","v":-24},{"$f":"VLOOKUP($I25,$I$3:$S$15,COLUMNS($J24:S24)+1,FALSE)","v":44}]
[23,{"$f":"'Calendrier MG'!N40","v":"STAN 1"},{"$f":"'Calendrier MG'!O40","v":"MASS 1"},1,2,"MASS 1","STAN 1",null,8,{"$f":"VLOOKUP($I26,$I$3:$S$15,COLUMNS($J25:J25)+1,FALSE)","v":"STAN 3"},{"$f":"VLOOKUP($I26,$I$3:$S$15,COLUMNS($J25:K25)+1,FALSE)","v":"Stanislas 3"},{"$f":"VLOOKUP($I26,$I$3:$S$15,COLUMNS($J25:L25)+1,FALSE)","v":22},{"$f":"VLOOKUP($I26,$I$3:$S$15,COLUMNS($J25:M25)+1,FALSE)","v":6},{"$f":"VLOOKUP($I26,$I$3:$S$15,COLUMNS($J25:N25)+1,FALSE)","v":3},{"$f":"VLOOKUP($I26,$I$3:$S$15,COLUMNS($J25:O25)+1,FALSE)","v":13},{"$f":"VLOOKUP($I26,$I$3:$S$15,COLUMNS($J25:P25)+1,FALSE)","v":16},{"$f":"VLOOKUP($I26,$I$3:$S$15,COLUMNS($J25:Q25)+1,FALSE)","v":40},{"$f":"VLOOKUP($I26,$I$3:$S$15,COLUMNS($J25:R25)+1,FALSE)","v":-24},{"$f":"VLOOKUP($I26,$I$3:$S$15,COLUMNS($J25:S25)+1,FALSE)","v":43}]
[24,{"$f":"'Calendrier MG'!N41","v":"SANO"},{"$f":"'Calendrier MG'!O41","v":"FEN 1"},1,0,"SANO","FEN 1",null,9,{"$f":"VLOOKUP($I27,$I$3:$S$15,COLUMNS($J26:J26)+1,FALSE)","v":"ROC "},{"$f":"VLOOKUP($I27,$I$3:$S$15,COLUMNS($J26:K26)+1,FALSE)","v":"Rocroy Saint Vincent"},{"$f":"VLOOKUP($I27,$I$3:$S$15,COLUMNS($J26:L26)+1,FALSE)","v":22},{"$f":"VLOOKUP($I27,$I$3:$S$15,COLUMNS($J26:M26)+1,FALSE)","v":6},{"$f":"VLOOKUP($I27,$I$3:$S$15,COLUMNS($J26:N26)+1,FALSE)","v":1},{"$f":"VLOOKUP($I27,$I$3:$S$15,COLUMNS($J26:O26)+1,FALSE)","v":15},{"$f":"VLOOKUP($I27,$I$3:$S$15,COLUMNS($J26:P26)+1,FALSE)","v":26},{"$f":"VLOOKUP($I27,$I$3:$S$15,COLUMNS($J26:Q26)+1,FALSE)","v":63},{"$f":"VLOOKUP($I27,$I$3:$S$15,COLUMNS($J26:R26)+1,FALSE)","v":-37},{"$f":"VLOOKUP($I27,$I$3:$S$15,COLUMNS($J26:S26)+1,FALSE)","v":41}]
[25,{"$f":"'Calendrier MG'!N42","v":"STAN 2"},{"$f":"'Calendrier MG'!O42","v":"MASS 2"},1,0,"STAN 2","MASS 2",null,10,{"$f":"VLOOKUP($I28,$I$3:$S$15,COLUMNS($J27:J27)+1,FALSE)","v":"ASVP"},{"$f":"VLOOKUP($I28,$I$3:$S$15,COLUMNS($J27:K27)+1,FALSE)","v":"Saint Vincent de Paul"},{"$f":"VLOOKUP($I28,$I$3:$S$15,COLUMNS($J27:L27)+1,FALSE)","v":22},{"$f":"VLOOKUP($I28,$I$3:$S$15,COLUMNS($J27:M27)+1,FALSE)","v":5},{"$f":"VLOOKUP($I28,$I$3:$S$15,COLUMNS($J27:N27)+1,FALSE)","v":1},{"$f":"VLOOKUP($I28,$I$3:$S$15,COLUMNS($J27:O27)+1,FALSE)","v":16},{"$f":"VLOOKUP($I28,$I$3:$S$15,COLUMNS($J27:P27)+1,FALSE)","v":22},{"$f":"VLOOKUP($I28,$I$3:$S$15,COLUMNS($J27:Q27)+1,FALSE)","v":44},{"$f":"VLOOKUP($I28,$I$3:$S$15,COLUMNS($J27:R27)+1,FALSE)","v":-22},{"$f":"VLOOKUP($I28,$I$3:$S$15,COLUMNS($J27:S27)+1,FALSE)","v":38}]
[26,{"$f":"'Calendrier MG'!N43","v":"FEN 2"},{"$f":"'Calendrier MG'!O43","v":"MASS 1"},0,2,"MASS 1","FEN 2",null,11,{"$f":"VLOOKUP($I29,$I$3:$S$15,COLUMNS($J28:J28)+1,FALSE)","v":"FEN 2"},{"$f":"VLOOKUP($I29,$I$3:$S$15,COLUMNS($J28:K28)+1,FALSE)","v":"Fénelon Sainte Marie 2"},{"$f":"VLOOKUP($I29,$I$3:$S$15,COLUMNS($J28:L28)+1,FALSE)","v":22},{"$f":"VLOOKUP($I29,$I$3:$S$15,COLUMNS($J28:M28)+1,FALSE)","v":4},{"$f":"VLOOKUP($I29,$I$3:$S$15,COLUMNS($J28:N28)+1,FALSE)","v":3},{"$f":"VLOOKUP($I29,$I$3:$S$15,COLUMNS($J28:O28)+1,FALSE)","v":15},{"$f":"VLOOKUP($I29,$I$3:$S$15,COLUMNS($J28:P28)+1,FALSE)","v":17},{"$f":"VLOOKUP($I29,$I$3:$S$15,COLUMNS($J28:Q28)+1,FALSE)","v":49},{"$f":"VLOOKUP($I29,$I$3:$S$15,COLUMNS($J28:R28)+1,FALSE)","v":-32},{"$f":"VLOOKUP($I29,$I$3:$S$15,COLUMNS($J28:S28)+1,FALSE)","v":37}]
[27,{"$f":"'Calendrier MG'!N44","v":"FEN 1"},{"$f":"'Calendrier MG'!O44","v":"BND"},2,1,"FEN 1","BND",null,12,{"$f":"VLOOKUP($I30,$I$3:$S$15,COLUMNS($J29:J29)+1,FALSE)","v":"JBS"},{"$f":"VLOOKUP($I30,$I$3:$S$15,COLUMNS($J29:K29)+1,FALSE)","v":"Jean Baptiste La Salle Saint-Denis"},{"$f":"VLOOKUP($I30,$I$3:$S$15,COLUMNS($J29:L29)+1,FALSE)","v":22},{"$f":"VLOOKUP($I30,$I$3:$S$15,COLUMNS($J29:M29)+1,FALSE)","v":1},{"$f":"VLOOKUP($I30,$I$3:$S$15,COLUMNS($J29:N29)+1,FALSE)","v":0},{"$f":"VLOOKUP($I30,$I$3:$S$15,COLUMNS($J29:O29)+1,FALSE)","v":21},{"$f":"VLOOKUP($I30,$I$3:$S$15,COLUMNS($J29:P29)+1,FALSE)","v":11},{"$f":"VLOOKUP($I30,$I$3:$S$15,COLUMNS($J29:Q29)+1,FALSE)","v":91},{"$f":"VLOOKUP($I30,$I$3:$S$15,COLUMNS($J29:R29)+1,FALSE)","v":-80},{"$f":"VLOOKUP($I30,$I$3:$S$15,COLUMNS($J29:S29)+1,FALSE)","v":25}]
[28,{"$f":"'Calendrier MG'!N45","v":"SANO"},{"$f":"'Calendrier MG'!O45","v":"STAN 1"},0,1,"STAN 1","SANO"]
[29,{"$f":"'Calendrier MG'!N46","v":"SANO"},{"$f":"'Calendrier MG'!O46","v":"ASVP"},3,1,"SANO","ASVP"]
[30,{"$f":"'Calendrier MG'!N47","v":"BND"},{"$f":"'Calendrier MG'!O47","v":"ASVP"},1,0,"BND","ASVP"]
[31,{"$f":"'Calendrier MG'!N48","v":"STAN 1"},{"$f":"'Calendrier MG'!O48","v":"ASVP"},1,0,"STAN 1","ASVP"]
[32,{"$f":"'Calendrier MG'!N49","v":"STAN 2"},{"$f":"'Calendrier MG'!O49","v":"ASVP"},3,1,"STAN 2","ASVP"]
[33,{"$f":"'Calendrier MG'!N50","v":"MASS 1"},{"$f":"'Calendrier MG'!O50","v":"ASVP"},3,0,"MASS 1","ASVP"]
[34,{"$f":"'Calendrier MG'!N51","v":"MASS 2"},{"$f":"'Calendrier MG'!O51","v":"ASVP"},2,0,"MASS 2","ASVP"]
[35,{"$f":"'Calendrier MG'!N52","v":"FEN 1"},{"$f":"'Calendrier MG'!O52","v":"ASVP"},5,1,"FEN 1","ASVP"]
[36,{"$f":"'Calendrier MG'!N53","v":"FEN 2"},{"$f":"'Calendrier MG'!O53","v":"ASVP"},0,2,"ASVP","FEN 2"]
[37,{"$f":"'Calendrier MG'!N54","v":"SANO"},{"$f":"'Calendrier MG'!O54","v":"ROC "},6,0,"SANO","ROC "]
[38,{"$f":"'Calendrier MG'!N55","v":"BND"},{"$f":"'Calendrier MG'!O55","v":"ROC "},4,1,"BND","ROC "]
[39,{"$f":"'Calendrier MG'!N56","v":"STAN 1"},{"$f":"'Calendrier MG'!O56","v":"ROC "},5,0,"STAN 1","ROC "]
[40,{"$f":"'Calendrier MG'!N57","v":"STAN 2"},{"$f":"'Calendrier MG'!O57","v":"ROC "},6,0,"STAN 2","ROC "]
[41,{"$f":"'Calendrier MG'!N58","v":"MASS 1"},{"$f":"'Calendrier MG'!O58","v":"ROC "},4,0,"MASS 1","ROC "]
[42,{"$f":"'Calendrier MG'!N59","v":"MASS 2"},{"$f":"'Calendrier MG'!O59","v":"ROC "},1,3,"ROC ","MASS 2"]
[43,{"$f":"'Calendrier MG'!N60","v":"FEN 1"},{"$f":"'Calendrier MG'!O60","v":"ROC "},6,1,"FEN 1","ROC "]
[44,{"$f":"'Calendrier MG'!N61","v":"FEN 2"},{"$f":"'Calendrier MG'!O61","v":"ROC "},0,1,"ROC ","FEN 2"]
[45,{"$f":"'Calendrier MG'!N62","v":"ASVP"},{"$f":"'Calendrier MG'!O62","v":"ROC "},0,3,"ROC ","ASVP"]
[46,{"$f":"'Calendrier MG'!N63","v":"SANO"},{"$f":"'Calendrier MG'!O63","v":"STAN 3"},2,0,"SANO","STAN 3"]
[47,{"$f":"'Calendrier MG'!N64","v":"BND"},{"$f":"'Calendrier MG'!O64","v":"STAN 3"},1,2,"STAN 3","BND"]
[48,{"$f":"'Calendrier MG'!N65","v":"STAN 1"},{"$f":"'Calendrier MG'!O65","v":"STAN 3"},2,0,"STAN 1","STAN 3"]
[49,{"$f":"'Calendrier MG'!N66","v":"STAN 2"},{"$f":"'Calendrier MG'!O66","v":"STAN 3"},1,0,"STAN 2","STAN 3"]
[50,{"$f":"'Calendrier MG'!N67","v":"MASS 1"},{"$f":"'Calendrier MG'!O67","v":"STAN 3"},2,0,"MASS 1","STAN 3"]
[51,{"$f":"'Calendrier MG'!N68","v":"MASS 2"},{"$f":"'Calendrier MG'!O68","v":"STAN 3"},2,0,"MASS 2","STAN 3"]
[52,{"$f":"'Calendrier MG'!N69","v":"FEN 1"},{"$f":"'Calendrier MG'!O69","v":"STAN 3"},4,0,"FEN 1","STAN 3"]
[53,{"$f":"'Calendrier MG'!N70","v":"FEN 2"},{"$f":"'Calendrier MG'!O70","v":"STAN 3"},2,0,"FEN 2","STAN 3"]
[54,{"$f":"'Calendrier MG'!N71","v":"ASVP"},{"$f":"'Calendrier MG'!O71","v":"STAN 3"},1,2,"STAN 3","ASVP"]
[55,{"$f":"'Calendrier MG'!N72","v":"ROC "},{"$f":"'Calendrier MG'!O72","v":"STAN 3"},0,1,"STAN 3","ROC "]
[56,{"$f":"'Calendrier MG'!N73","v":"SANO"},{"$f":"'Calendrier MG'!O73","v":"JBS"},3,0,"SANO","JBS"]
[57,{"$f":"'Calendrier MG'!N74","v":"BND"},{"$f":"'Calendrier MG'!O74","v":"JBS"},3,0,"BND","JBS"]
[58,{"$f":"'Calendrier MG'!N75","v":"STAN 1"},{"$f":"'Calendrier MG'!O75","v":"JBS"},5,0,"STAN 1","JBS"]
[59,{"$f":"'Calendrier MG'!N76","v":"STAN 2"},{"$f":"'Calendrier MG'!O76","v":"JBS"},7,0,"STAN 2","JBS"]
[60,{"$f":"'Calendrier MG'!N77","v":"MASS 1"},{"$f":"'Calendrier MG'!O77","v":"JBS"},6,0,"MASS 1","JBS"]
[61,{"$f":"'Calendrier MG'!N78","v":"MASS 2"},{"$f":"'Calendrier MG'!O78","v":"JBS"},0,8,"JBS","MASS 2"]
[62,{"$f":"'Calendrier MG'!N79","v":"FEN 1"},{"$f":"'Calendrier MG'!O79","v":"JBS"},5,0,"FEN 1","JBS"]
[63,{"$f":"'Calendrier MG'!N80","v":"FEN 2"},{"$f":"'Calendrier MG'!O80","v":"JBS"},5,1,"FEN 2","JBS"]
[64,{"$f":"'Calendrier MG'!N81","v":"ASVP"},{"$f":"'Calendrier MG'!O81","v":"JBS"},8,1,"ASVP","JBS"]
[65,{"$f":"'Calendrier MG'!N82","v":"ROC "},{"$f":"'Calendrier MG'!O82","v":"JBS"},6,1,"ROC ","JBS"]
[66,{"$f":"'Calendrier MG'!N83","v":"STAN 3"},{"$f":"'Calendrier MG'!O83","v":"JBS"},3,0,"STAN 3","JBS"]
[67,{"$f":"'Calendrier MG'!N84","v":"STAN 1"},{"$f":"'Calendrier MG'!O84","v":"BND"},4,0,"STAN 1","BND"]
[68,{"$f":"'Calendrier MG'!N85","v":"MASS 1"},{"$f":"'Calendrier MG'!O85","v":"SANO"},2,2,"nul","nul"]
[69,{"$f":"'Calendrier MG'!N86","v":"STAN 2"},{"$f":"'Calendrier MG'!O86","v":"FEN 1"},0,1,"FEN 1","STAN 2"]
[70,{"$f":"'Calendrier MG'!N87","v":"FEN 2"},{"$f":"'Calendrier MG'!O87","v":"MASS 2"},2,3,"MASS 2","FEN 2"]
[71,{"$f":"'Calendrier MG'!N88","v":"BND"},{"$f":"'Calendrier MG'!O88","v":"SANO"},0,0,"nul","nul"]
[72,{"$f":"'Calendrier MG'!N89","v":"STAN 2"},{"$f":"'Calendrier MG'!O89","v":"STAN 1"},1,0,"STAN 2","STAN 1"]
[73,{"$f":"'Calendrier MG'!N90","v":"MASS 2"},{"$f":"'Calendrier MG'!O90","v":"MASS 1"},0,4,"MASS 1","MASS 2"]
[74,{"$f":"'Calendrier MG'!N91","v":"FEN 1"},{"$f":"'Calendrier MG'!O91","v":"FEN 2"},3,0,"FEN 1","FEN 2"]
[75,{"$f":"'Calendrier MG'!N92","v":"SANO"},{"$f":"'Calendrier MG'!O92","v":"STAN 2"},2,4,"STAN 2","SANO"]
[76,{"$f":"'Calendrier MG'!N93","v":"BND"},{"$f":"'Calendrier MG'!O93","v":"MASS 1"},0,4,"MASS 1","BND"]
[77,{"$f":"'Calendrier MG'!N94","v":"STAN 1"},{"$f":"'Calendrier MG'!O94","v":"FEN 2"},3,0,"STAN 1","FEN 2"]
[78,{"$f":"'Calendrier MG'!N95","v":"FEN 1"},{"$f":"'Calendrier MG'!O95","v":"MASS 2"},4,4,"nul","nul"]
[79,{"$f":"'Calendrier MG'!N96","v":"BND"},{"$f":"'Calendrier MG'!O96","v":"STAN 2"},1,8,"STAN 2","BND"]
[80,{"$f":"'Calendrier MG'!N97","v":"SANO"},{"$f":"'Calendrier MG'!O97","v":"FEN 2"},3,0,"SANO","FEN 2"]
[81,{"$f":"'Calendrier MG'!N98","v":"MASS 1"},{"$f":"'Calendrier MG'!O98","v":"FEN 1"},2,2,"nul","nul"]
[82,{"$f":"'Calendrier MG'!N99","v":"MASS 2"},{"$f":"'Calendrier MG'!O99","v":"STAN 1"},0,1,"STAN 1","MASS 2"]
[83,{"$f":"'Calendrier MG'!N100","v":"FEN 2"},{"$f":"'Calendrier MG'!O100","v":"BND"},0,0,"nul","nul"]
[84,{"$f":"'Calendrier MG'!N101","v":"STAN 2"},{"$f":"'Calendrier MG'!O101","v":"MASS 1"},0,2,"MASS 1","STAN 2"]
[85,{"$f":"'Calendrier MG'!N102","v":"SANO"},{"$f":"'Calendrier MG'!O102","v":"MASS 2"},1,1,"nul","nul"]
[86,{"$f":"'Calendrier MG'!N103","v":"FEN 1"},{"$f":"'Calendrier MG'!O103","v":"STAN 1"},0,0,{"$f":"IF(D89<>\"\",IF(D89>E89,B89,IF(D89<E89,C89,\"nul\")),\"\")","v":"nul"},{"$f":"IF(E89<>\"\",IF(E89<D89,C89,IF(E89>D89,B89,\"nul\")),\"\")","v":"nul"}]
[87,{"$f":"'Calendrier MG'!N104","v":"FEN 2"},{"$f":"'Calendrier MG'!O104","v":"STAN 2"},0,3,"STAN 2","FEN 2"]
[88,{"$f":"'Calendrier MG'!N105","v":"MASS 2"},{"$f":"'Calendrier MG'!O105","v":"BND"},3,1,"MASS 2","BND"]
[89,{"$f":"'Calendrier MG'!N106","v":"MASS 1"},{"$f":"'Calendrier MG'!O106","v":"STAN 1"},1,0,"MASS 1","STAN 1"]
[90,{"$f":"'Calendrier MG'!N107","v":"FEN 1"},{"$f":"'Calendrier MG'!O107","v":"SANO"},0,1,"SANO","FEN 1"]
[91,{"$f":"'Calendrier MG'!N108","v":"MASS 2"},{"$f":"'Calendrier MG'!O108","v":"STAN 2"},0,4,"STAN 2","MASS 2"]
[92,{"$f":"'Calendrier MG'!N109","v":"MASS 1"},{"$f":"'Calendrier MG'!O109","v":"FEN 2"},6,0,"MASS 1","FEN 2"]
[93,{"$f":"'Calendrier MG'!N110","v":"BND"},{"$f":"'Calendrier MG'!O110","v":"FEN 1"},1,1,"nul","nul"]
[94,{"$f":"'Calendrier MG'!N111","v":"STAN 1"},{"$f":"'Calendrier MG'!O111","v":"SANO"},0,3,"SANO","STAN 1"]
[95,{"$f":"'Calendrier MG'!N112","v":"ASVP"},{"$f":"'Calendrier MG'!O112","v":"SANO"},1,3,"SANO","ASVP"]
[96,{"$f":"'Calendrier MG'!N113","v":"ASVP"},{"$f":"'Calendrier MG'!O113","v":"BND"},0,1,"BND","ASVP"]
[97,{"$f":"'Calendrier MG'!N114","v":"ASVP"},{"$f":"'Calendrier MG'!O114","v":"STAN 1"},0,4,"STAN 1","ASVP"]
[98,{"$f":"'Calendrier MG'!N115","v":"ASVP"},{"$f":"'Calendrier MG'!O115","v":"STAN 2"},1,3,"STAN 2","ASVP"]
[99,{"$f":"'Calendrier MG'!N116","v":"ASVP"},{"$f":"'Calendrier MG'!O116","v":"MASS 1"},0,3,"MASS 1","ASVP"]
[100,{"$f":"'Calendrier MG'!N117","v":"ASVP"},{"$f":"'Calendrier MG'!O117","v":"MASS 2"},0,2,"MASS 2","ASVP"]
[101,{"$f":"'Calendrier MG'!N118","v":"ASVP"},{"$f":"'Calendrier MG'!O118","v":"FEN 1"},0,3,"FEN 1","ASVP"]
[102,{"$f":"'Calendrier MG'!N119","v":"ASVP"},{"$f":"'Calendrier MG'!O119","v":"FEN 2"},1,0,"ASVP","FEN 2"]
[103,{"$f":"'Calendrier MG'!N120","v":"ROC "},{"$f":"'Calendrier MG'!O120","v":"SANO"},0,4,"SANO","ROC "]
[104,{"$f":"'Calendrier MG'!N121","v":"ROC "},{"$f":"'Calendrier MG'!O121","v":"BND"},1,1,"nul","nul"]
[105,{"$f":"'Calendrier MG'!N122","v":"ROC "},{"$f":"'Calendrier MG'!O122","v":"STAN 1"},0,5,"STAN 1","ROC "]
[106,{"$f":"'Calendrier MG'!N123","v":"ROC "},{"$f":"'Calendrier MG'!O123","v":"STAN 2"},0,6,"STAN 2","ROC "]
[107,{"$f":"'Calendrier MG'!N124","v":"ROC "},{"$f":"'Calendrier MG'!O124","v":"MASS 1"},0,3,"MASS 1","ROC "]
[108,{"$f":"'Calendrier MG'!N125","v":"ROC "},{"$f":"'Calendrier MG'!O125","v":"MASS 2"},0,3,"MASS 2","ROC "]
[109,{"$f":"'Calendrier MG'!N126","v":"ROC "},{"$f":"'Calendrier MG'!O126","v":"FEN 1"},1,2,"FEN 1","ROC "]
[110,{"$f":"'Calendrier MG'!N127","v":"ROC "},{"$f":"'Calendrier MG'!O127","v":"FEN 2"},2,4,"FEN 2","ROC "]
[111,{"$f":"'Calendrier MG'!N128","v":"ROC "},{"$f":"'Calendrier MG'!O128","v":"ASVP"},0,1,"ASVP","ROC "]
[112,{"$f":"'Calendrier MG'!N129","v":"STAN 3"},{"$f":"'Calendrier MG'!O129","v":"SANO"},0,3,"SANO","STAN 3"]
[113,{"$f":"'Calendrier MG'!N130","v":"STAN 3"},{"$f":"'Calendrier MG'!O130","v":"BND"},1,0,"STAN 3","BND"]
[114,{"$f":"'Calendrier MG'!N131","v":"STAN 3"},{"$f":"'Calendrier MG'!O131","v":"STAN 1"},1,3,"STAN 1","STAN 3"]
[115,{"$f":"'Calendrier MG'!N132","v":"STAN 3"},{"$f":"'Calendrier MG'!O132","v":"STAN 2"},0,3,"STAN 2","STAN 3"]
[116,{"$f":"'Calendrier MG'!N133","v":"STAN 3"},{"$f":"'Calendrier MG'!O133","v":"MASS 1"},1,6,"MASS 1","STAN 3"]
[117,{"$f":"'Calendrier MG'!N134","v":"STAN 3"},{"$f":"'Calendrier MG'!O134","v":"MASS 2"},0,0,"nul","nul"]
[118,{"$f":"'Calendrier MG'!N135","v":"STAN 3"},{"$f":"'Calendrier MG'!O135","v":"FEN 1"},0,3,"FEN 1","STAN 3"]
[119,{"$f":"'Calendrier MG'!N136","v":"STAN 3"},{"$f":"'Calendrier MG'!O136","v":"FEN 2"},1,1,"nul","nul"]
[120,{"$f":"'Calendrier MG'!N137","v":"STAN 3"},{"$f":"'Calendrier MG'!O137","v":"ASVP"},1,1,"nul","nul"]
[121,{"$f":"'Calendrier MG'!N138","v":"STAN 3"},{"$f":"'Calendrier MG'!O138","v":"ROC "},0,3,"ROC ","STAN 3"]
[122,{"$f":"'Calendrier MG'!N139","v":"JBS"},{"$f":"'Calendrier MG'!O139","v":"SANO"},0,3,"SANO","JBS"]
[123,{"$f":"'Calendrier MG'!N140","v":"JBS"},{"$f":"'Calendrier MG'!O140","v":"BND"},0,3,"BND","JBS"]
[124,{"$f":"'Calendrier MG'!N141","v":"JBS"},{"$f":"'Calendrier MG'!O141","v":"STAN 1"},0,3,"STAN 1","JBS"]
[125,{"$f":"'Calendrier MG'!N142","v":"JBS"},{"$f":"'Calendrier MG'!O142","v":"STAN 2"},0,3,"STAN 2","JBS"]
[126,{"$f":"'Calendrier MG'!N143","v":"JBS"},{"$f":"'Calendrier MG'!O143","v":"MASS 1"},0,3,"MASS 1","JBS"]
[127,{"$f":"'Calendrier MG'!N144","v":"JBS"},{"$f":"'Calendrier MG'!O144","v":"MASS 2"},0,3,"MASS 2","JBS"]
[128,{"$f":"'Calendrier MG'!N145","v":"JBS"},{"$f":"'Calendrier MG'!O145","v":"FEN 1"},0,9,"FEN 1","JBS"]
[129,{"$f":"'Calendrier MG'!N146","v":"JBS"},{"$f":"'Calendrier MG'!O146","v":"FEN 2"},0,3,"FEN 2","JBS"]
[130,{"$f":"'Calendrier MG'!N147","v":"JBS"},{"$f":"'Calendrier MG'!O147","v":"ASVP"},0,3,"ASVP","JBS"]
[131,{"$f":"'Calendrier MG'!N148","v":"JBS"},{"$f":"'Calendrier MG'!O148","v":"ROC "},0,4,"ROC ","JBS"]
[132,{"$f":"'Calendrier MG'!N149","v":"JBS"},{"$f":"'Calendrier MG'!O149","v":"STAN 3"},0,3,"STAN 3","JBS"]

{"sheet":"Calendriers CG et JG","index":6,"n_rows":47,"n_cols":15,"rows_kept":47,"cut":false,"hidden":false,"merged":[[2,0,8,0],[37,8,44,8],[28,4,35,4],[9,0,17,0],[9,1,9,8],[18,0,26,0],[18,1,18,8],[27,0,35,0],[27,1,27,8],[45,0,53,0],[45,1,45,8],[46,1,53,8],[10,13,10,14],[0,1,0,8],[0,10,0,21],[1,10,1,11],[2,1,2,8],[2,10,2,11],[36,0,44,0],[36,1,36,8],[3,4,8,4],[19,4,26,4],[1,6,1,7],[37,4,44,4],[10,1,17,8]]}
[null," CALENDRIER CADETS et JUNIORS",null,null,null,null,null,null,null,null,"POULES ET MATCHS CADETS ET JUNIORS"]
["Date","Match","Equipe A","Equipe B","Lieux","Horaires","Résultats",null,"Indisponibilités",null,"CADETS"]
["2021-11-17","LYCEE",null,null,null,null,null,null,null,null,"Etablissements"]
[null,1,{"$f":"VLOOKUP($B4,$K$11:$O$41,4)","v":"RS"},{"$f":"VLOOKUP($B4,$K$11:$O$41,5)","v":"MASS"},"La Courneuve 1/2 T12","14h",0,2,null,null,1,"RS"]
[null,3,{"$f":"VLOOKUP($B5,$K$11:$O$41,4)","v":"RS (JG)"},{"$f":"VLOOKUP($B5,$K$11:$O$41,5)","v":"MASS (JG)"},null,"14h30",0,0,null,null,2,"MASS"]
[null,15,{"$f":"VLOOKUP($B6,$K$11:$O$41,4)","v":"MASS"},{"$f":"VLOOKUP($B6,$K$11:$O$41,5)","v":"SMP"},null,"15h",2,0,null,null,3,"SMP"]
[null,null,null,null,null,null,null,null,null,null,4]
[null,null,null,null,null,null,null,null,null,null,5,"RS (JG)"]
[null,null,null,null,null,null,null,null,null,null,6,"MASS (JG)"]
["2021-11-24","LYCEE"]
[null,"CROSS IDF",null,null,null,null,null,null,null,null,"N° Match","Equipe A","Equipe B","Match"]
[null,null,null,null,null,null,null,null,null,null,1,1,2,{"$f":"VLOOKUP(L12,$K$2:$L$9,2)","v":"RS"},{"$f":"VLOOKUP(M12,$K$2:$L$9,2)","v":"MASS"}]
[null,null,null,null,null,null,null,null,null,null,2,3,4,{"$f":"VLOOKUP(L13,$K$2:$L$9,2)","v":"SMP"},{"$f":"VLOOKUP(M13,$K$2:$L$9,2)","v":0}]
[null,null,null,null,null,null,null,null,null,null,3,5,6,"RS (JG)","MASS (JG)"]
[null,null,null,null,null,null,null,null,null,null,4,1,4,"RS",0]
[null,null,null,null,null,null,null,null,null,null,5,2,5,"MASS","RS (JG)"]
[null,null,null,null,null,null,null,null,null,null,6,3,6,"SMP","MASS (JG)"]
[null,null,null,null,null,null,null,null,null,null,7,2,4,"MASS",0]
["1 dec","LYCEE",null,null,null,null,null,null,null,null,8,1,6,"RS","MASS (JG)"]
[null,null,null,null,null,null,null,null,null,null,9,3,5,"SMP","RS (JG)"]
[null,null,null,null,null,null,null,null,null,null,10,2,6,"MASS","MASS (JG)"]
[null,null,null,null,null,null,null,null,null,null,11,4,5,0,"RS (JG)"]
[null,null,null,null,null,null,null,null,null,null,12,1,3,"RS","SMP"]
[null,null,null,null,null,null,null,null,null,null,13,4,6,0,"MASS (JG)"]
[null,null,null,null,null,null,null,null,null,null,14,1,5,"RS","RS (JG)"]
[null,null,null,null,null,null,null,null,null,null,15,2,3,"MASS","SMP"]
[null,null,null,null,null,null,null,null,null,null,16,2,1,"MASS","RS"]
["8 dec","LYCEE",null,null,null,null,null,null,null,null,17,4,3,0,"SMP"]
[null,12,{"$f":"VLOOKUP($B29,$K$11:$O$41,4)","v":"RS"},{"$f":"VLOOKUP($B29,$K$11:$O$41,5)","v":"SMP"},"La Courneuve 1/2 T12","14h",0,3,null,null,18,6,5,"MASS (JG)","RS (JG)"]
[null,16,{"$f":"VLOOKUP($B30,$K$11:$O$41,4)","v":"MASS"},{"$f":"VLOOKUP($B30,$K$11:$O$41,5)","v":"RS"},null,"14h30",2,0,null,null,19,4,1,0,"RS"]
[null,18,"MASS (JG)","RS (JG)",null,"15h",2,0,null,null,20,5,2,"RS (JG)","MASS"]
[null,30,"SMP","MASS",null,"15h30",0,2,null,null,21,6,3,"MASS (JG)","SMP"]
[null,27,"SMP","RS",null,"16h",2,0,null,null,22,4,2,0,"MASS"]
[null,null,null,null,null,null,null,null,null,null,23,6,1,"MASS (JG)","RS"]
[null,null,null,null,null,null,null,null,null,null,24,5,3,"RS (JG)","SMP"]
[null,null,null,null,null,null,null,null,null,null,25,6,2,"MASS (JG)","MASS"]
["15 dec","LYCEE",null,null,null,null,null,null,null,null,26,5,4,"RS (JG)",0]
[null,null,null,null,null,null,null,null,"SMP",null,27,3,1,"SMP","RS"]
[null,null,null,null,null,null,null,null,null,null,28,6,4,"MASS (JG)",0]
[null,null,null,null,null,null,null,null,null,null,29,5,1,"RS (JG)","RS"]
[null,null,null,null,null,null,null,null,null,null,30,3,2,"SMP","MASS"]
[]
[]
[]
[]
["2022-01-26","LYCEE",null,null,null,null,null,null,null,null,null,"Territoire CG 19 janvier"]
[null,"TERRITOIRE CG PROMO / JG PROMO T3 La Courneuve ",null,null,null,null,null,null,null,null,null,"Territoire JG 26 janvier"]

{"sheet":"Cls CG et JG","index":7,"n_rows":33,"n_cols":20,"rows_kept":33,"cut":false,"hidden":false,"merged":[[0,0,1,6],[2,3,2,4]]}
["CADETS PROMO",null,null,null,null,null,null,null,null,"SIGLE","Etablissement","Matchs joués","Victoires","Nuls ","Défaites","Buts Pour","Buts Contre","Différence","Points"]
[null,null,null,null,null,null,null,null,{"$f":"RANK(T2,$T$2:$T$4)","v":3},"RS","Robert Schuman",{"$f":"COUNT(D4,D19,D30,D15)","v":4},{"$f":"COUNTIF($F$3:$F$33,J2)","v":0},{"$f":"L2-M2-O2","v":0},{"$f":"COUNTIF($G$3:$G$33,J2)","v":4},{"$f":"SUM(D4,E19,E30,D15)","v":0},{"$f":"SUM(E4,D19,D30,E15)","v":9},{"$f":"P2-Q2","v":-9},{"$f":"M2*4+N2*2+O2*1","v":4},{"$f":"SUM(S2*1000000+R2*10000+P2*100+L2*10)","v":3910040}]
["N° Match","Equipe A","Equipe B","Scores",null,"Vainqueur","Perdant",null,{"$f":"RANK(T3,$T$2:$T$4)","v":1},"MASS","Massillon ",{"$f":"COUNT(D4,D18,D33,D19)","v":4},{"$f":"COUNTIF($F$3:$F$33,J3)","v":4},0,{"$f":"COUNTIF($G$3:$G$33,J3)","v":0},{"$f":"SUM(E4,D18,E33,D19)","v":8},{"$f":"SUM(D4,E18,D33,E19)","v":0},{"$f":"P3-Q3","v":8},{"$f":"M3*4+N3*2+O3*1","v":16},{"$f":"SUM(S3*1000000+R3*10000+P3*100+L3*10)","v":16080840}]
[1,{"$f":"'Calendriers CG et JG'!N12","v":"RS"},{"$f":"'Calendriers CG et JG'!O12","v":"MASS"},0,2,{"$f":"IF(D4<>\"\",IF(D4>E4,B4,IF(D4<E4,C4,\"nul\")),\"\")","v":"MASS"},{"$f":"IF(E4<>\"\",IF(E4<D4,C4,IF(E4>D4,B4,\"nul\")),\"\")","v":"RS"},null,{"$f":"RANK(T4,$T$2:$T$4)","v":2},"SMP","Saint Michel de Picpus",{"$f":"COUNT(D18,D15,D30,D33)","v":4},2,0,2,{"$f":"SUM(E18,E15,D30,D33)","v":5},{"$f":"SUM(D18,D15,E30,E33)","v":4},{"$f":"P4-Q4","v":1},10,{"$f":"SUM(S4*1000000+R4*10000+P4*100+L4*10)","v":10010540}]
[2,{"$f":"'Calendriers CG et JG'!N13","v":"SMP"},{"$f":"'Calendriers CG et JG'!O13","v":0},null,null,{"$f":"IF(D5<>\"\",IF(D5>E5,B5,IF(D5<E5,C5,\"nul\")),\"\")","v":""},{"$f":"IF(E5<>\"\",IF(E5<D5,C5,IF(E5>D5,B5,\"nul\")),\"\")","v":""}]
[3,{"$f":"'Calendriers CG et JG'!N14","v":"RS (JG)"},{"$f":"'Calendriers CG et JG'!O14","v":"MASS (JG)"},0,0,"nul","nul"]
[4,{"$f":"'Calendriers CG et JG'!N15","v":"RS"},{"$f":"'Calendriers CG et JG'!O15","v":0},null,null,"","",null,"Classement","SIGLE","Etablissement","Matchs joués","Victoires","Nuls ","Défaites","Buts Pour","Buts Contre","Différence","Points"]
[5,{"$f":"'Calendriers CG et JG'!N16","v":"MASS"},{"$f":"'Calendriers CG et JG'!O16","v":"RS (JG)"},null,null,"","",null,1,{"$f":"VLOOKUP($I8,$I$2:$T$5,COLUMNS($J7:J7)+1,FALSE)","v":"MASS"},{"$f":"VLOOKUP($I8,$I$2:$T$5,COLUMNS($J7:K7)+1,FALSE)","v":"Massillon "},{"$f":"VLOOKUP($I8,$I$2:$T$5,COLUMNS($J7:L7)+1,FALSE)","v":4},{"$f":"VLOOKUP($I8,$I$2:$T$5,COLUMNS($J7:M7)+1,FALSE)","v":4},{"$f":"VLOOKUP($I8,$I$2:$T$5,COLUMNS($J7:N7)+1,FALSE)","v":0},{"$f":"VLOOKUP($I8,$I$2:$T$5,COLUMNS($J7:O7)+1,FALSE)","v":0},{"$f":"VLOOKUP($I8,$I$2:$T$5,COLUMNS($J7:P7)+1,FALSE)","v":8},{"$f":"VLOOKUP($I8,$I$2:$T$5,COLUMNS($J7:Q7)+1,FALSE)","v":0},{"$f":"VLOOKUP($I8,$I$2:$T$5,COLUMNS($J7:R7)+1,FALSE)","v":8},{"$f":"VLOOKUP($I8,$I$2:$T$5,COLUMNS($J7:S7)+1,FALSE)","v":16}]
[6,{"$f":"'Calendriers CG et JG'!N17","v":"SMP"},{"$f":"'Calendriers CG et JG'!O17","v":"MASS (JG)"},null,null,"","",null,2,{"$f":"VLOOKUP($I9,$I$2:$T$5,COLUMNS($J8:J8)+1,FALSE)","v":"SMP"},{"$f":"VLOOKUP($I9,$I$2:$T$5,COLUMNS($J8:K8)+1,FALSE)","v":"Saint Michel de Picpus"},{"$f":"VLOOKUP($I9,$I$2:$T$5,COLUMNS($J8:L8)+1,FALSE)","v":4},{"$f":"VLOOKUP($I9,$I$2:$T$5,COLUMNS($J8:M8)+1,FALSE)","v":2},{"$f":"VLOOKUP($I9,$I$2:$T$5,COLUMNS($J8:N8)+1,FALSE)","v":0},{"$f":"VLOOKUP($I9,$I$2:$T$5,COLUMNS($J8:O8)+1,FALSE)","v":2},{"$f":"VLOOKUP($I9,$I$2:$T$5,COLUMNS($J8:P8)+1,FALSE)","v":5},{"$f":"VLOOKUP($I9,$I$2:$T$5,COLUMNS($J8:Q8)+1,FALSE)","v":4},{"$f":"VLOOKUP($I9,$I$2:$T$5,COLUMNS($J8:R8)+1,FALSE)","v":1},{"$f":"VLOOKUP($I9,$I$2:$T$5,COLUMNS($J8:S8)+1,FALSE)","v":10}]
[7,{"$f":"'Calendriers CG et JG'!N18","v":"MASS"},{"$f":"'Calendriers CG et JG'!O18","v":0},null,null,{"$f":"IF(D10<>\"\",IF(D10>E10,B10,IF(D10<E10,C10,\"nul\")),\"\")","v":""},{"$f":"IF(E10<>\"\",IF(E10<D10,C10,IF(E10>D10,B10,\"nul\")),\"\")","v":""},null,3,{"$f":"VLOOKUP($I10,$I$2:$T$5,COLUMNS($J9:J9)+1,FALSE)","v":"RS"},{"$f":"VLOOKUP($I10,$I$2:$T$5,COLUMNS($J9:K9)+1,FALSE)","v":"Robert Schuman"},{"$f":"VLOOKUP($I10,$I$2:$T$5,COLUMNS($J9:L9)+1,FALSE)","v":4},{"$f":"VLOOKUP($I10,$I$2:$T$5,COLUMNS($J9:M9)+1,FALSE)","v":0},{"$f":"VLOOKUP($I10,$I$2:$T$5,COLUMNS($J9:N9)+1,FALSE)","v":0},{"$f":"VLOOKUP($I10,$I$2:$T$5,COLUMNS($J9:O9)+1,FALSE)","v":4},{"$f":"VLOOKUP($I10,$I$2:$T$5,COLUMNS($J9:P9)+1,FALSE)","v":0},{"$f":"VLOOKUP($I10,$I$2:$T$5,COLUMNS($J9:Q9)+1,FALSE)","v":9},{"$f":"VLOOKUP($I10,$I$2:$T$5,COLUMNS($J9:R9)+1,FALSE)","v":-9},{"$f":"VLOOKUP($I10,$I$2:$T$5,COLUMNS($J9:S9)+1,FALSE)","v":4}]
[8,{"$f":"'Calendriers CG et JG'!N19","v":"RS"},{"$f":"'Calendriers CG et JG'!O19","v":"MASS (JG)"},null,null,"",""]
[9,{"$f":"'Calendriers CG et JG'!N20","v":"SMP"},{"$f":"'Calendriers CG et JG'!O20","v":"RS (JG)"},null,null,"",""]
[10,{"$f":"'Calendriers CG et JG'!N21","v":"MASS"},{"$f":"'Calendriers CG et JG'!O21","v":"MASS (JG)"},null,null,"","",null,null,"SIGLE","Etablissement","Matchs joués","Victoires","Nuls ","Défaites","Buts Pour","Buts Contre","Différence","Points"]
[11,{"$f":"'Calendriers CG et JG'!N22","v":0},{"$f":"'Calendriers CG et JG'!O22","v":"RS (JG)"},null,null,"","",null,{"$f":"RANK(T14,$T$14:$T$15)","v":2},"RS (JG)","Robert Schuman",{"$f":"COUNT(D6,D21)","v":2},{"$f":"COUNTIF($F$3:$F$33,J14)","v":0},{"$f":"L14-M14-O14","v":1},{"$f":"COUNTIF($G$3:$G$33,J14)","v":1},{"$f":"SUM(D6,E21)","v":0},{"$f":"SUM(E6,D21)","v":2},{"$f":"P14-Q14","v":-2},{"$f":"M14*4+N14*2+O14*1","v":3},{"$f":"SUM(S14*1000000+R14*10000+P14*100+L14*10)","v":2980020}]
[12,{"$f":"'Calendriers CG et JG'!N23","v":"RS"},{"$f":"'Calendriers CG et JG'!O23","v":"SMP"},0,3,"SMP","RS",null,{"$f":"RANK(T15,$T$14:$T$15)","v":1},"MASS (JG)","Massillon ",{"$f":"COUNT(D6,D21)","v":2},{"$f":"COUNTIF($F$3:$F$33,J15)","v":1},1,{"$f":"COUNTIF($G$3:$G$33,J15)","v":0},{"$f":"SUM(E6,D21)","v":2},{"$f":"SUM(D6,E21)","v":0},{"$f":"P15-Q15","v":2},{"$f":"M15*4+N15*2+O15*1","v":6},{"$f":"SUM(S15*1000000+R15*10000+P15*100+L15*10)","v":6020220}]
[13,{"$f":"'Calendriers CG et JG'!N24","v":0},{"$f":"'Calendriers CG et JG'!O24","v":"MASS (JG)"},null,null,"",""]
[14,{"$f":"'Calendriers CG et JG'!N25","v":"RS"},{"$f":"'Calendriers CG et JG'!O25","v":"RS (JG)"},null,null,"",""]
[15,{"$f":"'Calendriers CG et JG'!N26","v":"MASS"},{"$f":"'Calendriers CG et JG'!O26","v":"SMP"},2,0,"MASS","SMP",null,"Classement","SIGLE","Etablissement","Matchs joués","Victoires","Nuls ","Défaites","Buts Pour","Buts Contre","Différence","Points"]
[16,{"$f":"'Calendriers CG et JG'!N27","v":"MASS"},{"$f":"'Calendriers CG et JG'!O27","v":"RS"},2,0,"MASS","RS",null,1,{"$f":"VLOOKUP($I19,$I$13:$T$15,COLUMNS($J18:J18)+1,FALSE)","v":"MASS (JG)"},{"$f":"VLOOKUP($I19,$I$13:$T$15,COLUMNS($J18:K18)+1,FALSE)","v":"Massillon "},{"$f":"VLOOKUP($I19,$I$13:$T$15,COLUMNS($J18:L18)+1,FALSE)","v":2},{"$f":"VLOOKUP($I19,$I$13:$T$15,COLUMNS($J18:M18)+1,FALSE)","v":1},{"$f":"VLOOKUP($I19,$I$13:$T$15,COLUMNS($J18:N18)+1,FALSE)","v":1},{"$f":"VLOOKUP($I19,$I$13:$T$15,COLUMNS($J18:O18)+1,FALSE)","v":0},{"$f":"VLOOKUP($I19,$I$13:$T$15,COLUMNS($J18:P18)+1,FALSE)","v":2},{"$f":"VLOOKUP($I19,$I$13:$T$15,COLUMNS($J18:Q18)+1,FALSE)","v":0},{"$f":"VLOOKUP($I19,$I$13:$T$15,COLUMNS($J18:R18)+1,FALSE)","v":2},{"$f":"VLOOKUP($I19,$I$13:$T$15,COLUMNS($J18:S18)+1,FALSE)","v":6}]
[17,{"$f":"'Calendriers CG et JG'!N28","v":0},{"$f":"'Calendriers CG et JG'!O28","v":"SMP"},null,null,"","",null,2,{"$f":"VLOOKUP($I20,$I$13:$T$15,COLUMNS($J19:J19)+1,FALSE)","v":"RS (JG)"},{"$f":"VLOOKUP($I20,$I$13:$T$15,COLUMNS($J19:K19)+1,FALSE)","v":"Robert Schuman"},{"$f":"VLOOKUP($I20,$I$13:$T$15,COLUMNS($J19:L19)+1,FALSE)","v":2},{"$f":"VLOOKUP($I20,$I$13:$T$15,COLUMNS($J19:M19)+1,FALSE)","v":0},{"$f":"VLOOKUP($I20,$I$13:$T$15,COLUMNS($J19:N19)+1,FALSE)","v":1},{"$f":"VLOOKUP($I20,$I$13:$T$15,COLUMNS($J19:O19)+1,FALSE)","v":1},{"$f":"VLOOKUP($I20,$I$13:$T$15,COLUMNS($J19:P19)+1,FALSE)","v":0},{"$f":"VLOOKUP($I20,$I$13:$T$15,COLUMNS($J19:Q19)+1,FALSE)","v":2},{"$f":"VLOOKUP($I20,$I$13:$T$15,COLUMNS($J19:R19)+1,FALSE)","v":-2},{"$f":"VLOOKUP($I20,$I$13:$T$15,COLUMNS($J19:S19)+1,FALSE)","v":3}]
[18,{"$f":"'Calendriers CG et JG'!N29","v":"MASS (JG)"},{"$f":"'Calendriers CG et JG'!O29","v":"RS (JG)"},2,0,"MASS (JG)","RS (JG)"]
[19,{"$f":"'Calendriers CG et JG'!N30","v":0},{"$f":"'Calendriers CG et JG'!O30","v":"RS"},null,null,"",""]
[20,{"$f":"'Calendriers CG et JG'!N31","v":"RS (JG)"},{"$f":"'Calendriers CG et JG'!O31","v":"MASS"},null,null,"",""]
[21,{"$f":"'Calendriers CG et JG'!N32","v":"MASS (JG)"},{"$f":"'Calendriers CG et JG'!O32","v":"SMP"},null,null,"",""]
[22,{"$f":"'Calendriers CG et JG'!N33","v":0},{"$f":"'Calendriers CG et JG'!O33","v":"MASS"},null,null,"",""]
[23,{"$f":"'Calendriers CG et JG'!N34","v":"MASS (JG)"},{"$f":"'Calendriers CG et JG'!O34","v":"RS"},null,null,"",""]
[24,{"$f":"'Calendriers CG et JG'!N35","v":"RS (JG)"},{"$f":"'Calendriers CG et JG'!O35","v":"SMP"},null,null,"",""]
[25,{"$f":"'Calendriers CG et JG'!N36","v":"MASS (JG)"},{"$f":"'Calendriers CG et JG'!O36","v":"MASS"},null,null,"",""]
[26,{"$f":"'Calendriers CG et JG'!N37","v":"RS (JG)"},{"$f":"'Calendriers CG et JG'!O37","v":0},null,null,"",""]
[27,{"$f":"'Calendriers CG et JG'!N38","v":"SMP"},{"$f":"'Calendriers CG et JG'!O38","v":"RS"},2,0,"SMP","RS"]
[28,{"$f":"'Calendriers CG et JG'!N39","v":"MASS (JG)"},{"$f":"'Calendriers CG et JG'!O39","v":0},null,null,"",""]
[29,{"$f":"'Calendriers CG et JG'!N40","v":"RS (JG)"},{"$f":"'Calendriers CG et JG'!O40","v":"RS"},null,null,"",""]
[30,{"$f":"'Calendriers CG et JG'!N41","v":"SMP"},{"$f":"'Calendriers CG et JG'!O41","v":"MASS"},0,2,"MASS","SMP"]

{"sheet":"Classements","index":8,"n_rows":27,"n_cols":23,"rows_kept":27,"cut":false,"hidden":false,"merged":[[22,12,23,22],[0,12,1,22],[0,0,1,10],[2,0,2,10],[13,0,13,10],[20,0,20,10],[2,12,2,22],[16,12,17,22]]}
["CLASSEMENT PROMO BENJAMINS 2021-2022",null,null,null,null,null,null,null,null,null,null,null,"CLASSEMENT PROMO MINIMES 2021-2022"]
[]
["DIVISION 1",null,null,null,null,null,null,null,null,null,null,null,"DIVISION 1"]
["Classement","SIGLE","Etablissement","Matchs joués","Victoires","Nuls ","Défaites","Buts Pour","Buts Contre","Différence","Points",null,"Classement","SIGLE","Etablissement","Matchs joués","Victoires","Nuls ","Défaites","Buts Pour","Buts Contre","Différence","Points"]
[1,{"$f":"'Cls B1'!J15","v":"SJL 1"},{"$f":"'Cls B1'!K15","v":"Saint Justin Levallois 1"},{"$f":"'Cls B1'!L15","v":16},{"$f":"'Cls B1'!M15","v":16},{"$f":"'Cls B1'!N15","v":0},{"$f":"'Cls B1'!O15","v":0},{"$f":"'Cls B1'!P15","v":68},{"$f":"'Cls B1'!Q15","v":8},{"$f":"'Cls B1'!R15","v":60},{"$f":"'Cls B1'!S15","v":64},null,1,{"$f":"'Cls MG'!J19","v":"MASS 1"},{"$f":"'Cls MG'!K19","v":"Massillon 1"},{"$f":"'Cls MG'!L19","v":22},{"$f":"'Cls MG'!M19","v":18},{"$f":"'Cls MG'!N19","v":3},{"$f":"'Cls MG'!O19","v":1},{"$f":"'Cls MG'!P19","v":66},{"$f":"'Cls MG'!Q19","v":7},{"$f":"'Cls MG'!R19","v":59},{"$f":"'Cls MG'!S19","v":79}]
[2,{"$f":"'Cls B1'!J16","v":"MASS 1"},{"$f":"'Cls B1'!K16","v":"Massillon 1"},{"$f":"'Cls B1'!L16","v":16},{"$f":"'Cls B1'!M16","v":10},{"$f":"'Cls B1'!N16","v":4},{"$f":"'Cls B1'!O16","v":2},{"$f":"'Cls B1'!P16","v":39},{"$f":"'Cls B1'!Q16","v":14},{"$f":"'Cls B1'!R16","v":25},{"$f":"'Cls B1'!S16","v":50},null,2,{"$f":"'Cls MG'!J20","v":"STAN 2"},{"$f":"'Cls MG'!K20","v":"Stanislas 2"},{"$f":"'Cls MG'!L20","v":22},{"$f":"'Cls MG'!M20","v":19},{"$f":"'Cls MG'!N20","v":0},{"$f":"'Cls MG'!O20","v":3},{"$f":"'Cls MG'!P20","v":62},{"$f":"'Cls MG'!Q20","v":12},{"$f":"'Cls MG'!R20","v":50},{"$f":"'Cls MG'!S20","v":79}]
[3,{"$f":"'Cls B1'!J17","v":"STAN 1"},{"$f":"'Cls B1'!K17","v":"Stanislas 1"},{"$f":"'Cls B1'!L17","v":16},{"$f":"'Cls B1'!M17","v":10},{"$f":"'Cls B1'!N17","v":3},{"$f":"'Cls B1'!O17","v":3},{"$f":"'Cls B1'!P17","v":41},{"$f":"'Cls B1'!Q17","v":14},{"$f":"'Cls B1'!R17","v":27},{"$f":"'Cls B1'!S17","v":49},null,3,{"$f":"'Cls MG'!J21","v":"SANO"},{"$f":"'Cls MG'!K21","v":"Saint André de Nogent"},{"$f":"'Cls MG'!L21","v":22},{"$f":"'Cls MG'!M21","v":15},{"$f":"'Cls MG'!N21","v":4},{"$f":"'Cls MG'!O21","v":3},{"$f":"'Cls MG'!P21","v":53},{"$f":"'Cls MG'!Q21","v":13},{"$f":"'Cls MG'!R21","v":40},{"$f":"'Cls MG'!S21","v":71}]
[4,{"$f":"'Cls B1'!J18","v":"FEN 1"},{"$f":"'Cls B1'!K18","v":"Fénelon Ste Marie 1"},{"$f":"'Cls B1'!L18","v":16},{"$f":"'Cls B1'!M18","v":8},{"$f":"'Cls B1'!N18","v":1},{"$f":"'Cls B1'!O18","v":7},{"$f":"'Cls B1'!P18","v":33},{"$f":"'Cls B1'!Q18","v":24},{"$f":"'Cls B1'!R18","v":9},{"$f":"'Cls B1'!S18","v":41},null,4,{"$f":"'Cls MG'!J22","v":"FEN 1"},{"$f":"'Cls MG'!K22","v":"Fénelon Sainte Marie 1"},{"$f":"'Cls MG'!L22","v":22},{"$f":"'Cls MG'!M22","v":15},{"$f":"'Cls MG'!N22","v":4},{"$f":"'Cls MG'!O22","v":3},{"$f":"'Cls MG'!P22","v":59},{"$f":"'Cls MG'!Q22","v":22},{"$f":"'Cls MG'!R22","v":37},{"$f":"'Cls MG'!S22","v":71}]
[5,{"$f":"'Cls B1'!J19","v":"JBS 1"},{"$f":"'Cls B1'!K19","v":"Jean Baptiste La Salle 1"},{"$f":"'Cls B1'!L19","v":16},{"$f":"'Cls B1'!M19","v":6},{"$f":"'Cls B1'!N19","v":2},{"$f":"'Cls B1'!O19","v":8},{"$f":"'Cls B1'!P19","v":23},{"$f":"'Cls B1'!Q19","v":35},{"$f":"'Cls B1'!R19","v":-12},{"$f":"'Cls B1'!S19","v":36},null,5,{"$f":"'Cls MG'!J23","v":"STAN 1"},{"$f":"'Cls MG'!K23","v":"Stanislas 1"},{"$f":"'Cls MG'!L23","v":22},{"$f":"'Cls MG'!M23","v":15},{"$f":"'Cls MG'!N23","v":1},{"$f":"'Cls MG'!O23","v":6},{"$f":"'Cls MG'!P23","v":55},{"$f":"'Cls MG'!Q23","v":12},{"$f":"'Cls MG'!R23","v":43},{"$f":"'Cls MG'!S23","v":68}]
[6,{"$f":"'Cls B1'!J20","v":"SJL 2"},{"$f":"'Cls B1'!K20","v":"Saint Justin Levallois 2"},{"$f":"'Cls B1'!L20","v":16},{"$f":"'Cls B1'!M20","v":6},{"$f":"'Cls B1'!N20","v":2},{"$f":"'Cls B1'!O20","v":8},{"$f":"'Cls B1'!P20","v":22},{"$f":"'Cls B1'!Q20","v":36},{"$f":"'Cls B1'!R20","v":-14},{"$f":"'Cls B1'!S20","v":36},null,6,{"$f":"'Cls MG'!J24","v":"MASS 2"},{"$f":"'Cls MG'!K24","v":"Massillon 2"},{"$f":"'Cls MG'!L24","v":22},{"$f":"'Cls MG'!M24","v":9},{"$f":"'Cls MG'!N24","v":3},{"$f":"'Cls MG'!O24","v":10},{"$f":"'Cls MG'!P24","v":29},{"$f":"'Cls MG'!Q24","v":40},{"$f":"'Cls MG'!R24","v":-11},{"$f":"'Cls MG'!S24","v":52}]
[7,{"$f":"'Cls B1'!J21","v":"ROC 1"},{"$f":"'Cls B1'!K21","v":"Rocroy St Vincent 1"},{"$f":"'Cls B1'!L21","v":16},{"$f":"'Cls B1'!M21","v":4},{"$f":"'Cls B1'!N21","v":3},{"$f":"'Cls B1'!O21","v":9},{"$f":"'Cls B1'!P21","v":14},{"$f":"'Cls B1'!Q21","v":26},{"$f":"'Cls B1'!R21","v":-12},{"$f":"'Cls B1'!S21","v":31},null,7,{"$f":"'Cls MG'!J25","v":"BND"},{"$f":"'Cls MG'!K25","v":"Bossuet Notre Dame"},{"$f":"'Cls MG'!L25","v":22},{"$f":"'Cls MG'!M25","v":6},{"$f":"'Cls MG'!N25","v":4},{"$f":"'Cls MG'!O25","v":12},{"$f":"'Cls MG'!P25","v":25},{"$f":"'Cls MG'!Q25","v":49},{"$f":"'Cls MG'!R25","v":-24},{"$f":"'Cls MG'!S25","v":44}]
[8,{"$f":"'Cls B1'!J22","v":"STAN 2"},{"$f":"'Cls B1'!K22","v":"Stanislas 2"},{"$f":"'Cls B1'!L22","v":16},{"$f":"'Cls B1'!M22","v":3},{"$f":"'Cls B1'!N22","v":1},{"$f":"'Cls B1'!O22","v":12},{"$f":"'Cls B1'!P22","v":12},{"$f":"'Cls B1'!Q22","v":48},{"$f":"'Cls B1'!R22","v":-36},{"$f":"'Cls B1'!S22","v":26},null,8,{"$f":"'Cls MG'!J26","v":"STAN 3"},{"$f":"'Cls MG'!K26","v":"Stanislas 3"},{"$f":"'Cls MG'!L26","v":22},{"$f":"'Cls MG'!M26","v":6},{"$f":"'Cls MG'!N26","v":3},{"$f":"'Cls MG'!O26","v":13},{"$f":"'Cls MG'!P26","v":16},{"$f":"'Cls MG'!Q26","v":40},{"$f":"'Cls MG'!R26","v":-24},{"$f":"'Cls MG'!S26","v":43}]
[9,{"$f":"'Cls B1'!J23","v":"MASS 2"},{"$f":"'Cls B1'!K23","v":"Massillon 2"},{"$f":"'Cls B1'!L23","v":16},{"$f":"'Cls B1'!M23","v":1},{"$f":"'Cls B1'!N23","v":0},{"$f":"'Cls B1'!O23","v":15},{"$f":"'Cls B1'!P23","v":15},{"$f":"'Cls B1'!Q23","v":48},{"$f":"'Cls B1'!R23","v":-33},{"$f":"'Cls B1'!S23","v":19},null,9,{"$f":"'Cls MG'!J27","v":"ROC "},{"$f":"'Cls MG'!K27","v":"Rocroy Saint Vincent"},{"$f":"'Cls MG'!L27","v":22},{"$f":"'Cls MG'!M27","v":6},{"$f":"'Cls MG'!N27","v":1},{"$f":"'Cls MG'!O27","v":15},{"$f":"'Cls MG'!P27","v":26},{"$f":"'Cls MG'!Q27","v":63},{"$f":"'Cls MG'!R27","v":-37},{"$f":"'Cls MG'!S27","v":41}]
["DIVISION 2 ",null,null,null,null,null,null,null,null,null,null,null,10,{"$f":"'Cls MG'!J28","v":"ASVP"},{"$f":"'Cls MG'!K28","v":"Saint Vincent de Paul"},{"$f":"'Cls MG'!L28","v":22},{"$f":"'Cls MG'!M28","v":5},{"$f":"'Cls MG'!N28","v":1},{"$f":"'Cls MG'!O28","v":16},{"$f":"'Cls MG'!P28","v":22},{"$f":"'Cls MG'!Q28","v":44},{"$f":"'Cls MG'!R28","v":-22},{"$f":"'Cls MG'!S28","v":38}]
["Classement","SIGLE","Etablissement","Matchs joués","Victoires","Nuls ","Défaites","Buts Pour","Buts Contre","Différence","Points",null,11,{"$f":"'Cls MG'!J29","v":"FEN 2"},{"$f":"'Cls MG'!K29","v":"Fénelon Sainte Marie 2"},{"$f":"'Cls MG'!L29","v":22},{"$f":"'Cls MG'!M29","v":4},{"$f":"'Cls MG'!N29","v":3},{"$f":"'Cls MG'!O29","v":15},{"$f":"'Cls MG'!P29","v":17},{"$f":"'Cls MG'!Q29","v":49},{"$f":"'Cls MG'!R29","v":-32},{"$f":"'Cls MG'!S29","v":37}]
[1,{"$f":"'Cls B2 et B3'!J62","v":"SANO"},{"$f":"'Cls B2 et B3'!K62","v":"Saint André Nogent "},{"$f":"'Cls B2 et B3'!L62","v":8},{"$f":"'Cls B2 et B3'!M62","v":7},{"$f":"'Cls B2 et B3'!N62","v":0},{"$f":"'Cls B2 et B3'!O62","v":1},{"$f":"'Cls B2 et B3'!P62","v":29},{"$f":"'Cls B2 et B3'!Q62","v":4},{"$f":"'Cls B2 et B3'!R62","v":25},{"$f":"'Cls B2 et B3'!S62","v":29},null,12,{"$f":"'Cls MG'!J30","v":"JBS"},{"$f":"'Cls MG'!K30","v":"Jean Baptiste La Salle Saint-Denis"},{"$f":"'Cls MG'!L30","v":22},{"$f":"'Cls MG'!M30","v":1},{"$f":"'Cls MG'!N30","v":0},{"$f":"'Cls MG'!O30","v":21},{"$f":"'Cls MG'!P30","v":11},{"$f":"'Cls MG'!Q30","v":91},{"$f":"'Cls MG'!R30","v":-80},{"$f":"'Cls MG'!S30","v":25}]
[2,{"$f":"'Cls B2 et B3'!J63","v":"FEN 2"},{"$f":"'Cls B2 et B3'!K63","v":"Fénelon Ste Marie 2"},{"$f":"'Cls B2 et B3'!L63","v":8},{"$f":"'Cls B2 et B3'!M63","v":7},{"$f":"'Cls B2 et B3'!N63","v":0},{"$f":"'Cls B2 et B3'!O63","v":1},{"$f":"'Cls B2 et B3'!P63","v":15},{"$f":"'Cls B2 et B3'!Q63","v":2},{"$f":"'Cls B2 et B3'!R63","v":13},{"$f":"'Cls B2 et B3'!S63","v":29},null,"CLASSEMENT PROMO CADETS 2021-2022"]
[3,{"$f":"'Cls B2 et B3'!J64","v":"BND"},{"$f":"'Cls B2 et B3'!K64","v":"Bossuet Notre Dame"},{"$f":"'Cls B2 et B3'!L64","v":8},{"$f":"'Cls B2 et B3'!M64","v":2},{"$f":"'Cls B2 et B3'!N64","v":1},{"$f":"'Cls B2 et B3'!O64","v":5},{"$f":"'Cls B2 et B3'!P64","v":7},{"$f":"'Cls B2 et B3'!Q64","v":13},{"$f":"'Cls B2 et B3'!R64","v":-6},{"$f":"'Cls B2 et B3'!S64","v":15}]
[4,{"$f":"'Cls B2 et B3'!J65","v":"SJL 3"},{"$f":"'Cls B2 et B3'!K65","v":"Saint Justin Levallois 3"},{"$f":"'Cls B2 et B3'!L65","v":8},{"$f":"'Cls B2 et B3'!M65","v":2},{"$f":"'Cls B2 et B3'!N65","v":1},{"$f":"'Cls B2 et B3'!O65","v":5},{"$f":"'Cls B2 et B3'!P65","v":5},{"$f":"'Cls B2 et B3'!Q65","v":15},{"$f":"'Cls B2 et B3'!R65","v":-10},{"$f":"'Cls B2 et B3'!S65","v":15},null,"Classement","SIGLE","Etablissement","Matchs joués","Victoires","Nuls ","Défaites","Buts Pour","Buts Contre","Différence","Points"]
[5,{"$f":"'Cls B2 et B3'!J66","v":"STAN 3"},{"$f":"'Cls B2 et B3'!K66","v":"Stanislas 3"},{"$f":"'Cls B2 et B3'!L66","v":8},{"$f":"'Cls B2 et B3'!M66","v":1},{"$f":"'Cls B2 et B3'!N66","v":0},{"$f":"'Cls B2 et B3'!O66","v":7},{"$f":"'Cls B2 et B3'!P66","v":5},{"$f":"'Cls B2 et B3'!Q66","v":27},{"$f":"'Cls B2 et B3'!R66","v":-22},{"$f":"'Cls B2 et B3'!S66","v":11},null,1,{"$f":"'Cls CG et JG'!J8","v":"MASS"},{"$f":"'Cls CG et JG'!K8","v":"Massillon "},{"$f":"'Cls CG et JG'!L8","v":4},{"$f":"'Cls CG et JG'!M8","v":4},{"$f":"'Cls CG et JG'!N8","v":0},{"$f":"'Cls CG et JG'!O8","v":0},{"$f":"'Cls CG et JG'!P8","v":8},{"$f":"'Cls CG et JG'!Q8","v":0},{"$f":"'Cls CG et JG'!R8","v":8},{"$f":"'Cls CG et JG'!S8","v":16}]
["DIVISION 3",null,null,null,null,null,null,null,null,null,null,null,2,{"$f":"'Cls CG et JG'!J9","v":"SMP"},{"$f":"'Cls CG et JG'!K9","v":"Saint Michel de Picpus"},{"$f":"'Cls CG et JG'!L9","v":4},{"$f":"'Cls CG et JG'!M9","v":2},{"$f":"'Cls CG et JG'!N9","v":0},{"$f":"'Cls CG et JG'!O9","v":2},{"$f":"'Cls CG et JG'!P9","v":5},{"$f":"'Cls CG et JG'!Q9","v":4},{"$f":"'Cls CG et JG'!R9","v":1},{"$f":"'Cls CG et JG'!S9","v":10}]
["Classement","SIGLE","Etablissement","Matchs joués","Victoires","Nuls ","Défaites","Buts Pour","Buts Contre","Différence","Points",null,3,{"$f":"'Cls CG et JG'!J10","v":"RS"},{"$f":"'Cls CG et JG'!K10","v":"Robert Schuman"},{"$f":"'Cls CG et JG'!L10","v":4},{"$f":"'Cls CG et JG'!M10","v":0},{"$f":"'Cls CG et JG'!N10","v":0},{"$f":"'Cls CG et JG'!O10","v":4},{"$f":"'Cls CG et JG'!P10","v":0},{"$f":"'Cls CG et JG'!Q10","v":9},{"$f":"'Cls CG et JG'!R10","v":-9},{"$f":"'Cls CG et JG'!S10","v":4}]
[1,{"$f":"'Cls B2 et B3'!J87","v":"JBS 2"},{"$f":"'Cls B2 et B3'!K87","v":"Jean Baptiste La Salle 2"},{"$f":"'Cls B2 et B3'!L87","v":8},{"$f":"'Cls B2 et B3'!M87","v":6},{"$f":"'Cls B2 et B3'!N87","v":0},{"$f":"'Cls B2 et B3'!O87","v":2},{"$f":"'Cls B2 et B3'!P87","v":22},{"$f":"'Cls B2 et B3'!Q87","v":11},{"$f":"'Cls B2 et B3'!R87","v":11},{"$f":"'Cls B2 et B3'!S87","v":26},null,"CLASSEMENT PROMO JUNIORS 2021-2022"]
[2,{"$f":"'Cls B2 et B3'!J88","v":"ASVP"},{"$f":"'Cls B2 et B3'!K88","v":"Saint Vincent de Paul"},{"$f":"'Cls B2 et B3'!L88","v":8},{"$f":"'Cls B2 et B3'!M88","v":5},{"$f":"'Cls B2 et B3'!N88","v":0},{"$f":"'Cls B2 et B3'!O88","v":3},{"$f":"'Cls B2 et B3'!P88","v":21},{"$f":"'Cls B2 et B3'!Q88","v":13},{"$f":"'Cls B2 et B3'!R88","v":8},{"$f":"'Cls B2 et B3'!S88","v":23}]
[3,{"$f":"'Cls B2 et B3'!J89","v":"FEN 3"},{"$f":"'Cls B2 et B3'!K89","v":"Fénelon Ste Marie 3"},{"$f":"'Cls B2 et B3'!L89","v":8},{"$f":"'Cls B2 et B3'!M89","v":5},{"$f":"'Cls B2 et B3'!N89","v":0},{"$f":"'Cls B2 et B3'!O89","v":3},{"$f":"'Cls B2 et B3'!P89","v":12},{"$f":"'Cls B2 et B3'!Q89","v":8},{"$f":"'Cls B2 et B3'!R89","v":4},{"$f":"'Cls B2 et B3'!S89","v":23},null,"Classement","SIGLE","Etablissement","Matchs joués","Victoires","Nuls ","Défaites","Buts Pour","Buts Contre","Différence","Points"]
[4,{"$f":"'Cls B2 et B3'!J90","v":"ROC 2"},{"$f":"'Cls B2 et B3'!K90","v":"Rocroy 2"},{"$f":"'Cls B2 et B3'!L90","v":8},{"$f":"'Cls B2 et B3'!M90","v":4},{"$f":"'Cls B2 et B3'!N90","v":0},{"$f":"'Cls B2 et B3'!O90","v":4},{"$f":"'Cls B2 et B3'!P90","v":17},{"$f":"'Cls B2 et B3'!Q90","v":16},{"$f":"'Cls B2 et B3'!R90","v":1},{"$f":"'Cls B2 et B3'!S90","v":20},null,1,{"$f":"'Cls CG et JG'!J19","v":"MASS (JG)"},{"$f":"'Cls CG et JG'!K19","v":"Massillon "},{"$f":"'Cls CG et JG'!L19","v":2},{"$f":"'Cls CG et JG'!M19","v":1},{"$f":"'Cls CG et JG'!N19","v":1},{"$f":"'Cls CG et JG'!O19","v":0},{"$f":"'Cls CG et JG'!P19","v":2},{"$f":"'Cls CG et JG'!Q19","v":0},{"$f":"'Cls CG et JG'!R19","v":2},{"$f":"'Cls CG et JG'!S19","v":6}]
[5,{"$f":"'Cls B2 et B3'!J91","v":"STAN 4"},{"$f":"'Cls B2 et B3'!K91","v":"Stanislas 4"},{"$f":"'Cls B2 et B3'!L91","v":8},{"$f":"'Cls B2 et B3'!M91","v":0},{"$f":"'Cls B2 et B3'!N91","v":0},{"$f":"'Cls B2 et B3'!O91","v":8},{"$f":"'Cls B2 et B3'!P91","v":2},{"$f":"'Cls B2 et B3'!Q91","v":26},{"$f":"'Cls B2 et B3'!R91","v":-24},{"$f":"'Cls B2 et B3'!S91","v":8},null,2,{"$f":"'Cls CG et JG'!J20","v":"RS (JG)"},{"$f":"'Cls CG et JG'!K20","v":"Robert Schuman"},{"$f":"'Cls CG et JG'!L20","v":2},{"$f":"'Cls CG et JG'!M20","v":0},{"$f":"'Cls CG et JG'!N20","v":1},{"$f":"'Cls CG et JG'!O20","v":1},{"$f":"'Cls CG et JG'!P20","v":0},{"$f":"'Cls CG et JG'!Q20","v":2},{"$f":"'Cls CG et JG'!R20","v":-2},{"$f":"'Cls CG et JG'!S20","v":3}]

{"sheet":"Coupe BG","index":9,"n_rows":50,"n_cols":13,"rows_kept":50,"cut":false,"hidden":false,"merged":[[39,3,39,6],[32,3,32,6],[33,4,33,5],[34,11,39,11],[23,7,24,7],[23,2,24,2],[9,2,10,2],[16,3,17,3],[28,2,28,3],[16,8,17,8],[0,0,0,3],[2,0,2,3],[0,5,0,8],[2,5,2,8],[9,7,10,7]]}
["Tableau des qualifiés",null,null,null,null,"Tableau des perdants"]
[]
[]
[]
[{"$f":"D41","v":0},null,null,null,null,{"$f":"D43","v":0}]
[]
["Match 1"]
[]
[{"$f":"F42","v":0},null,null,null,null,{"$f":"F44","v":"rien"}]
[null,"Match 5",null,null,null,null,"Match 9"]
[]
[{"$f":"E42","v":0},null,null,null,null,{"$f":"E44","v":"rien"}]
[]
["Match 2"]
[]
[{"$f":"G41","v":0},null,null,null,null,{"$f":"G43","v":0}]
[null,null,"Finale",null,null,null,null,"Match 11"]
[]
[{"$f":"F41","v":0},null,null,null,null,{"$f":"E43","v":0}]
[]
["Match 3",null,null,null,null,"Match 7"]
[]
[{"$f":"D42","v":0},null,null,null,null,{"$f":"G44","v":0}]
[null,"Match 6",null,null,null,null,"Match 10"]
[]
[{"$f":"G42","v":0},null,null,null,null,{"$f":"D44","v":0}]
[]
["Match 4",null,null,null,null,"Match 8"]
[]
[{"$f":"E41","v":0},null,null,null,null,{"$f":"F43","v":0}]
[null,null,"Petite finale",null,null,null,null,"Match 12"]
[]
[null,null,null,"Match de 10 Min en poule"]
[null,null,null,null,"Match de 15 Min en Tableau",null,null,null,"Horaires","TA SANO : poule 1 et 4","TB SANO","TA MASS","TB MASS : Poule 2 et 3"]
["SJL 1",1,null,"Poule 1","Poule 2","Poule 3","Poule 4",null,"14h","SJL 1 / STAN 4","MASS 2 / SMP 2","Echauffement / Préparation aux matchs","MASS 1 / SJL 3"]
["MASS 1",2,null,{"$f":"A35","v":"SJL 1"},{"$f":"A36","v":"MASS 1"},{"$f":"A37","v":"STAN 1"},{"$f":"A38","v":"SMP 1"},null,"14h15","SMP 1 / ASVP","SANO / STAN 3",null,"STAN 1 / BND"]
["STAN 1",3,null,{"$f":"A42","v":"MASS 2"},{"$f":"A41","v":"STAN 2"},{"$f":"A40","v":"SJL 2"},{"$f":"A39","v":"SANO"},null,"14h30","SJL 1 / SMP 2","MASS 2 / STAN 4",null,"MASS 1 / STAN 2"]
["SMP 1",4,null,{"$f":"A43","v":"SMP 2"},{"$f":"A44","v":"SJL 3"},{"$f":"A45","v":"BND"},{"$f":"A46","v":"STAN 3"},null,"14h45","SMP 1 / STAN 3","SANO / ASVP",null,"STAN 1 / SJL 2"]
["SANO",5,null,{"$f":"A50","v":"STAN 4"},{"$f":"A49","v":0},{"$f":"A48","v":0},{"$f":"A47","v":"ASVP"},null,"15h","SJL 1 / MASS 2","SMP 2 / STAN 4",null,"STAN 2 / SJL 3"]
["SJL 2",6,null,"Classement",null,null,null,null,"15h15","SMP 1 / SANO","STAN 3 / ASVP",null,"SJL 2 / BND"]
["STAN 2",7]
["MASS 2",8,null,null,null,null,null,null,null,"TA SANO : Tableau A","TB SANO : Tableau A","TA MASS : tableau B","TB MASS : Tableau B"]
["SMP 2",9,null,null,null,null,null,null,"15h45","Match 1","Match 2","Match 7","Match 8"]
["SJL 3",10,null,null,"rien","rien",null,null,"16h05","Match 3","Match 4","Match 9","Match 10"]
["BND",11,null,null,null,null,null,null,"16h25","Match 5","Match 6","Match 11","Match 12"]
["STAN 3",12,null,null,null,null,null,null,"16h45","Finale","Petite Finale"]
["ASVP",13]
[null,14]
[null,15]
["STAN 4",16]

{"sheet":"Coupe MG","index":10,"n_rows":62,"n_cols":4,"rows_kept":62,"cut":false,"hidden":false,"merged":[[0,0,0,2],[61,0,61,3]]}
["Matchs au Tremblay"]
[]
[]
[]
[]
[]
[]
[]
[]
[]
[]
[]
[]
[]
[]
[]
[]
[]
[]
[]
[]
[]
[]
[]
[]
[]
[]
[]
[]
[]
[]
[]
[]
[]
[]
[]
[]
[]
[]
[]
["SANO",1]
["BND",2]
["ASVP",3]
["SMP 1",4]
["SMP 2",5]
["MASS 1",6]
["MASS 2",7]
["STAN 1",8]
["STAN 2",9]
["STAN 3",10]
[null,11]
[null,12]
[null,13]
[null,14]
[null,15]
[]
["Poule 1","Poule 2","Poule 3","Poule 4"]
[{"$f":"A41","v":"SANO"},{"$f":"A42","v":"BND"},{"$f":"A43","v":"ASVP"},{"$f":"A44","v":"SMP 1"}]
[{"$f":"A48","v":"STAN 1"},{"$f":"A47","v":"MASS 2"},{"$f":"A46","v":"MASS 1"},{"$f":"A45","v":"SMP 2"}]
[{"$f":"A49","v":"STAN 2"},{"$f":"A50","v":"STAN 3"},{"$f":"A51","v":0},{"$f":"A52","v":0}]
[null,{"$f":"A55","v":0},{"$f":"A54","v":0},{"$f":"A53","v":0}]
["Classement"]

{"sheet":"Indispos profs","index":11,"n_rows":13,"n_cols":13,"rows_kept":13,"cut":false,"hidden":false,"merged":[[0,0,0,12],[1,1,1,5],[1,6,1,10],[1,11,1,12]]}
["DATES D'INDISPONIBILITES DES ETABLISSEMENTS"]
["SIGLES","Benjamins",null,null,null,null,"Minimes",null,null,null,null,"Lycée"]
["SANO","15 dec","2021-03-23","2022-02-16",null,null,"15 dec","2021-03-23","2022-02-16"]
["FEN"]
["RS"]
["MASS","2021-01-12","2022-03-30","2022-04-06",null,null,"2021-11-24","15 dec","2022-03-30","2022-04-06",null,"24 nov (Term)","1er dec (Term)"]
["BND","2021-01-26",null,null,null,null,"2021-01-26"]
["SJL","2022-03-09"]
["STAN","15 dec","16 fev","2021-04-20","2021-05-25",null,"2021-01-26","2021-04-20","2021-05-25","15 dec"]
["JBS"]
["ASVP"]
["SMP",null,null,null,null,null,null,null,null,null,null,"15 dec","2021-03-09"]
["ROC","8 dec","2021-01-05",null,null,null,"8 dec","2021-01-05"]

{"sheet":"Listing profs","index":12,"n_rows":24,"n_cols":5,"rows_kept":24,"cut":false,"hidden":false,"merged":[[5,1,6,1],[5,0,6,0],[0,0,0,4],[2,0,3,0],[2,1,3,1],[7,0,8,0],[7,1,8,1],[10,0,12,0],[10,1,12,1],[16,1,19,1],[16,0,19,0],[13,1,15,1],[13,0,15,0]]}
["LISTING FOOTBALL 2021-2022"]
["NOM D'ETABLISSEMENT","SIGLE","NOM et PRENOM","N° MOBILE","MAIL "]
["ST JUSTIN LEVALLOIS","SJL","DELOUIS Gilles","06 81 59 13 44","g.delouis@free.fr"]
[null,null,"MONDON Martial","06 70 88 13 05","martialmondon@yahoo.fr"]
["BOSSUET NOTRE DAME","BND","DEVEVEY Julien","06 13 79 51 23","jdevevey@gmail.com"]
["STANISLAS","STAN","SOUCHON Thomas","06 47 95 45 15","thomas.souchon.eps@gmail.com"]
[null,null,"BUISSETTE Julie","06 33 77 83 00","julie.buissette@stanislas-paris.fr"]
["FENELON","FEN","CALAMY Anthony","06 64 31 57 28","anthony.calamy@outlook.fr"]
[null,null,"VIVIN Yannick","06 80 12 56 57","y.vivin@yahoo.fr "]
["ST ANDRE DE NOGENT","SANO","PECHEUX Michel","06 73 17 40 28"]
["ST CROIX DE NEUILLY","SCN","MARTIN Eric","06 15 96 62 42","e.martin@handisport.org"]
[null,null,"BELLAUD Jocelyn","06 51 99 25 34","jocelynbellaud210@hotmail.com"]
[null,null,"MENDOWSKI Isabelle",null,"lefloch.thierry@neuf.fr"]
["ST MICHEL DE PICPUS","SMP","RAMIREZ Sébastien","06 07 21 13 52","assmp@smpicpus.fr"]
[null,null,"LEVESQUE Florian","07 89 42 53 55"]
[null,null,"RAYMOND Benjamin","06 48 05 89 57"]
["MASSILLON","MASS","CAM Mickael","06 24 20 56 65","cam.mickael@yahoo.fr"]
[null,null,"MAINDRON Séraphin","06 59 88 91 08","seraphinmaindron@hotmail.com"]
[null,null,"BAUZOU Louis","06 58 37 75 23","louis.bauzou@gmail.com"]
[null,null,"STOCCHI Giacomo","06 12 38 28 79","giacomostocchi@orange.fr"]
["ROBERT SCHUMAN","RS","BUZON Franck","06 88 84 33 70","f.buze@laposte.net"]
["JEAN-BAPTISTE DE LA SALLE","JBS","TOUSSAINT Gaetan","06 61 46 71 33","gaetan.toussaint@lasallesaintdenis.com"]
["ROCROY SAINT VINCENT","ROC","CARBONNIER Théo","06 52 25 22 19","t.carbonnier@ileps.fr"]
["SAINT VINCENT DE PAUL","ASVP","MOLINER Maxime",null,"m.moliner@gs-svp.com"]

{"sheet":"Installations","index":13,"n_rows":11,"n_cols":6,"rows_kept":11,"cut":false,"hidden":false,"merged":[[8,5,9,5],[8,2,9,2],[8,3,9,3],[8,1,9,1],[8,0,9,0],[0,0,0,5],[3,5,4,5],[5,0,6,0],[5,1,6,1],[5,2,6,2],[5,4,6,4],[5,5,6,5],[3,0,4,0],[3,1,4,1],[3,2,4,2],[3,3,4,3],[3,4,4,4]]}
["INSTALLATIONS FOOTBALL 2021/2022"]
["NOM DU TERRAIN","COORDONNEES","MOYENS D'ACCES","HORAIRES","TERRAINS","DISPONIBILITES"]
[]
["Stade Pershing                                                Terrain n° 5, 10, 11, 14 et 16","Route du Bosquet Mortemart 75012 Paris                   ","RER A ou métro château de Vincennes. Bus 112 arrêt La faluère","13h30 à 17h30",null,"du 1/09 au 6/07"]
[]
["Stade de Puteaux terrain n° 1 et 6","Ile de puteaux, 1 allée des sports, 92800 PUTEAUX","RER A Grande Arche de la Défense, Métro Esplanade de la Défense","13h30 à 17h30 terrain 1 ","2 terrains de football à 11","du 1/09 au 6/07"]
[null,null,null,"13h30 à 16h30 terrain 6"]
["Parc des Sports de La Courneuve                                       Terrain n°6, 7, 10 et 1/2 du 12","51 avenue Roger Salengro, 93120 La Courneuve                    ","Bus 150 à la Porte de la Vilette","13h30 à 17h30","6 et 7 prairies, 10 en stabilisé et terrain 12 synthétique","du 1/09 au 6/07"]
["Parc du Tremblay                     ","161 Bd de Stalingrad 94500 Champigny sur Marne"," RER : Nogent le Pérreux + bus 317 ou 116 arrêt parc du Tremblay","13h45 à 16h30","Concession SANO : 2 Terrains de Foot à 7","du 1/09 au 6/07"]
[null,null,null,null,"Concession MASS : 2 Terrains de Foot à 7"]
["Stade Didier Drogba, Complexe Sportif Louison Bobet (Concession SJL)","15, rue Pablo Neruda\n92300 Levallois\n01-47-15-75-78\n","SNCF Clicy-Levallois + 5’\nMétro Louise Michel + 15’\nBus 84-94-274-341-165-PC\n165\n","TA : 13h45-15h15                  TB : 13h45-16h15 ","2 terrains de Foot à 7","du 1/09 au 15/06"]