{"text_format":"1","workbook":"xlsx","n_sheets":9,"sheets":["Engagés","Répartition des joueurs","Poule 1","Poule 2","Poule 3","Poule 4","Résultats de poule","Tableau","Classement"],"not_rendered":{"charts":0,"images":80,"macros":1,"external_links":0,"defined_names":1,"comments":0,"pivot_tables":0},"unopened":[],"bounds":{"document_bytes":16777216,"sheet_cells":100000,"rows_first":2000,"rows_last":500,"rows_between":2000,"halvings":0,"cell_chars":16384,"cell_head_chars":4096},"cells_cut":0,"cells_raw":0,"read":"whole","date_system":"1900"}

{"sheet":"Engagés","index":0,"n_rows":29,"n_cols":6,"rows_kept":29,"cut":false,"hidden":false,"merged":[[0,0,2,2],[0,4,0,5],[1,4,1,5],[2,4,2,5]]}
["Championnat IDF de Tennis de Table ",null,null,"DATE :","2022-04-13"]
[null,null,null,"LIEU :","CHAVILLE"]
[null,null,null,"CATEGORIE :","BF PROMO"]
["Tête de série","NOM","PRENOM","SIGLE","ETABLISSEMENT","CLASSEMENT FFTT"]
[]
[1,"DE BATTISTA","TIPHAINE","75-4-STAP","STANISLAS"]
[2,"SAUSSET","FLORA","91-4-SCVB","COLLEGE LYCEE SACRE COEUR"]
[3,"DE POULPIQUET DU HALGOUET","SOLINE","75-4-STAP","STANISLAS"]
[4,"WAKSMAN","SALOME","92-2-JOP","COLLEGE SAINT JOSEPH DU PARCHAMP"]
[5,"ILLOUZ","LEANA","75-4-LMAP","AS ALMA"]
[6,"NICOLAU","ANASTASIA","92-4-SDN","COLLEGE LYCEE SAINT DOMINIQUE"]
[7,"OYHARNART--FAYET","HORTENSE","75-4-LMAP","AS ALMA"]
[8,"GARIN","APOLLINE","92-4-SDN","COLLEGE LYCEE SAINT DOMINIQUE"]
[9,"CHESNOT","FLORE","92-2-JOP","COLLEGE SAINT JOSEPH DU PARCHAMP"]
[10,"BONNARD DJOUDAD","JULIETTE","75-2-SUPA","SAINTE URSULE"]
{"$rows_left_out":15}
{"sheet":"Répartition des joueurs","index":1,"n_rows":5,"n_cols":16,"rows_kept":5,"cut":false,"hidden":false,"merged":[[0,0,0,3],[0,4,0,7],[0,8,0,11],[0,12,0,15]]}
["Poule 1",null,null,null,"Poule 2",null,null,null,"Poule 3",null,null,null,"Poule 4"]
[1,{"$f":"VLOOKUP($A2,Engagés!$A$6:$F$29,2,FALSE)","v":"DE BATTISTA"},{"$f":"VLOOKUP($A2,Engagés!$A$1:$F$336,3,FALSE)","v":"TIPHAINE"},{"$f":"VLOOKUP($A2,Engagés!$A$1:$F$336,4,FALSE)","v":"75-4-STAP"},2,{"$f":"VLOOKUP($E2,Engagés!$A$6:$F$29,2,FALSE)","v":"SAUSSET"},{"$f":"VLOOKUP($E2,Engagés!$A$1:$F$336,3,FALSE)","v":"FLORA"},{"$f":"VLOOKUP($E2,Engagés!$A$1:$F$336,4,FALSE)","v":"91-4-SCVB"},3,{"$f":"VLOOKUP($I2,Engagés!$A$6:$F$29,2,FALSE)","v":"DE POULPIQUET DU HALGOUET"},{"$f":"VLOOKUP($I2,Engagés!$A$1:$F$336,3,FALSE)","v":"SOLINE"},{"$f":"VLOOKUP($I2,Engagés!$A$1:$F$336,4,FALSE)","v":"75-4-STAP"},4,{"$f":"VLOOKUP($M2,Engagés!$A$6:$F$29,2,FALSE)","v":"WAKSMAN"},{"$f":"VLOOKUP($M2,Engagés!$A$1:$F$336,3,FALSE)","v":"SALOME"},{"$f":"VLOOKUP($M2,Engagés!$A$1:$F$336,4,FALSE)","v":"92-2-JOP"}]
[8,{"$f":"VLOOKUP($A3,Engagés!$A$6:$F$29,2,FALSE)","v":"GARIN"},{"$f":"VLOOKUP($A3,Engagés!$A$1:$F$336,3,FALSE)","v":"APOLLINE"},{"$f":"VLOOKUP($A3,Engagés!$A$1:$F$336,4,FALSE)","v":"92-4-SDN"},7,{"$f":"VLOOKUP($E3,Engagés!$A$6:$F$29,2,FALSE)","v":"OYHARNART--FAYET"},{"$f":"VLOOKUP($E3,Engagés!$A$1:$F$336,3,FALSE)","v":"HORTENSE"},{"$f":"VLOOKUP($E3,Engagés!$A$1:$F$336,4,FALSE)","v":"75-4-LMAP"},6,{"$f":"VLOOKUP($I3,Engagés!$A$6:$F$29,2,FALSE)","v":"NICOLAU"},{"$f":"VLOOKUP($I3,Engagés!$A$1:$F$336,3,FALSE)","v":"ANASTASIA"},{"$f":"VLOOKUP($I3,Engagés!$A$1:$F$336,4,FALSE)","v":"92-4-SDN"},5,{"$f":"VLOOKUP($M3,Engagés!$A$6:$F$29,2,FALSE)","v":"ILLOUZ"},{"$f":"VLOOKUP($M3,Engagés!$A$1:$F$336,3,FALSE)","v":"LEANA"},{"$f":"VLOOKUP($M3,Engagés!$A$1:$F$336,4,FALSE)","v":"75-4-LMAP"}]
[9,{"$f":"VLOOKUP($A4,Engagés!$A$6:$F$29,2,FALSE)","v":"CHESNOT"},{"$f":"VLOOKUP($A4,Engagés!$A$1:$F$336,3,FALSE)","v":"FLORE"},{"$f":"VLOOKUP($A4,Engagés!$A$1:$F$336,4,FALSE)","v":"92-2-JOP"},10,{"$f":"VLOOKUP($E4,Engagés!$A$6:$F$29,2,FALSE)","v":"BONNARD DJOUDAD"},{"$f":"VLOOKUP($E4,Engagés!$A$1:$F$336,3,FALSE)","v":"JULIETTE"},{"$f":"VLOOKUP($E4,Engagés!$A$1:$F$336,4,FALSE)","v":"75-2-SUPA"},11,{"$f":"VLOOKUP($I4,Engagés!$A$6:$F$29,2,FALSE)","v":"CAILHO FERRENDIER"},{"$f":"VLOOKUP($I4,Engagés!$A$1:$F$336,3,FALSE)","v":"LILYLOU"},{"$f":"VLOOKUP($I4,Engagés!$A$1:$F$336,4,FALSE)","v":"75-4-FENP"},12,{"$f":"VLOOKUP($M4,Engagés!$A$6:$F$29,2,FALSE)","v":"MUNIER"},{"$f":"VLOOKUP($M4,Engagés!$A$1:$F$336,3,FALSE)","v":"CHARLOTTE"},{"$f":"VLOOKUP($M4,Engagés!$A$1:$F$336,4,FALSE)","v":"75-4-PCHP"}]
[16,{"$f":"VLOOKUP($A5,Engagés!$A$6:$F$29,2,FALSE)","v":"SALOME"},{"$f":"VLOOKUP($A5,Engagés!$A$1:$F$336,3,FALSE)","v":"JOSEPHINE"},{"$f":"VLOOKUP($A5,Engagés!$A$1:$F$336,4,FALSE)","v":"75-4-LMAP"},15,{"$f":"VLOOKUP($E5,Engagés!$A$6:$F$29,2,FALSE)","v":"OUDART"},{"$f":"VLOOKUP($E5,Engagés!$A$1:$F$336,3,FALSE)","v":"CLEMENCE"},{"$f":"VLOOKUP($E5,Engagés!$A$1:$F$336,4,FALSE)","v":"92-4-STVC"},14,{"$f":"VLOOKUP($I5,Engagés!$A$6:$F$29,2,FALSE)","v":"LE GOFF"},{"$f":"VLOOKUP($I5,Engagés!$A$1:$F$336,3,FALSE)","v":"MANON"},{"$f":"VLOOKUP($I5,Engagés!$A$1:$F$336,4,FALSE)","v":"92-2-JOP"},13,{"$f":"VLOOKUP($M5,Engagés!$A$6:$F$29,2,FALSE)","v":"BARRA--SOUSTRE"},{"$f":"VLOOKUP($M5,Engagés!$A$1:$F$336,3,FALSE)","v":"MANON"},{"$f":"VLOOKUP($M5,Engagés!$A$1:$F$336,4,FALSE)","v":"91-4-SCVB"}]

{"sheet":"Poule 1","index":2,"n_rows":20,"n_cols":7,"rows_kept":20,"cut":false,"hidden":false,"merged":[[14,0,14,3],[14,4,14,6],[15,4,15,5],[15,2,15,3],[15,0,15,1],[9,0,9,2],[10,0,10,2],[11,0,11,2],[12,0,12,2],[13,0,13,2],[8,0,8,2],[0,0,0,6],[7,3,7,4],[7,0,7,2],[1,0,1,6],[16,0,16,1],[16,2,16,3],[16,4,16,5],[17,0,17,1],[17,2,17,3],[17,4,17,5],[18,0,18,1],[18,2,18,3],[18,4,18,5],[19,0,19,1],[19,2,19,3],[19,4,19,5]]}
["TENNIS DE TABLE"]
["POULE 1"]
[null,"NOM","Prénom","Sigle","Vict","Def","Classement"]
[1,{"$f":"VLOOKUP($A4,Engagés!$A$1:$F$29,2,FALSE)","v":"DE BATTISTA"},{"$f":"VLOOKUP($A4,Engagés!$A$1:$F$29,3,FALSE)","v":"TIPHAINE"},{"$f":"VLOOKUP($A4,Engagés!$A$1:$F$29,4,FALSE)","v":"75-4-STAP"},null,null,"1er"]
[8,{"$f":"VLOOKUP($A5,Engagés!$A$1:$F$29,2,FALSE)","v":"GARIN"},{"$f":"VLOOKUP($A5,Engagés!$A$1:$F$29,3,FALSE)","v":"APOLLINE"},{"$f":"VLOOKUP($A5,Engagés!$A$1:$F$29,4,FALSE)","v":"92-4-SDN"},null,null,"4ème"]
[9,{"$f":"VLOOKUP($A6,Engagés!$A$1:$F$29,2,FALSE)","v":"CHESNOT"},{"$f":"VLOOKUP($A6,Engagés!$A$1:$F$29,3,FALSE)","v":"FLORE"},{"$f":"VLOOKUP($A6,Engagés!$A$1:$F$29,4,FALSE)","v":"92-2-JOP"},null,null,"2ème"]
[16,{"$f":"VLOOKUP($A7,Engagés!$A$1:$F$29,2,FALSE)","v":"SALOME"},{"$f":"VLOOKUP($A7,Engagés!$A$1:$F$29,3,FALSE)","v":"JOSEPHINE"},{"$f":"VLOOKUP($A7,Engagés!$A$1:$F$29,4,FALSE)","v":"75-4-LMAP"},null,null,"3ème"]
["Déroulement",null,null,"Joueurs A contre Joueur B",null,"Vainqueur","Score"]
["Match 1",null,null,{"$f":"B4","v":"DE BATTISTA"},{"$f":"B7","v":"SALOME"}]
["Match 2",null,null,{"$f":"B5","v":"GARIN"},{"$f":"B6","v":"CHESNOT"}]
["Match 3",null,null,{"$f":"B4","v":"DE BATTISTA"},{"$f":"B6","v":"CHESNOT"}]
["Match 4",null,null,{"$f":"B5","v":"GARIN"},{"$f":"B7","v":"SALOME"}]
["Match 5",null,null,{"$f":"B4","v":"DE BATTISTA"},{"$f":"B5","v":"GARIN"}]
["Match 6",null,null,{"$f":"B6","v":"CHESNOT"},{"$f":"B7","v":"SALOME"}]
["CLASSEMENT",null,null,null,{"$f":"A2","v":"POULE 1"}]
{"$rows_left_out":6}
{"sheet":"Poule 2","index":3,"n_rows":20,"n_cols":7,"rows_kept":20,"cut":false,"hidden":false,"merged":[[11,0,11,2],[12,0,12,2],[9,0,9,2],[10,0,10,2],[0,0,0,6],[8,0,8,2],[1,0,1,6],[7,0,7,2],[7,3,7,4],[13,0,13,2],[14,0,14,3],[14,4,14,6],[16,0,16,1],[16,2,16,3],[16,4,16,5],[15,0,15,1],[15,2,15,3],[15,4,15,5],[19,0,19,1],[19,2,19,3],[19,4,19,5],[17,0,17,1],[17,2,17,3],[17,4,17,5],[18,0,18,1],[18,2,18,3],[18,4,18,5]]}
["TENNIS DE TABLE"]
["POULE 2"]
[null,"NOM","Prénom","Sigle","Vict","Def","Classement"]
[2,{"$f":"VLOOKUP($A4,Engagés!$A$1:$F$29,2,FALSE)","v":"SAUSSET"},{"$f":"VLOOKUP($A4,Engagés!$A$1:$F$29,3,FALSE)","v":"FLORA"},{"$f":"VLOOKUP($A4,Engagés!$A$1:$F$29,4,FALSE)","v":"91-4-SCVB"},null,null,"1er"]
[7,{"$f":"VLOOKUP($A5,Engagés!$A$1:$F$29,2,FALSE)","v":"OYHARNART--FAYET"},{"$f":"VLOOKUP($A5,Engagés!$A$1:$F$29,3,FALSE)","v":"HORTENSE"},{"$f":"VLOOKUP($A5,Engagés!$A$1:$F$29,4,FALSE)","v":"75-4-LMAP"},null,null,"2ème"]
[10,{"$f":"VLOOKUP($A6,Engagés!$A$1:$F$29,2,FALSE)","v":"BONNARD DJOUDAD"},{"$f":"VLOOKUP($A6,Engagés!$A$1:$F$29,3,FALSE)","v":"JULIETTE"},{"$f":"VLOOKUP($A6,Engagés!$A$1:$F$29,4,FALSE)","v":"75-2-SUPA"},null,null,"3ème"]
[15,{"$f":"VLOOKUP($A7,Engagés!$A$1:$F$29,2,FALSE)","v":"OUDART"},{"$f":"VLOOKUP($A7,Engagés!$A$1:$F$29,3,FALSE)","v":"CLEMENCE"},{"$f":"VLOOKUP($A7,Engagés!$A$1:$F$29,4,FALSE)","v":"92-4-STVC"},null,null,"4ème"]
["Déroulement",null,null,"Joueurs A contre Joueur B",null,"Vainqueur","Score"]
["Match 1",null,null,{"$f":"B4","v":"SAUSSET"},{"$f":"B7","v":"OUDART"}]
["Match 2",null,null,{"$f":"B5","v":"OYHARNART--FAYET"},{"$f":"B6","v":"BONNARD DJOUDAD"}]
["Match 3",null,null,{"$f":"B4","v":"SAUSSET"},{"$f":"B6","v":"BONNARD DJOUDAD"}]
["Match 4",null,null,{"$f":"B5","v":"OYHARNART--FAYET"},{"$f":"B7","v":"OUDART"}]
["Match 5",null,null,{"$f":"B4","v":"SAUSSET"},{"$f":"B5","v":"OYHARNART--FAYET"}]
["Match 6",null,null,{"$f":"B6","v":"BONNARD DJOUDAD"},{"$f":"B7","v":"OUDART"}]
["CLASSEMENT",null,null,null,{"$f":"A2","v":"POULE 2"}]
{"$rows_left_out":6}
{"sheet":"Poule 3","index":4,"n_rows":20,"n_cols":7,"rows_kept":20,"cut":false,"hidden":false,"merged":[[11,0,11,2],[12,0,12,2],[9,0,9,2],[10,0,10,2],[0,0,0,6],[8,0,8,2],[1,0,1,6],[7,0,7,2],[7,3,7,4],[13,0,13,2],[14,0,14,3],[14,4,14,6],[16,0,16,1],[16,2,16,3],[16,4,16,5],[15,0,15,1],[15,2,15,3],[15,4,15,5],[19,0,19,1],[19,2,19,3],[19,4,19,5],[17,0,17,1],[17,2,17,3],[17,4,17,5],[18,0,18,1],[18,2,18,3],[18,4,18,5]]}
["TENNIS DE TABLE"]
["POULE 3"]
[null,"NOM","Prénom","Sigle","Vict","Def","Classement"]
[3,{"$f":"VLOOKUP($A4,Engagés!$A$1:$F$29,2,FALSE)","v":"DE POULPIQUET DU HALGOUET"},{"$f":"VLOOKUP($A4,Engagés!$A$1:$F$29,3,FALSE)","v":"SOLINE"},{"$f":"VLOOKUP($A4,Engagés!$A$1:$F$29,4,FALSE)","v":"75-4-STAP"},null,null,"1er"]
[6,{"$f":"VLOOKUP($A5,Engagés!$A$1:$F$29,2,FALSE)","v":"NICOLAU"},{"$f":"VLOOKUP($A5,Engagés!$A$1:$F$29,3,FALSE)","v":"ANASTASIA"},{"$f":"VLOOKUP($A5,Engagés!$A$1:$F$29,4,FALSE)","v":"92-4-SDN"},null,null,"3ème"]
[11,{"$f":"VLOOKUP($A6,Engagés!$A$1:$F$29,2,FALSE)","v":"CAILHO FERRENDIER"},{"$f":"VLOOKUP($A6,Engagés!$A$1:$F$29,3,FALSE)","v":"LILYLOU"},{"$f":"VLOOKUP($A6,Engagés!$A$1:$F$29,4,FALSE)","v":"75-4-FENP"},null,null,"2ème"]
[14,{"$f":"VLOOKUP($A7,Engagés!$A$1:$F$29,2,FALSE)","v":"LE GOFF"},{"$f":"VLOOKUP($A7,Engagés!$A$1:$F$29,3,FALSE)","v":"MANON"},{"$f":"VLOOKUP($A7,Engagés!$A$1:$F$29,4,FALSE)","v":"92-2-JOP"},null,null,"4ème"]
["Déroulement",null,null,"Joueurs A contre Joueur B",null,"Vainqueur","Score"]
["Match 1",null,null,{"$f":"B4","v":"DE POULPIQUET DU HALGOUET"},{"$f":"B7","v":"LE GOFF"}]
["Match 2",null,null,{"$f":"B5","v":"NICOLAU"},{"$f":"B6","v":"CAILHO FERRENDIER"}]
["Match 3",null,null,{"$f":"B4","v":"DE POULPIQUET DU HALGOUET"},{"$f":"B6","v":"CAILHO FERRENDIER"}]
["Match 4",null,null,{"$f":"B5","v":"NICOLAU"},{"$f":"B7","v":"LE GOFF"}]
["Match 5",null,null,{"$f":"B4","v":"DE POULPIQUET DU HALGOUET"},{"$f":"B5","v":"NICOLAU"}]
["Match 6",null,null,{"$f":"B6","v":"CAILHO FERRENDIER"},{"$f":"B7","v":"LE GOFF"}]
["CLASSEMENT",null,null,null,{"$f":"A2","v":"POULE 3"}]
{"$rows_left_out":6}
{"sheet":"Poule 4","index":5,"n_rows":20,"n_cols":7,"rows_kept":20,"cut":false,"hidden":false,"merged":[[11,0,11,2],[12,0,12,2],[9,0,9,2],[10,0,10,2],[0,0,0,6],[8,0,8,2],[1,0,1,6],[7,0,7,2],[7,3,7,4],[13,0,13,2],[14,0,14,3],[14,4,14,6],[16,0,16,1],[16,2,16,3],[16,4,16,5],[15,0,15,1],[15,2,15,3],[15,4,15,5],[19,0,19,1],[19,2,19,3],[19,4,19,5],[17,0,17,1],[17,2,17,3],[17,4,17,5],[18,0,18,1],[18,2,18,3],[18,4,18,5]]}
["TENNIS DE TABLE"]
["POULE 4"]
[null,"NOM","Prénom","Sigle","Vict","Def","Classement"]
[4,{"$f":"VLOOKUP($A4,Engagés!$A$1:$F$29,2,FALSE)","v":"WAKSMAN"},{"$f":"VLOOKUP($A4,Engagés!$A$1:$F$29,3,FALSE)","v":"SALOME"},{"$f":"VLOOKUP($A4,Engagés!$A$1:$F$29,4,FALSE)","v":"92-2-JOP"},null,null,"2ème"]
[5,{"$f":"VLOOKUP($A5,Engagés!$A$1:$F$29,2,FALSE)","v":"ILLOUZ"},{"$f":"VLOOKUP($A5,Engagés!$A$1:$F$29,3,FALSE)","v":"LEANA"},{"$f":"VLOOKUP($A5,Engagés!$A$1:$F$29,4,FALSE)","v":"75-4-LMAP"},null,null,"1er"]
[12,{"$f":"VLOOKUP($A6,Engagés!$A$1:$F$29,2,FALSE)","v":"MUNIER"},{"$f":"VLOOKUP($A6,Engagés!$A$1:$F$29,3,FALSE)","v":"CHARLOTTE"},{"$f":"VLOOKUP($A6,Engagés!$A$1:$F$29,4,FALSE)","v":"75-4-PCHP"},null,null,"4ème"]
[13,{"$f":"VLOOKUP($A7,Engagés!$A$1:$F$29,2,FALSE)","v":"BARRA--SOUSTRE"},{"$f":"VLOOKUP($A7,Engagés!$A$1:$F$29,3,FALSE)","v":"MANON"},{"$f":"VLOOKUP($A7,Engagés!$A$1:$F$29,4,FALSE)","v":"91-4-SCVB"},null,null,"3ème"]
["Déroulement",null,null,"Joueurs A contre Joueur B",null,"Vainqueur","Score"]
["Match 1",null,null,{"$f":"B4","v":"WAKSMAN"},{"$f":"B7","v":"BARRA--SOUSTRE"}]
["Match 2",null,null,{"$f":"B5","v":"ILLOUZ"},{"$f":"B6","v":"MUNIER"}]
["Match 3",null,null,{"$f":"B4","v":"WAKSMAN"},{"$f":"B6","v":"MUNIER"}]
["Match 4",null,null,{"$f":"B5","v":"ILLOUZ"},{"$f":"B7","v":"BARRA--SOUSTRE"}]
["Match 5",null,null,{"$f":"B4","v":"WAKSMAN"},{"$f":"B5","v":"ILLOUZ"}]
["Match 6",null,null,{"$f":"B6","v":"MUNIER"},{"$f":"B7","v":"BARRA--SOUSTRE"}]
["CLASSEMENT",null,null,null,{"$f":"A2","v":"POULE 4"}]
{"$rows_left_out":6}
{"sheet":"Résultats de poule","index":6,"n_rows":5,"n_cols":16,"rows_kept":5,"cut":false,"hidden":false,"merged":[[0,0,0,3],[0,4,0,7],[0,8,0,11],[0,12,0,15]]}
["Poule 1",null,null,null,"Poule 2",null,null,null,"Poule 3",null,null,null,"Poule 4"]
["1er",{"$f":"'Poule 1'!$C17","v":"DE BATTISTA"},{"$f":"'Poule 1'!$E17","v":"TIPHAINE"},{"$f":"'Poule 1'!$G17","v":"75-4-STAP"},"1er",{"$f":"'Poule 2'!$C17","v":"SAUSSET"},{"$f":"'Poule 2'!$E17","v":"FLORA"},{"$f":"'Poule 2'!$G17","v":"91-4-SCVB"},"1er",{"$f":"'Poule 3'!$C17","v":"DE POULPIQUET DU HALGOUET"},{"$f":"'Poule 3'!$E17","v":"SOLINE"},{"$f":"'Poule 3'!$G17","v":"75-4-STAP"},"1er",{"$f":"'Poule 4'!$C17","v":"ILLOUZ"},{"$f":"'Poule 4'!$E17","v":"LEANA"},{"$f":"'Poule 4'!$G17","v":"75-4-LMAP"}]
["2ème",{"$f":"'Poule 1'!$C18","v":"CHESNOT"},{"$f":"'Poule 1'!$E18","v":"FLORE"},{"$f":"'Poule 1'!$G18","v":"92-2-JOP"},"2ème",{"$f":"'Poule 2'!$C18","v":"OYHARNART--FAYET"},{"$f":"'Poule 2'!$E18","v":"HORTENSE"},{"$f":"'Poule 2'!$G18","v":"75-4-LMAP"},"2ème",{"$f":"'Poule 3'!$C18","v":"CAILHO FERRENDIER"},{"$f":"'Poule 3'!$E18","v":"LILYLOU"},{"$f":"'Poule 3'!$G18","v":"75-4-FENP"},"2ème",{"$f":"'Poule 4'!$C18","v":"WAKSMAN"},{"$f":"'Poule 4'!$E18","v":"SALOME"},{"$f":"'Poule 4'!$G18","v":"92-2-JOP"}]
["3ème",{"$f":"'Poule 1'!$C19","v":"SALOME"},{"$f":"'Poule 1'!$E19","v":"JOSEPHINE"},{"$f":"'Poule 1'!$G19","v":"75-4-LMAP"},"3ème",{"$f":"'Poule 2'!$C19","v":"BONNARD DJOUDAD"},{"$f":"'Poule 2'!$E19","v":"JULIETTE"},{"$f":"'Poule 2'!$G19","v":"75-2-SUPA"},"3ème",{"$f":"'Poule 3'!$C19","v":"NICOLAU"},{"$f":"'Poule 3'!$E19","v":"ANASTASIA"},{"$f":"'Poule 3'!$G19","v":"92-4-SDN"},"3ème",{"$f":"'Poule 4'!$C19","v":"BARRA--SOUSTRE"},{"$f":"'Poule 4'!$E19","v":"MANON"},{"$f":"'Poule 4'!$G19","v":"91-4-SCVB"}]
["4ème",{"$f":"'Poule 1'!$C20","v":"GARIN"},{"$f":"'Poule 1'!$E20","v":"APOLLINE"},{"$f":"'Poule 1'!$G20","v":"92-4-SDN"},"4ème",{"$f":"'Poule 2'!$C20","v":"OUDART"},{"$f":"'Poule 2'!$E20","v":"CLEMENCE"},{"$f":"'Poule 2'!$G20","v":"92-4-STVC"},"4ème",{"$f":"'Poule 3'!$C20","v":"LE GOFF"},{"$f":"'Poule 3'!$E20","v":"MANON"},{"$f":"'Poule 3'!$G20","v":"92-2-JOP"},"4ème",{"$f":"'Poule 4'!$C20","v":"MUNIER"},{"$f":"'Poule 4'!$E20","v":"CHARLOTTE"},{"$f":"'Poule 4'!$G20","v":"75-4-PCHP"}]

{"sheet":"Tableau","index":7,"n_rows":95,"n_cols":34,"rows_kept":95,"cut":false,"hidden":false,"merged":[[8,10,8,11],[50,20,50,21],[16,10,16,11],[23,10,23,11],[33,10,33,11],[40,10,40,11],[48,10,48,11],[10,20,10,21],[30,32,30,33],[0,16,0,19],[15,29,15,30],[0,0,0,14],[31,29,31,30],[10,1,10,2],[1,4,1,5],[0,20,0,33],[16,26,16,27],[23,23,23,24],[3,20,3,21],[18,20,18,21],[29,4,29,5],[25,20,25,21],[1,10,1,11],[9,23,9,24],[55,10,55,11],[33,4,33,5],[42,1,42,2],[59,29,59,30],[55,23,55,24],[47,29,47,30],[35,20,35,21],[42,20,42,21],[41,23,41,24],[48,26,48,27],[57,20,57,21]]}
["REPECHAGES ET MATCHS DE CLASSEMENT",null,null,null,null,null,null,null,null,null,null,null,null,null,null,null,"1er tour de tableau",null,null,null,"Tableau des gagnants"]
[]
[]
[null,null,null,null,null,null,null,null,null,null,null,null,null,null,null,null,"1er poule 1",{"$f":"'Résultats de poule'!$B2","v":"DE BATTISTA"},{"$f":"'Résultats de poule'!$D2","v":"75-4-STAP"},"V","1/8 de finale 1"]
[null,null,null,null,null,null,null,null,null,null,null,null,null,{"$f":"IF(T4=\"\",\"\",IF(T4=\"p\",S4,S5))","v":0},{"$f":"IF(T4=\"\",\"\",IF(T4=\"p\",R4,R5))","v":0},null,null,null,null,"P",{"$f":"IF(T4=\"\",\"\",IF(T4=\"v\",R4,R5))","v":"DE BATTISTA"},{"$f":"IF(T4=\"\",\"\",IF(T4=\"v\",S4,S5))","v":"75-4-STAP"},"V"]
[null,null,null,null,null,null,null,null,null,null,{"$f":"IF(M5=\"\",\"\",IF(M5=\"v\",N5,N7))","v":""},{"$f":"IF(M5=\"\",\"\",IF(M5=\"v\",O5,O7))","v":""},null,null,null,null,null,null,null,null,null,null,null,{"$f":"IF(W5=\"\",\"\",IF(W5=\"v\",U5,U7))","v":"DE BATTISTA"},{"$f":"IF(W5=\"\",\"\",IF(W5=\"v\",V5,V7))","v":"75-4-STAP"},"V"]
[null,null,null,null,null,null,null,null,null,null,null,null,null,{"$f":"IF(T7=\"\",\"\",IF(T7=\"p\",S7,S8))","v":0},{"$f":"IF(T7=\"\",\"\",IF(T7=\"p\",R7,R8))","v":0},null,"4ème poule 2",{"$f":"'Résultats de poule'!F5","v":"OUDART"},{"$f":"'Résultats de poule'!H5","v":"92-4-STVC"},"V",{"$f":"IF(T7=\"\",\"\",IF(T7=\"v\",R7,R8))","v":"OUDART"},{"$f":"IF(T7=\"\",\"\",IF(T7=\"v\",S7,S8))","v":"92-4-STVC"},"P"]
[null,null,null,null,null,null,null,null,null,null,null,null,null,null,null,null,null,null,null,"P"]
[null,null,null,null,null,null,null,{"$f":"IF(J6=\"\",\"\",IF(J6=\"v\",K6,K13))","v":""},{"$f":"IF(J6=\"\",\"\",IF(J6=\"v\",L6,L13))","v":""}]
[null,null,null,null,null,null,null,null,null,null,null,null,null,null,null,null,null,null,null,null,null,null,null,"1/4 finale 1",null,null,{"$f":"IF(Z6=\"\",\"\",IF(Z6=\"v\",X6,X13))","v":"DE BATTISTA"},{"$f":"IF(Z6=\"\",\"\",IF(Z6=\"v\",Y6,Y13))","v":"75-4-STAP"},"V"]
[null,null,null,null,null,null,null,null,null,null,null,null,null,null,null,null,"2ème poule 3",{"$f":"'Résultats de poule'!J3","v":"CAILHO FERRENDIER"},{"$f":"'Résultats de poule'!L3","v":"75-4-FENP"},"V","1/8 de finale 2"]
[null,null,null,null,null,null,null,null,null,null,null,null,null,{"$f":"IF(T11=\"\",\"\",IF(T11=\"p\",S11,S12))","v":0},{"$f":"IF(T11=\"\",\"\",IF(T11=\"p\",R11,R12))","v":0},null,null,null,null,"P",{"$f":"IF(T11=\"\",\"\",IF(T11=\"v\",R11,R12))","v":"CAILHO FERRENDIER"},{"$f":"IF(T11=\"\",\"\",IF(T11=\"v\",S11,S12))","v":"75-4-FENP"},"V"]
[null,null,null,null,null,null,null,null,null,null,{"$f":"IF(M12=\"\",\"\",IF(M12=\"v\",N12,N14))","v":""},{"$f":"IF(M12=\"\",\"\",IF(M12=\"v\",O12,O14))","v":""},null,null,null,null,null,null,null,null,null,null,null,{"$f":"IF(W12=\"\",\"\",IF(W12=\"v\",U12,U14))","v":"CAILHO FERRENDIER"},{"$f":"IF(W12=\"\",\"\",IF(W12=\"v\",V12,V14))","v":"75-4-FENP"},"P"]
[null,null,null,null,null,null,null,null,null,null,null,null,null,{"$f":"IF(T14=\"\",\"\",IF(T14=\"p\",S14,S15))","v":0},{"$f":"IF(T14=\"\",\"\",IF(T14=\"p\",R14,R15))","v":0},null,null,null,null,"P",{"$f":"IF(T14=\"\",\"\",IF(T14=\"v\",R14,R15))","v":"BARRA--SOUSTRE"},{"$f":"IF(T14=\"\",\"\",IF(T14=\"v\",S14,S15))","v":"91-4-SCVB"},"P"]
[null,null,null,null,null,null,null,null,null,null,null,null,null,null,null,null,"3ème poule 4",{"$f":"'Résultats de poule'!N4","v":"BARRA--SOUSTRE"},{"$f":"'Résultats de poule'!P4","v":"91-4-SCVB"},"V"]
{"$rows_left_out":81}
{"sheet":"Classement","index":8,"n_rows":35,"n_cols":7,"rows_kept":35,"cut":false,"hidden":false,"merged":[[1,0,1,2],[0,0,0,2]]}
[{"$f":"IF(Engagés!A1=\"\",\"\",Engagés!A1)","v":"Championnat IDF de Tennis de Table "}]
[{"$f":"IF(Engagés!E3=\"\",\"\",Engagés!E3)","v":"BF PROMO"}]
["CLASSEMENT","NOMS","Etablissement",null,null,"Q =","Quota de base"]
["1er",{"$f":"Tableau!AG32","v":"DE POULPIQUET DU HALGOUET"},{"$f":"Tableau!AH32","v":"75-4-STAP"},"Q",null,"QS =","Quota supplémentaire"]
["2ème",{"$f":"IF(Tableau!$AF$17=\"\",\"\",IF(Tableau!$AF$17=\"p\",Tableau!$AD$17,Tableau!$AD$49))","v":"DE BATTISTA"},{"$f":"IF(Tableau!$AF$17=\"\",\"\",IF(Tableau!$AF$17=\"p\",Tableau!$AE$17,Tableau!$AE$49))","v":"75-4-STAP"},"Q"]
["3ème",{"$f":"Tableau!AG62","v":"ILLOUZ"},{"$f":"Tableau!AH62","v":"75-4-LMAP"},"Q"]
["4ème",{"$f":"IF(Tableau!AF61=\"\",\"\",IF(Tableau!$AF$61=\"p\",Tableau!$AD$61,Tableau!$AD$63))","v":"WAKSMAN"},{"$f":"IF(Tableau!AF61=\"\",\"\",IF(Tableau!$AF$61=\"p\",Tableau!$AE$61,Tableau!$AE$63))","v":"92-2-JOP"},"QS"]
["5ème",{"$f":"Tableau!AG79","v":"BONNARD DJOUDAD"},{"$f":"Tableau!AH79","v":"75-2-SUPA"}]
["6ème",{"$f":"IF(Tableau!AF76=\"\",\"\",IF(Tableau!$AF$76=\"p\",Tableau!$AD$76,Tableau!$AD$82))","v":"OYHARNART--FAYET"},{"$f":"IF(Tableau!$AF$76=\"\",\"\",IF(Tableau!$AF$76=\"p\",Tableau!$AE$76,Tableau!$AE$82))","v":"75-4-LMAP"}]
["7ème",{"$f":"Tableau!AD86","v":"SAUSSET"},{"$f":"Tableau!AE86","v":"91-4-SCVB"}]
["8ème",{"$f":"IF(Tableau!$AC$85=\"\",\"\",IF(Tableau!$AC$85=\"p\",Tableau!$AA$85,Tableau!$AA$87))","v":"CAILHO FERRENDIER"},{"$f":"IF(Tableau!$AC$85=\"\",\"\",IF(Tableau!$AC$85=\"p\",Tableau!$AB$85,Tableau!$AB$87))","v":"75-4-FENP"}]
["9ème",{"$f":"Tableau!AA70","v":"NICOLAU"},{"$f":"Tableau!AB70","v":"92-4-SDN"}]
["10ème",{"$f":"IF(Tableau!$Z$67=\"\",\"\",IF(Tableau!$Z$67=\"p\",Tableau!$X$67,Tableau!$X$73))","v":"BARRA--SOUSTRE"},{"$f":"IF(Tableau!$Z$67=\"\",\"\",IF(Tableau!$Z$67=\"p\",Tableau!$Y$67,Tableau!$Y$73))","v":"91-4-SCVB"}]
["11ème",{"$f":"Tableau!U83","v":"MUNIER"},{"$f":"Tableau!V83","v":"75-4-PCHP"}]
["12ème",{"$f":"IF(Tableau!$T$83=\"\",\"\",IF(Tableau!$T$83=\"p\",Tableau!$R$83,Tableau!$R$84))","v":"LE GOFF"},{"$f":"IF(Tableau!$T$83=\"\",\"\",IF(Tableau!$T$83=\"p\",Tableau!$S$83,Tableau!$S$84))","v":"92-2-JOP"}]
{"$rows_left_out":20}