{"text_format":"1","workbook":"xlsx","n_sheets":9,"sheets":["Engagés","Répartition des joueurs","Poule 1","Poule 2","Poule 3","Poule 4","Résultats de poule","Tableau","Classement"],"not_rendered":{"charts":0,"images":80,"macros":1,"external_links":0,"defined_names":1,"comments":0,"pivot_tables":0},"unopened":[],"bounds":{"document_bytes":16777216,"sheet_cells":100000,"rows_first":2000,"rows_last":500,"rows_between":2000,"halvings":0,"cell_chars":16384,"cell_head_chars":4096},"cells_cut":0,"cells_raw":0,"read":"whole","date_system":"1900"}

{"sheet":"Engagés","index":0,"n_rows":29,"n_cols":6,"rows_kept":29,"cut":false,"hidden":false,"merged":[[0,0,2,2],[0,4,0,5],[1,4,1,5],[2,4,2,5]]}
["Championnat IDF de Tennis de Table ",null,null,"DATE :","2022-04-13"]
[null,null,null,"LIEU :","CHAVILLE"]
[null,null,null,"CATEGORIE :","BF PROMO"]
["Tête de série","NOM","PRENOM","SIGLE","ETABLISSEMENT","CLASSEMENT FFTT"]
[]
[1,"DE BATTISTA","TIPHAINE","75-4-STAP","STANISLAS"]
[2,"SAUSSET","FLORA","91-4-SCVB","COLLEGE LYCEE SACRE COEUR"]
[3,"DE POULPIQUET DU HALGOUET","SOLINE","75-4-STAP","STANISLAS"]
[4,"WAKSMAN","SALOME","92-2-JOP","COLLEGE SAINT JOSEPH DU PARCHAMP"]
[5,"ILLOUZ","LEANA","75-4-LMAP","AS ALMA"]
[6,"NICOLAU","ANASTASIA","92-4-SDN","COLLEGE LYCEE SAINT DOMINIQUE"]
[7,"OYHARNART--FAYET","HORTENSE","75-4-LMAP","AS ALMA"]
[8,"GARIN","APOLLINE","92-4-SDN","COLLEGE LYCEE SAINT DOMINIQUE"]
[9,"CHESNOT","FLORE","92-2-JOP","COLLEGE SAINT JOSEPH DU PARCHAMP"]
[10,"BONNARD DJOUDAD","JULIETTE","75-2-SUPA","SAINTE URSULE"]
[11,"CAILHO FERRENDIER","LILYLOU","75-4-FENP","FENELON STE MARIE"]
[12,"MUNIER","CHARLOTTE","75-4-PCHP","PAUL CLAUDEL HULST"]
[13,"BARRA--SOUSTRE","MANON","91-4-SCVB","COLLEGE LYCEE SACRE COEUR"]
[14,"LE GOFF","MANON","92-2-JOP","COLLEGE SAINT JOSEPH DU PARCHAMP"]
[15,"OUDART","CLEMENCE","92-4-STVC","COLLEGE LYCEE SAINT THOMAS DE VILLENEUVE"]
[16,"SALOME","JOSEPHINE","75-4-LMAP","AS ALMA"]
[17]
[18]
[19]
[20]
[21]
[22]
[23]
[24]

{"sheet":"Répartition des joueurs","index":1,"n_rows":5,"n_cols":16,"rows_kept":5,"cut":false,"hidden":false,"merged":[[0,0,0,3],[0,4,0,7],[0,8,0,11],[0,12,0,15]]}
["Poule 1",null,null,null,"Poule 2",null,null,null,"Poule 3",null,null,null,"Poule 4"]
[1,{"$f":"VLOOKUP($A2,Engagés!$A$6:$F$29,2,FALSE)","v":"DE BATTISTA"},{"$f":"VLOOKUP($A2,Engagés!$A$1:$F$336,3,FALSE)","v":"TIPHAINE"},{"$f":"VLOOKUP($A2,Engagés!$A$1:$F$336,4,FALSE)","v":"75-4-STAP"},2,{"$f":"VLOOKUP($E2,Engagés!$A$6:$F$29,2,FALSE)","v":"SAUSSET"},{"$f":"VLOOKUP($E2,Engagés!$A$1:$F$336,3,FALSE)","v":"FLORA"},{"$f":"VLOOKUP($E2,Engagés!$A$1:$F$336,4,FALSE)","v":"91-4-SCVB"},3,{"$f":"VLOOKUP($I2,Engagés!$A$6:$F$29,2,FALSE)","v":"DE POULPIQUET DU HALGOUET"},{"$f":"VLOOKUP($I2,Engagés!$A$1:$F$336,3,FALSE)","v":"SOLINE"},{"$f":"VLOOKUP($I2,Engagés!$A$1:$F$336,4,FALSE)","v":"75-4-STAP"},4,{"$f":"VLOOKUP($M2,Engagés!$A$6:$F$29,2,FALSE)","v":"WAKSMAN"},{"$f":"VLOOKUP($M2,Engagés!$A$1:$F$336,3,FALSE)","v":"SALOME"},{"$f":"VLOOKUP($M2,Engagés!$A$1:$F$336,4,FALSE)","v":"92-2-JOP"}]
[8,{"$f":"VLOOKUP($A3,Engagés!$A$6:$F$29,2,FALSE)","v":"GARIN"},{"$f":"VLOOKUP($A3,Engagés!$A$1:$F$336,3,FALSE)","v":"APOLLINE"},{"$f":"VLOOKUP($A3,Engagés!$A$1:$F$336,4,FALSE)","v":"92-4-SDN"},7,{"$f":"VLOOKUP($E3,Engagés!$A$6:$F$29,2,FALSE)","v":"OYHARNART--FAYET"},{"$f":"VLOOKUP($E3,Engagés!$A$1:$F$336,3,FALSE)","v":"HORTENSE"},{"$f":"VLOOKUP($E3,Engagés!$A$1:$F$336,4,FALSE)","v":"75-4-LMAP"},6,{"$f":"VLOOKUP($I3,Engagés!$A$6:$F$29,2,FALSE)","v":"NICOLAU"},{"$f":"VLOOKUP($I3,Engagés!$A$1:$F$336,3,FALSE)","v":"ANASTASIA"},{"$f":"VLOOKUP($I3,Engagés!$A$1:$F$336,4,FALSE)","v":"92-4-SDN"},5,{"$f":"VLOOKUP($M3,Engagés!$A$6:$F$29,2,FALSE)","v":"ILLOUZ"},{"$f":"VLOOKUP($M3,Engagés!$A$1:$F$336,3,FALSE)","v":"LEANA"},{"$f":"VLOOKUP($M3,Engagés!$A$1:$F$336,4,FALSE)","v":"75-4-LMAP"}]
[9,{"$f":"VLOOKUP($A4,Engagés!$A$6:$F$29,2,FALSE)","v":"CHESNOT"},{"$f":"VLOOKUP($A4,Engagés!$A$1:$F$336,3,FALSE)","v":"FLORE"},{"$f":"VLOOKUP($A4,Engagés!$A$1:$F$336,4,FALSE)","v":"92-2-JOP"},10,{"$f":"VLOOKUP($E4,Engagés!$A$6:$F$29,2,FALSE)","v":"BONNARD DJOUDAD"},{"$f":"VLOOKUP($E4,Engagés!$A$1:$F$336,3,FALSE)","v":"JULIETTE"},{"$f":"VLOOKUP($E4,Engagés!$A$1:$F$336,4,FALSE)","v":"75-2-SUPA"},11,{"$f":"VLOOKUP($I4,Engagés!$A$6:$F$29,2,FALSE)","v":"CAILHO FERRENDIER"},{"$f":"VLOOKUP($I4,Engagés!$A$1:$F$336,3,FALSE)","v":"LILYLOU"},{"$f":"VLOOKUP($I4,Engagés!$A$1:$F$336,4,FALSE)","v":"75-4-FENP"},12,{"$f":"VLOOKUP($M4,Engagés!$A$6:$F$29,2,FALSE)","v":"MUNIER"},{"$f":"VLOOKUP($M4,Engagés!$A$1:$F$336,3,FALSE)","v":"CHARLOTTE"},{"$f":"VLOOKUP($M4,Engagés!$A$1:$F$336,4,FALSE)","v":"75-4-PCHP"}]
[16,{"$f":"VLOOKUP($A5,Engagés!$A$6:$F$29,2,FALSE)","v":"SALOME"},{"$f":"VLOOKUP($A5,Engagés!$A$1:$F$336,3,FALSE)","v":"JOSEPHINE"},{"$f":"VLOOKUP($A5,Engagés!$A$1:$F$336,4,FALSE)","v":"75-4-LMAP"},15,{"$f":"VLOOKUP($E5,Engagés!$A$6:$F$29,2,FALSE)","v":"OUDART"},{"$f":"VLOOKUP($E5,Engagés!$A$1:$F$336,3,FALSE)","v":"CLEMENCE"},{"$f":"VLOOKUP($E5,Engagés!$A$1:$F$336,4,FALSE)","v":"92-4-STVC"},14,{"$f":"VLOOKUP($I5,Engagés!$A$6:$F$29,2,FALSE)","v":"LE GOFF"},{"$f":"VLOOKUP($I5,Engagés!$A$1:$F$336,3,FALSE)","v":"MANON"},{"$f":"VLOOKUP($I5,Engagés!$A$1:$F$336,4,FALSE)","v":"92-2-JOP"},13,{"$f":"VLOOKUP($M5,Engagés!$A$6:$F$29,2,FALSE)","v":"BARRA--SOUSTRE"},{"$f":"VLOOKUP($M5,Engagés!$A$1:$F$336,3,FALSE)","v":"MANON"},{"$f":"VLOOKUP($M5,Engagés!$A$1:$F$336,4,FALSE)","v":"91-4-SCVB"}]

{"sheet":"Poule 1","index":2,"n_rows":20,"n_cols":7,"rows_kept":20,"cut":false,"hidden":false,"merged":[[14,0,14,3],[14,4,14,6],[15,4,15,5],[15,2,15,3],[15,0,15,1],[9,0,9,2],[10,0,10,2],[11,0,11,2],[12,0,12,2],[13,0,13,2],[8,0,8,2],[0,0,0,6],[7,3,7,4],[7,0,7,2],[1,0,1,6],[16,0,16,1],[16,2,16,3],[16,4,16,5],[17,0,17,1],[17,2,17,3],[17,4,17,5],[18,0,18,1],[18,2,18,3],[18,4,18,5],[19,0,19,1],[19,2,19,3],[19,4,19,5]]}
["TENNIS DE TABLE"]
["POULE 1"]
[null,"NOM","Prénom","Sigle","Vict","Def","Classement"]
[1,{"$f":"VLOOKUP($A4,Engagés!$A$1:$F$29,2,FALSE)","v":"DE BATTISTA"},{"$f":"VLOOKUP($A4,Engagés!$A$1:$F$29,3,FALSE)","v":"TIPHAINE"},{"$f":"VLOOKUP($A4,Engagés!$A$1:$F$29,4,FALSE)","v":"75-4-STAP"},null,null,"1er"]
[8,{"$f":"VLOOKUP($A5,Engagés!$A$1:$F$29,2,FALSE)","v":"GARIN"},{"$f":"VLOOKUP($A5,Engagés!$A$1:$F$29,3,FALSE)","v":"APOLLINE"},{"$f":"VLOOKUP($A5,Engagés!$A$1:$F$29,4,FALSE)","v":"92-4-SDN"},null,null,"4ème"]
[9,{"$f":"VLOOKUP($A6,Engagés!$A$1:$F$29,2,FALSE)","v":"CHESNOT"},{"$f":"VLOOKUP($A6,Engagés!$A$1:$F$29,3,FALSE)","v":"FLORE"},{"$f":"VLOOKUP($A6,Engagés!$A$1:$F$29,4,FALSE)","v":"92-2-JOP"},null,null,"2ème"]
[16,{"$f":"VLOOKUP($A7,Engagés!$A$1:$F$29,2,FALSE)","v":"SALOME"},{"$f":"VLOOKUP($A7,Engagés!$A$1:$F$29,3,FALSE)","v":"JOSEPHINE"},{"$f":"VLOOKUP($A7,Engagés!$A$1:$F$29,4,FALSE)","v":"75-4-LMAP"},null,null,"3ème"]
["Déroulement",null,null,"Joueurs A contre Joueur B",null,"Vainqueur","Score"]
["Match 1",null,null,{"$f":"B4","v":"DE BATTISTA"},{"$f":"B7","v":"SALOME"}]
["Match 2",null,null,{"$f":"B5","v":"GARIN"},{"$f":"B6","v":"CHESNOT"}]
["Match 3",null,null,{"$f":"B4","v":"DE BATTISTA"},{"$f":"B6","v":"CHESNOT"}]
["Match 4",null,null,{"$f":"B5","v":"GARIN"},{"$f":"B7","v":"SALOME"}]
["Match 5",null,null,{"$f":"B4","v":"DE BATTISTA"},{"$f":"B5","v":"GARIN"}]
["Match 6",null,null,{"$f":"B6","v":"CHESNOT"},{"$f":"B7","v":"SALOME"}]
["CLASSEMENT",null,null,null,{"$f":"A2","v":"POULE 1"}]
[null,null,"NOM",null,"PRENOM",null,"SIGLE"]
["1er",null,{"$f":"IF($G$4=\"1er\", $B$4,IF($G$5=\"1er\",$B$5,IF($G$6=\"1er\",$B$6,IF($G$7=\"1er\",$B$7,\"\"))))","v":"DE BATTISTA"},null,{"$f":"IF($G$4=\"1er\", $C$4,IF($G$5=\"1er\",$C$5,IF($G$6=\"1er\",$C$6,IF($G$7=\"1er\",$C$7,\"\"))))","v":"TIPHAINE"},null,{"$f":"IF($G$4=\"1er\", $D$4,IF($G$5=\"1er\",$D$5,IF($G$6=\"1er\",$D$6,IF($G$7=\"1er\",$D$7,\"\"))))","v":"75-4-STAP"}]
["2ème",null,{"$f":"IF($G$4=\"2ème\", $B$4,IF($G$5=\"2ème\",$B$5,IF($G$6=\"2ème\",$B$6,IF($G$7=\"2ème\",$B$7,\"\"))))","v":"CHESNOT"},null,{"$f":"IF($G$4=\"2ème\", $C$4,IF($G$5=\"2ème\",$C$5,IF($G$6=\"2ème\",$C$6,IF($G$7=\"2ème\",$C$7,\"\"))))","v":"FLORE"},null,{"$f":"IF($G$4=\"2ème\", $D$4,IF($G$5=\"2ème\",$D$5,IF($G$6=\"2ème\",$D$6,IF($G$7=\"2ème\",$D$7,\"\"))))","v":"92-2-JOP"}]
["3ème",null,{"$f":"IF($G$4=\"3ème\", $B$4,IF($G$5=\"3ème\",$B$5,IF($G$6=\"3ème\",$B$6,IF($G$7=\"3ème\",$B$7,\"\"))))","v":"SALOME"},null,{"$f":"IF($G$4=\"3ème\", $C$4,IF($G$5=\"3ème\",$C$5,IF($G$6=\"3ème\",$C$6,IF($G$7=\"3ème\",$C$7,\"\"))))","v":"JOSEPHINE"},null,{"$f":"IF($G$4=\"3ème\", $D$4,IF($G$5=\"3ème\",$D$5,IF($G$6=\"3ème\",$D$6,IF($G$7=\"3ème\",$D$7,\"\"))))","v":"75-4-LMAP"}]
["4ème",null,{"$f":"IF($G$4=\"4ème\", $B$4,IF($G$5=\"4ème\",$B$5,IF($G$6=\"4ème\",$B$6,IF($G$7=\"4ème\",$B$7,\"\"))))","v":"GARIN"},null,{"$f":"IF($G$4=\"4ème\", $C$4,IF($G$5=\"4ème\",$C$5,IF($G$6=\"4ème\",$C$6,IF($G$7=\"4ème\",$C$7,\"\"))))","v":"APOLLINE"},null,{"$f":"IF($G$4=\"4ème\", $D$4,IF($G$5=\"4ème\",$D$5,IF($G$6=\"4ème\",$D$6,IF($G$7=\"4ème\",$D$7,\"\"))))","v":"92-4-SDN"}]

{"sheet":"Poule 2","index":3,"n_rows":20,"n_cols":7,"rows_kept":20,"cut":false,"hidden":false,"merged":[[11,0,11,2],[12,0,12,2],[9,0,9,2],[10,0,10,2],[0,0,0,6],[8,0,8,2],[1,0,1,6],[7,0,7,2],[7,3,7,4],[13,0,13,2],[14,0,14,3],[14,4,14,6],[16,0,16,1],[16,2,16,3],[16,4,16,5],[15,0,15,1],[15,2,15,3],[15,4,15,5],[19,0,19,1],[19,2,19,3],[19,4,19,5],[17,0,17,1],[17,2,17,3],[17,4,17,5],[18,0,18,1],[18,2,18,3],[18,4,18,5]]}
["TENNIS DE TABLE"]
["POULE 2"]
[null,"NOM","Prénom","Sigle","Vict","Def","Classement"]
[2,{"$f":"VLOOKUP($A4,Engagés!$A$1:$F$29,2,FALSE)","v":"SAUSSET"},{"$f":"VLOOKUP($A4,Engagés!$A$1:$F$29,3,FALSE)","v":"FLORA"},{"$f":"VLOOKUP($A4,Engagés!$A$1:$F$29,4,FALSE)","v":"91-4-SCVB"},null,null,"1er"]
[7,{"$f":"VLOOKUP($A5,Engagés!$A$1:$F$29,2,FALSE)","v":"OYHARNART--FAYET"},{"$f":"VLOOKUP($A5,Engagés!$A$1:$F$29,3,FALSE)","v":"HORTENSE"},{"$f":"VLOOKUP($A5,Engagés!$A$1:$F$29,4,FALSE)","v":"75-4-LMAP"},null,null,"2ème"]
[10,{"$f":"VLOOKUP($A6,Engagés!$A$1:$F$29,2,FALSE)","v":"BONNARD DJOUDAD"},{"$f":"VLOOKUP($A6,Engagés!$A$1:$F$29,3,FALSE)","v":"JULIETTE"},{"$f":"VLOOKUP($A6,Engagés!$A$1:$F$29,4,FALSE)","v":"75-2-SUPA"},null,null,"3ème"]
[15,{"$f":"VLOOKUP($A7,Engagés!$A$1:$F$29,2,FALSE)","v":"OUDART"},{"$f":"VLOOKUP($A7,Engagés!$A$1:$F$29,3,FALSE)","v":"CLEMENCE"},{"$f":"VLOOKUP($A7,Engagés!$A$1:$F$29,4,FALSE)","v":"92-4-STVC"},null,null,"4ème"]
["Déroulement",null,null,"Joueurs A contre Joueur B",null,"Vainqueur","Score"]
["Match 1",null,null,{"$f":"B4","v":"SAUSSET"},{"$f":"B7","v":"OUDART"}]
["Match 2",null,null,{"$f":"B5","v":"OYHARNART--FAYET"},{"$f":"B6","v":"BONNARD DJOUDAD"}]
["Match 3",null,null,{"$f":"B4","v":"SAUSSET"},{"$f":"B6","v":"BONNARD DJOUDAD"}]
["Match 4",null,null,{"$f":"B5","v":"OYHARNART--FAYET"},{"$f":"B7","v":"OUDART"}]
["Match 5",null,null,{"$f":"B4","v":"SAUSSET"},{"$f":"B5","v":"OYHARNART--FAYET"}]
["Match 6",null,null,{"$f":"B6","v":"BONNARD DJOUDAD"},{"$f":"B7","v":"OUDART"}]
["CLASSEMENT",null,null,null,{"$f":"A2","v":"POULE 2"}]
[null,null,"NOM",null,"PRENOM",null,"SIGLE"]
["1er",null,{"$f":"IF($G$4=\"1er\", $B$4,IF($G$5=\"1er\",$B$5,IF($G$6=\"1er\",$B$6,IF($G$7=\"1er\",$B$7,\"\"))))","v":"SAUSSET"},null,{"$f":"IF($G$4=\"1er\", $C$4,IF($G$5=\"1er\",$C$5,IF($G$6=\"1er\",$C$6,IF($G$7=\"1er\",$C$7,\"\"))))","v":"FLORA"},null,{"$f":"IF($G$4=\"1er\", $D$4,IF($G$5=\"1er\",$D$5,IF($G$6=\"1er\",$D$6,IF($G$7=\"1er\",$D$7,\"\"))))","v":"91-4-SCVB"}]
["2ème",null,{"$f":"IF($G$4=\"2ème\", $B$4,IF($G$5=\"2ème\",$B$5,IF($G$6=\"2ème\",$B$6,IF($G$7=\"2ème\",$B$7,\"\"))))","v":"OYHARNART--FAYET"},null,{"$f":"IF($G$4=\"2ème\", $C$4,IF($G$5=\"2ème\",$C$5,IF($G$6=\"2ème\",$C$6,IF($G$7=\"2ème\",$C$7,\"\"))))","v":"HORTENSE"},null,{"$f":"IF($G$4=\"2ème\", $D$4,IF($G$5=\"2ème\",$D$5,IF($G$6=\"2ème\",$D$6,IF($G$7=\"2ème\",$D$7,\"\"))))","v":"75-4-LMAP"}]
["3ème",null,{"$f":"IF($G$4=\"3ème\", $B$4,IF($G$5=\"3ème\",$B$5,IF($G$6=\"3ème\",$B$6,IF($G$7=\"3ème\",$B$7,\"\"))))","v":"BONNARD DJOUDAD"},null,{"$f":"IF($G$4=\"3ème\", $C$4,IF($G$5=\"3ème\",$C$5,IF($G$6=\"3ème\",$C$6,IF($G$7=\"3ème\",$C$7,\"\"))))","v":"JULIETTE"},null,{"$f":"IF($G$4=\"3ème\", $D$4,IF($G$5=\"3ème\",$D$5,IF($G$6=\"3ème\",$D$6,IF($G$7=\"3ème\",$D$7,\"\"))))","v":"75-2-SUPA"}]
["4ème",null,{"$f":"IF($G$4=\"4ème\", $B$4,IF($G$5=\"4ème\",$B$5,IF($G$6=\"4ème\",$B$6,IF($G$7=\"4ème\",$B$7,\"\"))))","v":"OUDART"},null,{"$f":"IF($G$4=\"4ème\", $C$4,IF($G$5=\"4ème\",$C$5,IF($G$6=\"4ème\",$C$6,IF($G$7=\"4ème\",$C$7,\"\"))))","v":"CLEMENCE"},null,{"$f":"IF($G$4=\"4ème\", $D$4,IF($G$5=\"4ème\",$D$5,IF($G$6=\"4ème\",$D$6,IF($G$7=\"4ème\",$D$7,\"\"))))","v":"92-4-STVC"}]

{"sheet":"Poule 3","index":4,"n_rows":20,"n_cols":7,"rows_kept":20,"cut":false,"hidden":false,"merged":[[11,0,11,2],[12,0,12,2],[9,0,9,2],[10,0,10,2],[0,0,0,6],[8,0,8,2],[1,0,1,6],[7,0,7,2],[7,3,7,4],[13,0,13,2],[14,0,14,3],[14,4,14,6],[16,0,16,1],[16,2,16,3],[16,4,16,5],[15,0,15,1],[15,2,15,3],[15,4,15,5],[19,0,19,1],[19,2,19,3],[19,4,19,5],[17,0,17,1],[17,2,17,3],[17,4,17,5],[18,0,18,1],[18,2,18,3],[18,4,18,5]]}
["TENNIS DE TABLE"]
["POULE 3"]
[null,"NOM","Prénom","Sigle","Vict","Def","Classement"]
[3,{"$f":"VLOOKUP($A4,Engagés!$A$1:$F$29,2,FALSE)","v":"DE POULPIQUET DU HALGOUET"},{"$f":"VLOOKUP($A4,Engagés!$A$1:$F$29,3,FALSE)","v":"SOLINE"},{"$f":"VLOOKUP($A4,Engagés!$A$1:$F$29,4,FALSE)","v":"75-4-STAP"},null,null,"1er"]
[6,{"$f":"VLOOKUP($A5,Engagés!$A$1:$F$29,2,FALSE)","v":"NICOLAU"},{"$f":"VLOOKUP($A5,Engagés!$A$1:$F$29,3,FALSE)","v":"ANASTASIA"},{"$f":"VLOOKUP($A5,Engagés!$A$1:$F$29,4,FALSE)","v":"92-4-SDN"},null,null,"3ème"]
[11,{"$f":"VLOOKUP($A6,Engagés!$A$1:$F$29,2,FALSE)","v":"CAILHO FERRENDIER"},{"$f":"VLOOKUP($A6,Engagés!$A$1:$F$29,3,FALSE)","v":"LILYLOU"},{"$f":"VLOOKUP($A6,Engagés!$A$1:$F$29,4,FALSE)","v":"75-4-FENP"},null,null,"2ème"]
[14,{"$f":"VLOOKUP($A7,Engagés!$A$1:$F$29,2,FALSE)","v":"LE GOFF"},{"$f":"VLOOKUP($A7,Engagés!$A$1:$F$29,3,FALSE)","v":"MANON"},{"$f":"VLOOKUP($A7,Engagés!$A$1:$F$29,4,FALSE)","v":"92-2-JOP"},null,null,"4ème"]
["Déroulement",null,null,"Joueurs A contre Joueur B",null,"Vainqueur","Score"]
["Match 1",null,null,{"$f":"B4","v":"DE POULPIQUET DU HALGOUET"},{"$f":"B7","v":"LE GOFF"}]
["Match 2",null,null,{"$f":"B5","v":"NICOLAU"},{"$f":"B6","v":"CAILHO FERRENDIER"}]
["Match 3",null,null,{"$f":"B4","v":"DE POULPIQUET DU HALGOUET"},{"$f":"B6","v":"CAILHO FERRENDIER"}]
["Match 4",null,null,{"$f":"B5","v":"NICOLAU"},{"$f":"B7","v":"LE GOFF"}]
["Match 5",null,null,{"$f":"B4","v":"DE POULPIQUET DU HALGOUET"},{"$f":"B5","v":"NICOLAU"}]
["Match 6",null,null,{"$f":"B6","v":"CAILHO FERRENDIER"},{"$f":"B7","v":"LE GOFF"}]
["CLASSEMENT",null,null,null,{"$f":"A2","v":"POULE 3"}]
[null,null,"NOM",null,"PRENOM",null,"SIGLE"]
["1er",null,{"$f":"IF($G$4=\"1er\", $B$4,IF($G$5=\"1er\",$B$5,IF($G$6=\"1er\",$B$6,IF($G$7=\"1er\",$B$7,\"\"))))","v":"DE POULPIQUET DU HALGOUET"},null,{"$f":"IF($G$4=\"1er\", $C$4,IF($G$5=\"1er\",$C$5,IF($G$6=\"1er\",$C$6,IF($G$7=\"1er\",$C$7,\"\"))))","v":"SOLINE"},null,{"$f":"IF($G$4=\"1er\", $D$4,IF($G$5=\"1er\",$D$5,IF($G$6=\"1er\",$D$6,IF($G$7=\"1er\",$D$7,\"\"))))","v":"75-4-STAP"}]
["2ème",null,{"$f":"IF($G$4=\"2ème\", $B$4,IF($G$5=\"2ème\",$B$5,IF($G$6=\"2ème\",$B$6,IF($G$7=\"2ème\",$B$7,\"\"))))","v":"CAILHO FERRENDIER"},null,{"$f":"IF($G$4=\"2ème\", $C$4,IF($G$5=\"2ème\",$C$5,IF($G$6=\"2ème\",$C$6,IF($G$7=\"2ème\",$C$7,\"\"))))","v":"LILYLOU"},null,{"$f":"IF($G$4=\"2ème\", $D$4,IF($G$5=\"2ème\",$D$5,IF($G$6=\"2ème\",$D$6,IF($G$7=\"2ème\",$D$7,\"\"))))","v":"75-4-FENP"}]
["3ème",null,{"$f":"IF($G$4=\"3ème\", $B$4,IF($G$5=\"3ème\",$B$5,IF($G$6=\"3ème\",$B$6,IF($G$7=\"3ème\",$B$7,\"\"))))","v":"NICOLAU"},null,{"$f":"IF($G$4=\"3ème\", $C$4,IF($G$5=\"3ème\",$C$5,IF($G$6=\"3ème\",$C$6,IF($G$7=\"3ème\",$C$7,\"\"))))","v":"ANASTASIA"},null,{"$f":"IF($G$4=\"3ème\", $D$4,IF($G$5=\"3ème\",$D$5,IF($G$6=\"3ème\",$D$6,IF($G$7=\"3ème\",$D$7,\"\"))))","v":"92-4-SDN"}]
["4ème",null,{"$f":"IF($G$4=\"4ème\", $B$4,IF($G$5=\"4ème\",$B$5,IF($G$6=\"4ème\",$B$6,IF($G$7=\"4ème\",$B$7,\"\"))))","v":"LE GOFF"},null,{"$f":"IF($G$4=\"4ème\", $C$4,IF($G$5=\"4ème\",$C$5,IF($G$6=\"4ème\",$C$6,IF($G$7=\"4ème\",$C$7,\"\"))))","v":"MANON"},null,{"$f":"IF($G$4=\"4ème\", $D$4,IF($G$5=\"4ème\",$D$5,IF($G$6=\"4ème\",$D$6,IF($G$7=\"4ème\",$D$7,\"\"))))","v":"92-2-JOP"}]

{"sheet":"Poule 4","index":5,"n_rows":20,"n_cols":7,"rows_kept":20,"cut":false,"hidden":false,"merged":[[11,0,11,2],[12,0,12,2],[9,0,9,2],[10,0,10,2],[0,0,0,6],[8,0,8,2],[1,0,1,6],[7,0,7,2],[7,3,7,4],[13,0,13,2],[14,0,14,3],[14,4,14,6],[16,0,16,1],[16,2,16,3],[16,4,16,5],[15,0,15,1],[15,2,15,3],[15,4,15,5],[19,0,19,1],[19,2,19,3],[19,4,19,5],[17,0,17,1],[17,2,17,3],[17,4,17,5],[18,0,18,1],[18,2,18,3],[18,4,18,5]]}
["TENNIS DE TABLE"]
["POULE 4"]
[null,"NOM","Prénom","Sigle","Vict","Def","Classement"]
[4,{"$f":"VLOOKUP($A4,Engagés!$A$1:$F$29,2,FALSE)","v":"WAKSMAN"},{"$f":"VLOOKUP($A4,Engagés!$A$1:$F$29,3,FALSE)","v":"SALOME"},{"$f":"VLOOKUP($A4,Engagés!$A$1:$F$29,4,FALSE)","v":"92-2-JOP"},null,null,"2ème"]
[5,{"$f":"VLOOKUP($A5,Engagés!$A$1:$F$29,2,FALSE)","v":"ILLOUZ"},{"$f":"VLOOKUP($A5,Engagés!$A$1:$F$29,3,FALSE)","v":"LEANA"},{"$f":"VLOOKUP($A5,Engagés!$A$1:$F$29,4,FALSE)","v":"75-4-LMAP"},null,null,"1er"]
[12,{"$f":"VLOOKUP($A6,Engagés!$A$1:$F$29,2,FALSE)","v":"MUNIER"},{"$f":"VLOOKUP($A6,Engagés!$A$1:$F$29,3,FALSE)","v":"CHARLOTTE"},{"$f":"VLOOKUP($A6,Engagés!$A$1:$F$29,4,FALSE)","v":"75-4-PCHP"},null,null,"4ème"]
[13,{"$f":"VLOOKUP($A7,Engagés!$A$1:$F$29,2,FALSE)","v":"BARRA--SOUSTRE"},{"$f":"VLOOKUP($A7,Engagés!$A$1:$F$29,3,FALSE)","v":"MANON"},{"$f":"VLOOKUP($A7,Engagés!$A$1:$F$29,4,FALSE)","v":"91-4-SCVB"},null,null,"3ème"]
["Déroulement",null,null,"Joueurs A contre Joueur B",null,"Vainqueur","Score"]
["Match 1",null,null,{"$f":"B4","v":"WAKSMAN"},{"$f":"B7","v":"BARRA--SOUSTRE"}]
["Match 2",null,null,{"$f":"B5","v":"ILLOUZ"},{"$f":"B6","v":"MUNIER"}]
["Match 3",null,null,{"$f":"B4","v":"WAKSMAN"},{"$f":"B6","v":"MUNIER"}]
["Match 4",null,null,{"$f":"B5","v":"ILLOUZ"},{"$f":"B7","v":"BARRA--SOUSTRE"}]
["Match 5",null,null,{"$f":"B4","v":"WAKSMAN"},{"$f":"B5","v":"ILLOUZ"}]
["Match 6",null,null,{"$f":"B6","v":"MUNIER"},{"$f":"B7","v":"BARRA--SOUSTRE"}]
["CLASSEMENT",null,null,null,{"$f":"A2","v":"POULE 4"}]
[null,null,"NOM",null,"PRENOM",null,"SIGLE"]
["1er",null,{"$f":"IF($G$4=\"1er\", $B$4,IF($G$5=\"1er\",$B$5,IF($G$6=\"1er\",$B$6,IF($G$7=\"1er\",$B$7,\"\"))))","v":"ILLOUZ"},null,{"$f":"IF($G$4=\"1er\", $C$4,IF($G$5=\"1er\",$C$5,IF($G$6=\"1er\",$C$6,IF($G$7=\"1er\",$C$7,\"\"))))","v":"LEANA"},null,{"$f":"IF($G$4=\"1er\", $D$4,IF($G$5=\"1er\",$D$5,IF($G$6=\"1er\",$D$6,IF($G$7=\"1er\",$D$7,\"\"))))","v":"75-4-LMAP"}]
["2ème",null,{"$f":"IF($G$4=\"2ème\", $B$4,IF($G$5=\"2ème\",$B$5,IF($G$6=\"2ème\",$B$6,IF($G$7=\"2ème\",$B$7,\"\"))))","v":"WAKSMAN"},null,{"$f":"IF($G$4=\"2ème\", $C$4,IF($G$5=\"2ème\",$C$5,IF($G$6=\"2ème\",$C$6,IF($G$7=\"2ème\",$C$7,\"\"))))","v":"SALOME"},null,{"$f":"IF($G$4=\"2ème\", $D$4,IF($G$5=\"2ème\",$D$5,IF($G$6=\"2ème\",$D$6,IF($G$7=\"2ème\",$D$7,\"\"))))","v":"92-2-JOP"}]
["3ème",null,{"$f":"IF($G$4=\"3ème\", $B$4,IF($G$5=\"3ème\",$B$5,IF($G$6=\"3ème\",$B$6,IF($G$7=\"3ème\",$B$7,\"\"))))","v":"BARRA--SOUSTRE"},null,{"$f":"IF($G$4=\"3ème\", $C$4,IF($G$5=\"3ème\",$C$5,IF($G$6=\"3ème\",$C$6,IF($G$7=\"3ème\",$C$7,\"\"))))","v":"MANON"},null,{"$f":"IF($G$4=\"3ème\", $D$4,IF($G$5=\"3ème\",$D$5,IF($G$6=\"3ème\",$D$6,IF($G$7=\"3ème\",$D$7,\"\"))))","v":"91-4-SCVB"}]
["4ème",null,{"$f":"IF($G$4=\"4ème\", $B$4,IF($G$5=\"4ème\",$B$5,IF($G$6=\"4ème\",$B$6,IF($G$7=\"4ème\",$B$7,\"\"))))","v":"MUNIER"},null,{"$f":"IF($G$4=\"4ème\", $C$4,IF($G$5=\"4ème\",$C$5,IF($G$6=\"4ème\",$C$6,IF($G$7=\"4ème\",$C$7,\"\"))))","v":"CHARLOTTE"},null,{"$f":"IF($G$4=\"4ème\", $D$4,IF($G$5=\"4ème\",$D$5,IF($G$6=\"4ème\",$D$6,IF($G$7=\"4ème\",$D$7,\"\"))))","v":"75-4-PCHP"}]

{"sheet":"Résultats de poule","index":6,"n_rows":5,"n_cols":16,"rows_kept":5,"cut":false,"hidden":false,"merged":[[0,0,0,3],[0,4,0,7],[0,8,0,11],[0,12,0,15]]}
["Poule 1",null,null,null,"Poule 2",null,null,null,"Poule 3",null,null,null,"Poule 4"]
["1er",{"$f":"'Poule 1'!$C17","v":"DE BATTISTA"},{"$f":"'Poule 1'!$E17","v":"TIPHAINE"},{"$f":"'Poule 1'!$G17","v":"75-4-STAP"},"1er",{"$f":"'Poule 2'!$C17","v":"SAUSSET"},{"$f":"'Poule 2'!$E17","v":"FLORA"},{"$f":"'Poule 2'!$G17","v":"91-4-SCVB"},"1er",{"$f":"'Poule 3'!$C17","v":"DE POULPIQUET DU HALGOUET"},{"$f":"'Poule 3'!$E17","v":"SOLINE"},{"$f":"'Poule 3'!$G17","v":"75-4-STAP"},"1er",{"$f":"'Poule 4'!$C17","v":"ILLOUZ"},{"$f":"'Poule 4'!$E17","v":"LEANA"},{"$f":"'Poule 4'!$G17","v":"75-4-LMAP"}]
["2ème",{"$f":"'Poule 1'!$C18","v":"CHESNOT"},{"$f":"'Poule 1'!$E18","v":"FLORE"},{"$f":"'Poule 1'!$G18","v":"92-2-JOP"},"2ème",{"$f":"'Poule 2'!$C18","v":"OYHARNART--FAYET"},{"$f":"'Poule 2'!$E18","v":"HORTENSE"},{"$f":"'Poule 2'!$G18","v":"75-4-LMAP"},"2ème",{"$f":"'Poule 3'!$C18","v":"CAILHO FERRENDIER"},{"$f":"'Poule 3'!$E18","v":"LILYLOU"},{"$f":"'Poule 3'!$G18","v":"75-4-FENP"},"2ème",{"$f":"'Poule 4'!$C18","v":"WAKSMAN"},{"$f":"'Poule 4'!$E18","v":"SALOME"},{"$f":"'Poule 4'!$G18","v":"92-2-JOP"}]
["3ème",{"$f":"'Poule 1'!$C19","v":"SALOME"},{"$f":"'Poule 1'!$E19","v":"JOSEPHINE"},{"$f":"'Poule 1'!$G19","v":"75-4-LMAP"},"3ème",{"$f":"'Poule 2'!$C19","v":"BONNARD DJOUDAD"},{"$f":"'Poule 2'!$E19","v":"JULIETTE"},{"$f":"'Poule 2'!$G19","v":"75-2-SUPA"},"3ème",{"$f":"'Poule 3'!$C19","v":"NICOLAU"},{"$f":"'Poule 3'!$E19","v":"ANASTASIA"},{"$f":"'Poule 3'!$G19","v":"92-4-SDN"},"3ème",{"$f":"'Poule 4'!$C19","v":"BARRA--SOUSTRE"},{"$f":"'Poule 4'!$E19","v":"MANON"},{"$f":"'Poule 4'!$G19","v":"91-4-SCVB"}]
["4ème",{"$f":"'Poule 1'!$C20","v":"GARIN"},{"$f":"'Poule 1'!$E20","v":"APOLLINE"},{"$f":"'Poule 1'!$G20","v":"92-4-SDN"},"4ème",{"$f":"'Poule 2'!$C20","v":"OUDART"},{"$f":"'Poule 2'!$E20","v":"CLEMENCE"},{"$f":"'Poule 2'!$G20","v":"92-4-STVC"},"4ème",{"$f":"'Poule 3'!$C20","v":"LE GOFF"},{"$f":"'Poule 3'!$E20","v":"MANON"},{"$f":"'Poule 3'!$G20","v":"92-2-JOP"},"4ème",{"$f":"'Poule 4'!$C20","v":"MUNIER"},{"$f":"'Poule 4'!$E20","v":"CHARLOTTE"},{"$f":"'Poule 4'!$G20","v":"75-4-PCHP"}]

{"sheet":"Tableau","index":7,"n_rows":95,"n_cols":34,"rows_kept":95,"cut":false,"hidden":false,"merged":[[8,10,8,11],[50,20,50,21],[16,10,16,11],[23,10,23,11],[33,10,33,11],[40,10,40,11],[48,10,48,11],[10,20,10,21],[30,32,30,33],[0,16,0,19],[15,29,15,30],[0,0,0,14],[31,29,31,30],[10,1,10,2],[1,4,1,5],[0,20,0,33],[16,26,16,27],[23,23,23,24],[3,20,3,21],[18,20,18,21],[29,4,29,5],[25,20,25,21],[1,10,1,11],[9,23,9,24],[55,10,55,11],[33,4,33,5],[42,1,42,2],[59,29,59,30],[55,23,55,24],[47,29,47,30],[35,20,35,21],[42,20,42,21],[41,23,41,24],[48,26,48,27],[57,20,57,21]]}
["REPECHAGES ET MATCHS DE CLASSEMENT",null,null,null,null,null,null,null,null,null,null,null,null,null,null,null,"1er tour de tableau",null,null,null,"Tableau des gagnants"]
[]
[]
[null,null,null,null,null,null,null,null,null,null,null,null,null,null,null,null,"1er poule 1",{"$f":"'Résultats de poule'!$B2","v":"DE BATTISTA"},{"$f":"'Résultats de poule'!$D2","v":"75-4-STAP"},"V","1/8 de finale 1"]
[null,null,null,null,null,null,null,null,null,null,null,null,null,{"$f":"IF(T4=\"\",\"\",IF(T4=\"p\",S4,S5))","v":0},{"$f":"IF(T4=\"\",\"\",IF(T4=\"p\",R4,R5))","v":0},null,null,null,null,"P",{"$f":"IF(T4=\"\",\"\",IF(T4=\"v\",R4,R5))","v":"DE BATTISTA"},{"$f":"IF(T4=\"\",\"\",IF(T4=\"v\",S4,S5))","v":"75-4-STAP"},"V"]
[null,null,null,null,null,null,null,null,null,null,{"$f":"IF(M5=\"\",\"\",IF(M5=\"v\",N5,N7))","v":""},{"$f":"IF(M5=\"\",\"\",IF(M5=\"v\",O5,O7))","v":""},null,null,null,null,null,null,null,null,null,null,null,{"$f":"IF(W5=\"\",\"\",IF(W5=\"v\",U5,U7))","v":"DE BATTISTA"},{"$f":"IF(W5=\"\",\"\",IF(W5=\"v\",V5,V7))","v":"75-4-STAP"},"V"]
[null,null,null,null,null,null,null,null,null,null,null,null,null,{"$f":"IF(T7=\"\",\"\",IF(T7=\"p\",S7,S8))","v":0},{"$f":"IF(T7=\"\",\"\",IF(T7=\"p\",R7,R8))","v":0},null,"4ème poule 2",{"$f":"'Résultats de poule'!F5","v":"OUDART"},{"$f":"'Résultats de poule'!H5","v":"92-4-STVC"},"V",{"$f":"IF(T7=\"\",\"\",IF(T7=\"v\",R7,R8))","v":"OUDART"},{"$f":"IF(T7=\"\",\"\",IF(T7=\"v\",S7,S8))","v":"92-4-STVC"},"P"]
[null,null,null,null,null,null,null,null,null,null,null,null,null,null,null,null,null,null,null,"P"]
[null,null,null,null,null,null,null,{"$f":"IF(J6=\"\",\"\",IF(J6=\"v\",K6,K13))","v":""},{"$f":"IF(J6=\"\",\"\",IF(J6=\"v\",L6,L13))","v":""}]
[null,null,null,null,null,null,null,null,null,null,null,null,null,null,null,null,null,null,null,null,null,null,null,"1/4 finale 1",null,null,{"$f":"IF(Z6=\"\",\"\",IF(Z6=\"v\",X6,X13))","v":"DE BATTISTA"},{"$f":"IF(Z6=\"\",\"\",IF(Z6=\"v\",Y6,Y13))","v":"75-4-STAP"},"V"]
[null,null,null,null,null,null,null,null,null,null,null,null,null,null,null,null,"2ème poule 3",{"$f":"'Résultats de poule'!J3","v":"CAILHO FERRENDIER"},{"$f":"'Résultats de poule'!L3","v":"75-4-FENP"},"V","1/8 de finale 2"]
[null,null,null,null,null,null,null,null,null,null,null,null,null,{"$f":"IF(T11=\"\",\"\",IF(T11=\"p\",S11,S12))","v":0},{"$f":"IF(T11=\"\",\"\",IF(T11=\"p\",R11,R12))","v":0},null,null,null,null,"P",{"$f":"IF(T11=\"\",\"\",IF(T11=\"v\",R11,R12))","v":"CAILHO FERRENDIER"},{"$f":"IF(T11=\"\",\"\",IF(T11=\"v\",S11,S12))","v":"75-4-FENP"},"V"]
[null,null,null,null,null,null,null,null,null,null,{"$f":"IF(M12=\"\",\"\",IF(M12=\"v\",N12,N14))","v":""},{"$f":"IF(M12=\"\",\"\",IF(M12=\"v\",O12,O14))","v":""},null,null,null,null,null,null,null,null,null,null,null,{"$f":"IF(W12=\"\",\"\",IF(W12=\"v\",U12,U14))","v":"CAILHO FERRENDIER"},{"$f":"IF(W12=\"\",\"\",IF(W12=\"v\",V12,V14))","v":"75-4-FENP"},"P"]
[null,null,null,null,null,null,null,null,null,null,null,null,null,{"$f":"IF(T14=\"\",\"\",IF(T14=\"p\",S14,S15))","v":0},{"$f":"IF(T14=\"\",\"\",IF(T14=\"p\",R14,R15))","v":0},null,null,null,null,"P",{"$f":"IF(T14=\"\",\"\",IF(T14=\"v\",R14,R15))","v":"BARRA--SOUSTRE"},{"$f":"IF(T14=\"\",\"\",IF(T14=\"v\",S14,S15))","v":"91-4-SCVB"},"P"]
[null,null,null,null,null,null,null,null,null,null,null,null,null,null,null,null,"3ème poule 4",{"$f":"'Résultats de poule'!N4","v":"BARRA--SOUSTRE"},{"$f":"'Résultats de poule'!P4","v":"91-4-SCVB"},"V"]
[null,null,null,null,{"$f":"IF(G9=\"\",\"\",IF(G9=\"v\",H9,H24))","v":""},{"$f":"IF(G9=\"\",\"\",IF(G9=\"v\",I9,I24))","v":""}]
[null,null,null,null,null,null,null,null,null,null,null,null,null,null,null,null,null,null,null,null,null,null,null,null,null,null,"1/2 finale A",null,null,{"$f":"IF(AC10=\"\",\"\",IF(AC10=\"v\",AA10,AA24))","v":"DE BATTISTA"},{"$f":"IF(AC10=\"\",\"\",IF(AC10=\"v\",AB10,AB24))","v":"75-4-STAP"},"P"]
[]
[null,null,null,null,null,null,null,null,null,null,null,null,null,null,null,null,"3ème poule 1",{"$f":"'Résultats de poule'!B4","v":"SALOME"},{"$f":"'Résultats de poule'!D4","v":"75-4-LMAP"},"V","1/8 de finale 3"]
[null,null,null,null,null,null,null,null,null,null,null,null,null,{"$f":"IF(T19=\"\",\"\",IF(T19=\"p\",S19,S20))","v":0},{"$f":"IF(T19=\"\",\"\",IF(T19=\"p\",R19,R20))","v":0},null,null,null,null,"P",{"$f":"IF(T19=\"\",\"\",IF(T19=\"v\",R19,R20))","v":"SALOME"},{"$f":"IF(T19=\"\",\"\",IF(T19=\"v\",S19,S20))","v":"75-4-LMAP"},"P"]
[null,null,null,null,null,null,null,null,null,null,{"$f":"IF(M20=\"\",\"\",IF(M20=\"v\",N20,N22))","v":""},{"$f":"IF(M20=\"\",\"\",IF(M20=\"v\",O20,O22))","v":""},null,null,null,null,null,null,null,null,null,null,null,{"$f":"IF(W20=\"\",\"\",IF(W20=\"v\",U20,U22))","v":"OYHARNART--FAYET"},{"$f":"IF(W20=\"\",\"\",IF(W20=\"v\",V20,V22))","v":"75-4-LMAP"},"P"]
[null,null,null,null,null,null,null,null,null,null,null,null,null,{"$f":"IF(T22=\"\",\"\",IF(T22=\"p\",S22,S23))","v":0},{"$f":"IF(T22=\"\",\"\",IF(T22=\"p\",R22,R23))","v":0},null,null,null,null,"P",{"$f":"IF(T22=\"\",\"\",IF(T22=\"v\",R22,R23))","v":"OYHARNART--FAYET"},{"$f":"IF(T22=\"\",\"\",IF(T22=\"v\",S22,S23))","v":"75-4-LMAP"},"V"]
[null,null,null,null,null,null,null,null,null,null,null,null,null,null,null,null,"2ème poule 2",{"$f":"'Résultats de poule'!F3","v":"OYHARNART--FAYET"},{"$f":"'Résultats de poule'!H3","v":"75-4-LMAP"},"V"]
[null,null,null,null,null,null,null,{"$f":"IF(J21=\"\",\"\",IF(J21=\"v\",K21,K28))","v":""},{"$f":"IF(J21=\"\",\"\",IF(J21=\"v\",L21,L28))","v":""},null,null,null,null,null,null,null,null,null,null,null,null,null,null,"1/4 finale 2",null,null,{"$f":"IF(Z21=\"\",\"\",IF(Z21=\"v\",X21,X28))","v":"ILLOUZ"},{"$f":"IF(Z21=\"\",\"\",IF(Z21=\"v\",Y21,Y28))","v":"75-4-LMAP"},"P"]
[]
[null,null,null,null,null,null,null,null,null,null,null,null,null,null,null,null,null,null,null,"P","1/8 de finale 4"]
[null,null,null,null,null,null,null,null,null,null,null,null,null,{"$f":"IF(T26=\"\",\"\",IF(T26=\"p\",S26,S27))","v":0},{"$f":"IF(T26=\"\",\"\",IF(T26=\"p\",R26,R27))","v":0},null,"4ème poule 3",{"$f":"'Résultats de poule'!J5","v":"LE GOFF"},{"$f":"'Résultats de poule'!L5","v":"92-2-JOP"},"V",{"$f":"IF(T26=\"\",\"\",IF(T26=\"v\",R26,R27))","v":"LE GOFF"},{"$f":"IF(T26=\"\",\"\",IF(T26=\"v\",S26,S27))","v":"92-2-JOP"},"P"]
[null,null,null,null,null,null,null,null,null,null,{"$f":"IF(M27=\"\",\"\",IF(M27=\"v\",N27,N29))","v":""},{"$f":"IF(M27=\"\",\"\",IF(M27=\"v\",O27,O29))","v":""},null,null,null,null,null,null,null,null,null,null,null,{"$f":"IF(W27=\"\",\"\",IF(W27=\"v\",U27,U29))","v":"ILLOUZ"},{"$f":"IF(W27=\"\",\"\",IF(W27=\"v\",V27,V29))","v":"75-4-LMAP"},"V"]
[null,null,null,null,null,null,null,null,null,null,null,null,null,{"$f":"IF(T29=\"\",\"\",IF(T29=\"p\",S29,S30))","v":0},{"$f":"IF(T29=\"\",\"\",IF(T29=\"p\",R29,R30))","v":0},null,null,null,null,"P",{"$f":"IF(T29=\"\",\"\",IF(T29=\"v\",R29,R30))","v":"ILLOUZ"},{"$f":"IF(T29=\"\",\"\",IF(T29=\"v\",S29,S30))","v":"75-4-LMAP"},"V"]
[null,null,null,null,null,null,null,null,null,null,null,null,null,null,null,null,"1er poule 4",{"$f":"'Résultats de poule'!N2","v":"ILLOUZ"},{"$f":"'Résultats de poule'!P2","v":"75-4-LMAP"},"V"]
[null,"17ème",null,null,null,null,null,null,null,null,null,null,null,null,null,null,null,null,null,null,null,null,null,null,null,null,null,null,null,null,null,null,"VAINQUEUR"]
[null,{"$f":"IF(D16=\"\",\"\",IF(D16=\"v\",E16,E48))","v":""},{"$f":"IF(D16=\"\",\"\",IF(D16=\"v\",F16,F48))","v":""},null,null,null,null,null,null,null,null,null,null,null,null,null,null,null,null,null,null,null,null,null,null,null,null,null,null,"FINALE",null,null,{"$f":"IF(AF17=\"\",\"\",IF(AF17=\"v\",AD17,AD49))","v":"DE POULPIQUET DU HALGOUET"},{"$f":"IF(AF17=\"\",\"\",IF(AF17=\"v\",AE17,AE49))","v":"75-4-STAP"}]
[]
[]
[]
[null,null,null,null,null,null,null,null,null,null,null,null,null,null,null,null,"1er poule 3",{"$f":"'Résultats de poule'!J2","v":"DE POULPIQUET DU HALGOUET"},{"$f":"'Résultats de poule'!L2","v":"75-4-STAP"},"V","1/8 de finale 5"]
[null,null,null,null,null,null,null,null,null,null,null,null,null,{"$f":"IF(T36=\"\",\"\",IF(T36=\"p\",S36,S37))","v":0},{"$f":"IF(T36=\"\",\"\",IF(T36=\"p\",R36,R37))","v":0},null,null,null,null,"P",{"$f":"IF(T36=\"\",\"\",IF(T36=\"v\",R36,R37))","v":"DE POULPIQUET DU HALGOUET"},{"$f":"IF(T36=\"\",\"\",IF(T36=\"v\",S36,S37))","v":"75-4-STAP"},"V"]
[null,null,null,null,null,null,null,null,null,null,{"$f":"IF(M37=\"\",\"\",IF(M37=\"v\",N37,N39))","v":""},{"$f":"IF(M37=\"\",\"\",IF(M37=\"v\",O37,O39))","v":""},null,null,null,null,null,null,null,null,null,null,null,{"$f":"IF(W37=\"\",\"\",IF(W37=\"v\",U37,U39))","v":"DE POULPIQUET DU HALGOUET"},{"$f":"IF(W37=\"\",\"\",IF(W37=\"v\",V37,V39))","v":"75-4-STAP"},"V"]
[null,null,null,null,null,null,null,null,null,null,null,null,null,{"$f":"IF(T39=\"\",\"\",IF(T39=\"p\",S39,S40))","v":0},{"$f":"IF(T39=\"\",\"\",IF(T39=\"p\",R39,R40))","v":0},null,"4ème poule 4",{"$f":"'Résultats de poule'!N5","v":"MUNIER"},{"$f":"'Résultats de poule'!P5","v":"75-4-PCHP"},"V",{"$f":"IF(T39=\"\",\"\",IF(T39=\"v\",R39,R40))","v":"MUNIER"},{"$f":"IF(T39=\"\",\"\",IF(T39=\"v\",S39,S40))","v":"75-4-PCHP"},"P"]
[null,null,null,null,null,null,null,null,null,null,null,null,null,null,null,null,null,null,null,"P"]
[null,null,null,null,null,null,null,{"$f":"IF(J38=\"\",\"\",IF(J38=\"v\",K38,K45))","v":""},{"$f":"IF(J38=\"\",\"\",IF(J38=\"v\",L38,L45))","v":""}]
[null,null,null,null,null,null,null,null,null,null,null,null,null,null,null,null,null,null,null,null,null,null,null,"1/4 finale 3",null,null,{"$f":"IF(Z38=\"\",\"\",IF(Z38=\"v\",X38,X45))","v":"DE POULPIQUET DU HALGOUET"},{"$f":"IF(Z38=\"\",\"\",IF(Z38=\"v\",Y38,Y45))","v":"75-4-STAP"},"V"]
[null,null,null,null,null,null,null,null,null,null,null,null,null,null,null,null,"2ème poule 1",{"$f":"'Résultats de poule'!B3","v":"CHESNOT"},{"$f":"'Résultats de poule'!D3","v":"92-2-JOP"},"V","1/8 de finale 6"]
[null,null,null,null,null,null,null,null,null,null,null,null,null,{"$f":"IF(T43=\"\",\"\",IF(T43=\"p\",S43,S44))","v":0},{"$f":"IF(T43=\"\",\"\",IF(T43=\"p\",R43,R44))","v":0},null,null,null,null,"P",{"$f":"IF(T43=\"\",\"\",IF(T43=\"v\",R43,R44))","v":"CHESNOT"},{"$f":"IF(T43=\"\",\"\",IF(T43=\"v\",S43,S44))","v":"92-2-JOP"},"P"]
[null,null,null,null,null,null,null,null,null,null,{"$f":"IF(M44=\"\",\"\",IF(M44=\"v\",N44,N46))","v":""},{"$f":"IF(M44=\"\",\"\",IF(M44=\"v\",O44,O46))","v":""},null,null,null,null,null,null,null,null,null,null,null,{"$f":"IF(W44=\"\",\"\",IF(W44=\"v\",U44,U46))","v":"BONNARD DJOUDAD"},{"$f":"IF(W44=\"\",\"\",IF(W44=\"v\",V44,V46))","v":"75-2-SUPA"},"P"]
[null,null,null,null,null,null,null,null,null,null,null,null,null,{"$f":"IF(T46=\"\",\"\",IF(T46=\"p\",S46,S47))","v":0},{"$f":"IF(T46=\"\",\"\",IF(T46=\"p\",R46,R47))","v":0},null,"3ème poule 2",{"$f":"'Résultats de poule'!F4","v":"BONNARD DJOUDAD"},{"$f":"'Résultats de poule'!H4","v":"75-2-SUPA"},"V",{"$f":"IF(T46=\"\",\"\",IF(T46=\"v\",R46,R47))","v":"BONNARD DJOUDAD"},{"$f":"IF(T46=\"\",\"\",IF(T46=\"v\",S46,S47))","v":"75-2-SUPA"},"V"]
[null,null,null,null,null,null,null,null,null,null,null,null,null,null,null,null,null,null,null,"P"]
[null,null,null,null,{"$f":"IF(G41=\"\",\"\",IF(G41=\"v\",H41,H56))","v":""},{"$f":"IF(G41=\"\",\"\",IF(G41=\"v\",I41,I56))","v":""}]
[null,null,null,null,null,null,null,null,null,null,null,null,null,null,null,null,null,null,null,null,null,null,null,null,null,null,"1/2 finale B",null,null,{"$f":"IF(AC42=\"\",\"\",IF(AC42=\"v\",AA42,AA56))","v":"DE POULPIQUET DU HALGOUET"},{"$f":"IF(AC42=\"\",\"\",IF(AC42=\"v\",AB42,AB56))","v":"75-4-STAP"},"V"]
[]
[null,null,null,null,null,null,null,null,null,null,null,null,null,null,null,null,"3ème poule 3",{"$f":"'Résultats de poule'!J4","v":"NICOLAU"},{"$f":"'Résultats de poule'!L4","v":"92-4-SDN"},"V","1/8 de finale 7"]
[null,null,null,null,null,null,null,null,null,null,null,null,null,{"$f":"IF(T51=\"\",\"\",IF(T51=\"p\",S51,S52))","v":0},{"$f":"IF(T51=\"\",\"\",IF(T51=\"p\",R51,R52))","v":0},null,null,null,null,"P",{"$f":"IF(T51=\"\",\"\",IF(T51=\"v\",R51,R52))","v":"NICOLAU"},{"$f":"IF(T51=\"\",\"\",IF(T51=\"v\",S51,S52))","v":"92-4-SDN"},"P"]
[null,null,null,null,null,null,null,null,null,null,{"$f":"IF(M52=\"\",\"\",IF(M52=\"v\",N52,N54))","v":""},{"$f":"IF(M52=\"\",\"\",IF(M52=\"v\",O52,O54))","v":""},null,null,null,null,null,null,null,null,null,null,null,{"$f":"IF(W52=\"\",\"\",IF(W52=\"v\",U52,U54))","v":"WAKSMAN"},{"$f":"IF(W52=\"\",\"\",IF(W52=\"v\",V52,V54))","v":"92-2-JOP"},"V"]
[null,null,null,null,null,null,null,null,null,null,null,null,null,{"$f":"IF(T54=\"\",\"\",IF(T54=\"p\",S54,S55))","v":0},{"$f":"IF(T54=\"\",\"\",IF(T54=\"p\",R54,R55))","v":0},null,"2ème poule 4",{"$f":"'Résultats de poule'!N3","v":"WAKSMAN"},{"$f":"'Résultats de poule'!P3","v":"92-2-JOP"},"V",{"$f":"IF(T54=\"\",\"\",IF(T54=\"v\",R54,R55))","v":"WAKSMAN"},{"$f":"IF(T54=\"\",\"\",IF(T54=\"v\",S54,S55))","v":"92-2-JOP"},"V"]
[null,null,null,null,null,null,null,null,null,null,null,null,null,null,null,null,null,null,null,"P"]
[null,null,null,null,null,null,null,{"$f":"IF(J53=\"\",\"\",IF(J53=\"v\",K53,K60))","v":""},{"$f":"IF(J53=\"\",\"\",IF(J53=\"v\",L53,L60))","v":""},null,null,null,null,null,null,null,null,null,null,null,null,null,null,"1/4 finale 4",null,null,{"$f":"IF(Z53=\"\",\"\",IF(Z53=\"v\",X53,X60))","v":"WAKSMAN"},{"$f":"IF(Z53=\"\",\"\",IF(Z53=\"v\",Y53,Y60))","v":"92-2-JOP"},"P"]
[]
[null,null,null,null,null,null,null,null,null,null,null,null,null,null,null,null,null,null,null,"P","1/8 de finale 8"]
[null,null,null,null,null,null,null,null,null,null,null,null,null,{"$f":"IF(T58=\"\",\"\",IF(T58=\"p\",S58,S59))","v":0},{"$f":"IF(T58=\"\",\"\",IF(T58=\"p\",R58,R59))","v":0},null,"4ème poule 1",{"$f":"'Résultats de poule'!B5","v":"GARIN"},{"$f":"'Résultats de poule'!D5","v":"92-4-SDN"},"V",{"$f":"IF(T58=\"\",\"\",IF(T58=\"v\",R58,R59))","v":"GARIN"},{"$f":"IF(T58=\"\",\"\",IF(T58=\"v\",S58,S59))","v":"92-4-SDN"},"P"]
[null,"19ème",null,null,{"$f":"IF(G9=\"\",\"\",IF(G9=\"p\",H9,H24))","v":""},{"$f":"IF(G9=\"\",\"\",IF(G9=\"p\",I9,I24))","v":""},null,null,null,null,{"$f":"IF(M59=\"\",\"\",IF(M59=\"v\",N59,N61))","v":""},{"$f":"IF(M59=\"\",\"\",IF(M59=\"v\",O59,O61))","v":""},null,null,null,null,null,null,null,null,null,null,null,{"$f":"IF(W59=\"\",\"\",IF(W59=\"v\",U59,U61))","v":"SAUSSET"},{"$f":"IF(W59=\"\",\"\",IF(W59=\"v\",V59,V61))","v":"91-4-SCVB"},"P",null,null,null,"Place de 3ème/4ème"]
[null,{"$f":"IF(D60=\"\",\"\",IF(D60=\"v\",E60,E62))","v":""},{"$f":"IF(D60=\"\",\"\",IF(D60=\"v\",F60,F62))","v":""},null,null,null,null,null,null,null,null,null,null,{"$f":"IF(T61=\"\",\"\",IF(T61=\"p\",S61,S62))","v":0},{"$f":"IF(T61=\"\",\"\",IF(T61=\"p\",R61,R62))","v":0},null,null,null,null,"P",{"$f":"IF(T61=\"\",\"\",IF(T61=\"v\",R61,R62))","v":"SAUSSET"},{"$f":"IF(T61=\"\",\"\",IF(T61=\"v\",S61,S62))","v":"91-4-SCVB"},"V",null,null,null,null,null,null,{"$f":"IF(AC10=\"\",\"\",IF(AC10=\"p\",AA10,AA24))","v":"ILLOUZ"},{"$f":"IF(AC10=\"\",\"\",IF(AC10=\"p\",AB10,AB24))","v":"75-4-LMAP"},"V"]
[null,null,null,null,{"$f":"IF(G41=\"\",\"\",IF(G41=\"p\",H41,H56))","v":""},{"$f":"IF(G41=\"\",\"\",IF(G41=\"p\",I41,I56))","v":""},null,null,null,null,null,null,null,null,null,null,"1er poule 2",{"$f":"'Résultats de poule'!F2","v":"SAUSSET"},{"$f":"'Résultats de poule'!H2","v":"91-4-SCVB"},"V",null,null,null,null,null,null,null,null,null,null,null,null,{"$f":"IF(AF61=\"\",\"\",IF(AF61=\"v\",AD61,AD63))","v":"ILLOUZ"},{"$f":"IF(AF61=\"\",\"\",IF(AF61=\"v\",AE61,AE63))","v":"75-4-LMAP"}]
[null,null,null,null,null,null,null,null,null,null,null,null,null,null,null,null,null,null,null,null,null,null,null,null,null,null,null,null,null,{"$f":"IF(AC42=\"\",\"\",IF(AC42=\"p\",AA42,AA56))","v":"WAKSMAN"},{"$f":"IF(AC42=\"\",\"\",IF(AC42=\"p\",AB42,AB56))","v":"92-2-JOP"},"P"]
[]
[null,null,null,null,null,null,null,null,null,null,null,null,null,{"$f":"IF(M5=\"\",\"\",IF(M5=\"p\",N5,N7))","v":""},{"$f":"IF(M5=\"\",\"\",IF(M5=\"p\",O5,O7))","v":""},null,null,{"$f":"IF(W5=\"\",\"\",IF(W5=\"p\",U5,U7))","v":"OUDART"},{"$f":"IF(W5=\"\",\"\",IF(W5=\"p\",V5,V7))","v":"92-4-STVC"},"P"]
[null,null,null,null,null,null,null,null,null,null,{"$f":"IF(M65=\"\",\"\",IF(M65=\"v\",N65,N66))","v":""},{"$f":"IF(M65=\"\",\"\",IF(M65=\"v\",O65,O66))","v":""},null,{"$f":"IF(M12=\"\",\"\",IF(M12=\"p\",N12,N14))","v":""},{"$f":"IF(M12=\"\",\"\",IF(M12=\"p\",O12,O14))","v":""},null,null,{"$f":"IF(W12=\"\",\"\",IF(W12=\"p\",U12,U14))","v":"BARRA--SOUSTRE"},{"$f":"IF(W12=\"\",\"\",IF(W12=\"p\",V12,V14))","v":"91-4-SCVB"},"V",{"$f":"IF(T65=\"\",\"\",IF(T65=\"v\",R65,R66))","v":"BARRA--SOUSTRE"},{"$f":"IF(T65=\"\",\"\",IF(T65=\"v\",S65,S66))","v":"91-4-SCVB"},"V"]
[null,null,null,null,null,null,null,{"$f":"IF(J66=\"\",\"\",IF(J66=\"v\",K66,K68))","v":""},{"$f":"IF(J66=\"\",\"\",IF(J66=\"v\",L66,L68))","v":""},null,null,null,null,null,null,null,null,null,null,null,null,null,null,{"$f":"IF(W66=\"\",\"\",IF(W66=\"v\",U66,U68))","v":"BARRA--SOUSTRE"},{"$f":"IF(W66=\"\",\"\",IF(W66=\"v\",V66,V68))","v":"91-4-SCVB"},"P"]
[null,null,null,null,null,null,null,null,null,null,{"$f":"IF(M68=\"\",\"\",IF(M68=\"v\",N68,N69))","v":""},{"$f":"IF(M68=\"\",\"\",IF(M68=\"v\",O68,O69))","v":""},null,{"$f":"IF(M20=\"\",\"\",IF(M20=\"p\",N20,N22))","v":""},{"$f":"IF(M20=\"\",\"\",IF(M20=\"p\",O20,O22))","v":""},null,null,{"$f":"IF(W20=\"\",\"\",IF(W20=\"p\",U20,U22))","v":"SALOME"},{"$f":"IF(W20=\"\",\"\",IF(W20=\"p\",V20,V22))","v":"75-4-LMAP"},"P",{"$f":"IF(T68=\"\",\"\",IF(T68=\"v\",R68,R69))","v":"LE GOFF"},{"$f":"IF(T68=\"\",\"\",IF(T68=\"v\",S68,S69))","v":"92-2-JOP"},"P"]
[null,null,null,null,"25ème",null,null,null,null,null,null,null,null,{"$f":"IF(M27=\"\",\"\",IF(M27=\"p\",N27,N29))","v":""},{"$f":"IF(M27=\"\",\"\",IF(M27=\"p\",O27,O29))","v":""},null,null,{"$f":"IF(W27=\"\",\"\",IF(W27=\"p\",U27,U29))","v":"LE GOFF"},{"$f":"IF(W27=\"\",\"\",IF(W27=\"p\",V27,V29))","v":"92-2-JOP"},"V",null,null,null,null,null,null,null,"9ème"]
[null,null,null,null,{"$f":"IF(G67=\"\",\"\",IF(G67=\"v\",H67,H73))","v":""},{"$f":"IF(G67=\"\",\"\",IF(G67=\"v\",I67,I73))","v":""},null,null,null,null,null,null,null,null,null,null,null,null,null,null,null,null,null,null,null,null,{"$f":"IF(Z67=\"\",\"\",IF(Z67=\"v\",X67,X73))","v":"NICOLAU"},{"$f":"IF(Z67=\"\",\"\",IF(Z67=\"v\",Y67,Y73))","v":"92-4-SDN"}]
[null,null,null,null,null,null,null,null,null,null,null,null,null,{"$f":"IF(M37=\"\",\"\",IF(M37=\"p\",N37,N39))","v":""},{"$f":"IF(M37=\"\",\"\",IF(M37=\"p\",O37,O39))","v":""},null,null,{"$f":"IF(W37=\"\",\"\",IF(W37=\"p\",U37,U39))","v":"MUNIER"},{"$f":"IF(W37=\"\",\"\",IF(W37=\"p\",V37,V39))","v":"75-4-PCHP"},"V"]
[null,null,null,null,null,null,null,null,null,null,{"$f":"IF(M71=\"\",\"\",IF(M71=\"v\",N71,N72))","v":""},{"$f":"IF(M71=\"\",\"\",IF(M71=\"v\",O71,O72))","v":""},null,{"$f":"IF(M44=\"\",\"\",IF(M44=\"p\",N44,N46))","v":""},{"$f":"IF(M44=\"\",\"\",IF(M44=\"p\",O44,O46))","v":""},null,null,{"$f":"IF(W44=\"\",\"\",IF(W44=\"p\",U44,U46))","v":"CHESNOT"},{"$f":"IF(W44=\"\",\"\",IF(W44=\"p\",V44,V46))","v":"92-2-JOP"},"P",{"$f":"IF(T71=\"\",\"\",IF(T71=\"v\",R71,R72))","v":"MUNIER"},{"$f":"IF(T71=\"\",\"\",IF(T71=\"v\",S71,S72))","v":"75-4-PCHP"},"P"]
[null,null,null,null,null,null,null,{"$f":"IF(J72=\"\",\"\",IF(J72=\"v\",K72,K74))","v":""},{"$f":"IF(J72=\"\",\"\",IF(J72=\"v\",L72,L74))","v":""},null,null,null,null,null,null,null,null,null,null,null,null,null,null,{"$f":"IF(W72=\"\",\"\",IF(W72=\"v\",U72,U74))","v":"NICOLAU"},{"$f":"IF(W72=\"\",\"\",IF(W72=\"v\",V72,V74))","v":"92-4-SDN"},"V"]
[null,null,null,null,null,null,null,null,null,null,{"$f":"IF(M74=\"\",\"\",IF(M74=\"v\",N74,N75))","v":""},{"$f":"IF(M74=\"\",\"\",IF(M74=\"v\",O74,O75))","v":""},null,{"$f":"IF(M52=\"\",\"\",IF(M52=\"p\",N52,N54))","v":""},{"$f":"IF(M52=\"\",\"\",IF(M52=\"p\",O52,O54))","v":""},null,null,{"$f":"IF(W52=\"\",\"\",IF(W52=\"p\",U52,U54))","v":"NICOLAU"},{"$f":"IF(W52=\"\",\"\",IF(W52=\"p\",V52,V54))","v":"92-4-SDN"},"V",{"$f":"IF(T74=\"\",\"\",IF(T74=\"v\",R74,R75))","v":"NICOLAU"},{"$f":"IF(T74=\"\",\"\",IF(T74=\"v\",S74,S75))","v":"92-4-SDN"},"V"]
[null,null,null,null,null,null,null,null,null,null,null,null,null,{"$f":"IF(M59=\"\",\"\",IF(M59=\"p\",N59,N61))","v":""},{"$f":"IF(M59=\"\",\"\",IF(M59=\"p\",O59,O61))","v":""},null,null,{"$f":"IF(W59=\"\",\"\",IF(W59=\"p\",U59,U61))","v":"GARIN"},{"$f":"IF(W59=\"\",\"\",IF(W59=\"p\",V59,V61))","v":"92-4-SDN"},"P",null,null,null,null,null,null,{"$f":"IF(Z6=\"\",\"\",IF(Z6=\"p\",X6,X13))","v":"CAILHO FERRENDIER"},{"$f":"IF(Z6=\"\",\"\",IF(Z6=\"p\",Y6,Y13))","v":"75-4-FENP"},"P"]
[null,null,null,null,null,null,null,null,null,null,null,null,null,null,null,null,null,null,null,null,null,null,null,null,null,null,null,null,null,{"$f":"IF(AC75=\"\",\"\",IF(AC75=\"v\",AA75,AA77))","v":"OYHARNART--FAYET"},{"$f":"IF(AC75=\"\",\"\",IF(AC75=\"v\",AB75,AB77))","v":"75-4-LMAP"},"P"]
[null,null,null,null,null,null,null,null,null,null,null,null,null,{"$f":"IF(M65=\"\",\"\",IF(M65=\"p\",N65,N66))","v":""},{"$f":"IF(M65=\"\",\"\",IF(M65=\"p\",O65,O66))","v":""},null,null,{"$f":"IF(T65=\"\",\"\",IF(T65=\"p\",R65,R66))","v":"OUDART"},{"$f":"IF(T65=\"\",\"\",IF(T65=\"p\",S65,S66))","v":"92-4-STVC"},"V",null,null,null,null,null,null,{"$f":"IF(Z21=\"\",\"\",IF(Z21=\"p\",X21,X28))","v":"OYHARNART--FAYET"},{"$f":"IF(Z21=\"\",\"\",IF(Z21=\"p\",Y21,Y28))","v":"75-4-LMAP"},"V"]
[null,null,null,null,null,null,null,"29ème",null,null,{"$f":"IF(M77=\"\",\"\",IF(M77=\"v\",N77,N78))","v":""},{"$f":"IF(M77=\"\",\"\",IF(M77=\"v\",O77,O78))","v":""},null,{"$f":"IF(M68=\"\",\"\",IF(M68=\"p\",N68,N69))","v":""},{"$f":"IF(M68=\"\",\"\",IF(M68=\"p\",O68,O69))","v":""},null,null,{"$f":"IF(T68=\"\",\"\",IF(T68=\"p\",R68,R69))","v":"SALOME"},{"$f":"IF(T68=\"\",\"\",IF(T68=\"p\",S68,S69))","v":"75-4-LMAP"},"P",{"$f":"IF(T77=\"\",\"\",IF(T77=\"v\",R77,R78))","v":"OUDART"},{"$f":"IF(T77=\"\",\"\",IF(T77=\"v\",S77,S78))","v":"92-4-STVC"},"P",null,"13ème",null,null,null,null,null,null,null,null,"5ème"]
[null,null,null,null,null,null,null,{"$f":"IF(J78=\"\",\"\",IF(J78=\"v\",K78,K80))","v":""},{"$f":"IF(J78=\"\",\"\",IF(J78=\"v\",L78,L80))","v":""},null,null,null,null,null,null,null,null,null,null,null,null,null,null,{"$f":"IF(W78=\"\",\"\",IF(W78=\"v\",U78,U80))","v":"GARIN"},{"$f":"IF(W78=\"\",\"\",IF(W78=\"v\",V78,V80))","v":"92-4-SDN"},null,null,null,null,null,null,null,{"$f":"IF(AF76=\"\",\"\",IF(AF76=\"v\",AD76,AD82))","v":"BONNARD DJOUDAD"},{"$f":"IF(AF76=\"\",\"\",IF(AF76=\"v\",AE76,AE82))","v":"75-2-SUPA"}]
[null,null,null,null,null,null,null,null,null,null,{"$f":"IF(M80=\"\",\"\",IF(M80=\"v\",N80,N81))","v":""},{"$f":"IF(M80=\"\",\"\",IF(M80=\"v\",O80,O81))","v":""},null,{"$f":"IF(M71=\"\",\"\",IF(M71=\"p\",N71,N72))","v":""},{"$f":"IF(M71=\"\",\"\",IF(M71=\"p\",O71,O72))","v":""},null,null,{"$f":"IF(T71=\"\",\"\",IF(T71=\"p\",R71,R72))","v":"CHESNOT"},{"$f":"IF(T71=\"\",\"\",IF(T71=\"p\",S71,S72))","v":"92-2-JOP"},"P",{"$f":"IF(T80=\"\",\"\",IF(T80=\"v\",R80,R81))","v":"GARIN"},{"$f":"IF(T80=\"\",\"\",IF(T80=\"v\",S80,S81))","v":"92-4-SDN"},"V"]
[null,null,null,null,null,null,null,null,null,null,null,null,null,{"$f":"IF(M74=\"\",\"\",IF(M74=\"p\",N74,N75))","v":""},{"$f":"IF(M74=\"\",\"\",IF(M74=\"p\",O74,O75))","v":""},null,null,{"$f":"IF(T74=\"\",\"\",IF(T74=\"p\",R74,R75))","v":"GARIN"},{"$f":"IF(T74=\"\",\"\",IF(T74=\"p\",S74,S75))","v":"92-4-SDN"},"V",null,null,null,null,null,null,{"$f":"IF(Z38=\"\",\"\",IF(Z38=\"p\",X38,X45))","v":"BONNARD DJOUDAD"},{"$f":"IF(Z38=\"\",\"\",IF(Z38=\"p\",Y38,Y45))","v":"75-2-SUPA"},"V"]
[null,null,null,null,null,null,null,null,null,null,"27ème",null,null,null,null,null,null,null,null,null,null,"11ème",null,null,null,null,null,null,null,{"$f":"IF(AC81=\"\",\"\",IF(AC81=\"v\",AA81,AA83))","v":"BONNARD DJOUDAD"},{"$f":"IF(AC81=\"\",\"\",IF(AC81=\"v\",AB81,AB83))","v":"75-2-SUPA"},"V"]
[null,null,null,null,null,null,null,null,null,null,{"$f":"IF(M83=\"\",\"\",IF(M83=\"v\",N83,N84))","v":""},{"$f":"IF(M83=\"\",\"\",IF(M83=\"v\",O83,O84))","v":""},null,{"$f":"IF(J66=\"\",\"\",IF(J66=\"p\",K66,K68))","v":""},{"$f":"IF(J66=\"\",\"\",IF(J66=\"p\",L66,L68))","v":""},null,null,{"$f":"IF(W66=\"\",\"\",IF(W66=\"p\",U66,U68))","v":"LE GOFF"},{"$f":"IF(W66=\"\",\"\",IF(W66=\"p\",V66,V68))","v":"92-2-JOP"},"P",{"$f":"IF(T83=\"\",\"\",IF(T83=\"v\",R83,R84))","v":"MUNIER"},{"$f":"IF(T83=\"\",\"\",IF(T83=\"v\",S83,S84))","v":"75-4-PCHP"},null,null,null,null,{"$f":"IF(Z53=\"\",\"\",IF(Z53=\"p\",X53,X60))","v":"SAUSSET"},{"$f":"IF(Z53=\"\",\"\",IF(Z53=\"p\",Y53,Y60))","v":"91-4-SCVB"},"P"]
[null,null,null,null,null,null,null,null,null,null,null,null,null,{"$f":"IF(J72=\"\",\"\",IF(J72=\"p\",K72,K74))","v":""},{"$f":"IF(J72=\"\",\"\",IF(J72=\"p\",L72,L74))","v":""},null,null,{"$f":"IF(W72=\"\",\"\",IF(W72=\"p\",U72,U74))","v":"MUNIER"},{"$f":"IF(W72=\"\",\"\",IF(W72=\"p\",V72,V74))","v":"75-4-PCHP"},"V"]
[null,null,null,null,null,null,null,{"$f":"IF(J6=\"\",\"\",IF(J6=\"p\",K6,K13))","v":""},{"$f":"IF(J6=\"\",\"\",IF(J6=\"p\",L6,L13))","v":""},null,null,null,null,null,null,null,null,null,null,null,null,null,null,null,null,null,{"$f":"IF(AC75=\"\",\"\",IF(AC75=\"p\",AA75,AA77))","v":"CAILHO FERRENDIER"},{"$f":"IF(AC75=\"\",\"\",IF(AC75=\"p\",AB75,AB77))","v":"75-4-FENP"},"P",null,"7ème"]
[null,"21ème",null,null,{"$f":"IF(G85=\"\",\"\",IF(G85=\"v\",H85,H86))","v":""},{"$f":"IF(G85=\"\",\"\",IF(G85=\"v\",I85,I86))","v":""},null,{"$f":"IF(J21=\"\",\"\",IF(J21=\"p\",K21,K28))","v":""},{"$f":"IF(J21=\"\",\"\",IF(J21=\"p\",L21,L28))","v":""},null,"31ème",null,null,null,null,null,null,null,null,null,null,"15ème",null,null,null,null,null,null,null,{"$f":"IF(AC85=\"\",\"\",IF(AC85=\"v\",AA85,AA87))","v":"SAUSSET"},{"$f":"IF(AC85=\"\",\"\",IF(AC85=\"v\",AB85,AB87))","v":"91-4-SCVB"}]
[null,{"$f":"IF(D86=\"\",\"\",IF(D86=\"v\",E86,E88))","v":""},{"$f":"IF(D86=\"\",\"\",IF(D86=\"v\",F86,F88))","v":""},null,null,null,null,null,null,null,{"$f":"IF(M87=\"\",\"\",IF(M87=\"v\",N87,N88))","v":""},{"$f":"IF(M87=\"\",\"\",IF(M87=\"v\",O87,O88))","v":""},null,{"$f":"IF(M77=\"\",\"\",IF(M77=\"p\",N77,N78))","v":""},{"$f":"IF(M77=\"\",\"\",IF(M77=\"p\",O77,O78))","v":""},null,null,{"$f":"IF(T77=\"\",\"\",IF(T77=\"p\",R77,R78))","v":"SALOME"},{"$f":"IF(T77=\"\",\"\",IF(T77=\"p\",S77,S78))","v":"75-4-LMAP"},"V",{"$f":"IF(T87=\"\",\"\",IF(T87=\"v\",R87,R88))","v":"SALOME"},{"$f":"IF(T87=\"\",\"\",IF(T87=\"v\",S87,S88))","v":"75-4-LMAP"},null,null,null,null,{"$f":"IF(AC81=\"\",\"\",IF(AC81=\"p\",AA81,AA83))","v":"SAUSSET"},{"$f":"IF(AC81=\"\",\"\",IF(AC81=\"p\",AB81,AB83))","v":"91-4-SCVB"},"V"]
[null,null,null,null,{"$f":"IF(G88=\"\",\"\",IF(G88=\"v\",H88,H89))","v":""},{"$f":"IF(G88=\"\",\"\",IF(G88=\"v\",I88,I89))","v":""},null,{"$f":"IF(J38=\"\",\"\",IF(J38=\"p\",K38,K45))","v":""},{"$f":"IF(J38=\"\",\"\",IF(J38=\"p\",L38,L45))","v":""},null,null,null,null,{"$f":"IF(M80=\"\",\"\",IF(M80=\"p\",N80,N81))","v":""},{"$f":"IF(M80=\"\",\"\",IF(M80=\"p\",O80,O81))","v":""},null,null,{"$f":"IF(T80=\"\",\"\",IF(T80=\"p\",R80,R81))","v":"CHESNOT"},{"$f":"IF(T80=\"\",\"\",IF(T80=\"p\",S80,S81))","v":"92-2-JOP"},"P"]
[null,null,null,null,null,null,null,{"$f":"IF(J53=\"\",\"\",IF(J53=\"p\",K53,K60))","v":""},{"$f":"IF(J53=\"\",\"\",IF(J53=\"p\",L53,L60))","v":""}]
[null,"23ème"]
[null,{"$f":"IF(D91=\"\",\"\",IF(D91=\"v\",E91,E92))","v":""},{"$f":"IF(D91=\"\",\"\",IF(D91=\"v\",F91,F92))","v":""},null,{"$f":"IF(G85=\"\",\"\",IF(G85=\"p\",H85,H86))","v":""},{"$f":"IF(G85=\"\",\"\",IF(G85=\"p\",I85,I86))","v":""}]
[null,null,null,null,{"$f":"IF(G88=\"\",\"\",IF(G88=\"p\",H88,H89))","v":""},{"$f":"IF(G88=\"\",\"\",IF(G88=\"p\",I88,I89))","v":""}]
[]
[]
[null,null,"37 matchs"]

{"sheet":"Classement","index":8,"n_rows":35,"n_cols":7,"rows_kept":35,"cut":false,"hidden":false,"merged":[[1,0,1,2],[0,0,0,2]]}
[{"$f":"IF(Engagés!A1=\"\",\"\",Engagés!A1)","v":"Championnat IDF de Tennis de Table "}]
[{"$f":"IF(Engagés!E3=\"\",\"\",Engagés!E3)","v":"BF PROMO"}]
["CLASSEMENT","NOMS","Etablissement",null,null,"Q =","Quota de base"]
["1er",{"$f":"Tableau!AG32","v":"DE POULPIQUET DU HALGOUET"},{"$f":"Tableau!AH32","v":"75-4-STAP"},"Q",null,"QS =","Quota supplémentaire"]
["2ème",{"$f":"IF(Tableau!$AF$17=\"\",\"\",IF(Tableau!$AF$17=\"p\",Tableau!$AD$17,Tableau!$AD$49))","v":"DE BATTISTA"},{"$f":"IF(Tableau!$AF$17=\"\",\"\",IF(Tableau!$AF$17=\"p\",Tableau!$AE$17,Tableau!$AE$49))","v":"75-4-STAP"},"Q"]
["3ème",{"$f":"Tableau!AG62","v":"ILLOUZ"},{"$f":"Tableau!AH62","v":"75-4-LMAP"},"Q"]
["4ème",{"$f":"IF(Tableau!AF61=\"\",\"\",IF(Tableau!$AF$61=\"p\",Tableau!$AD$61,Tableau!$AD$63))","v":"WAKSMAN"},{"$f":"IF(Tableau!AF61=\"\",\"\",IF(Tableau!$AF$61=\"p\",Tableau!$AE$61,Tableau!$AE$63))","v":"92-2-JOP"},"QS"]
["5ème",{"$f":"Tableau!AG79","v":"BONNARD DJOUDAD"},{"$f":"Tableau!AH79","v":"75-2-SUPA"}]
["6ème",{"$f":"IF(Tableau!AF76=\"\",\"\",IF(Tableau!$AF$76=\"p\",Tableau!$AD$76,Tableau!$AD$82))","v":"OYHARNART--FAYET"},{"$f":"IF(Tableau!$AF$76=\"\",\"\",IF(Tableau!$AF$76=\"p\",Tableau!$AE$76,Tableau!$AE$82))","v":"75-4-LMAP"}]
["7ème",{"$f":"Tableau!AD86","v":"SAUSSET"},{"$f":"Tableau!AE86","v":"91-4-SCVB"}]
["8ème",{"$f":"IF(Tableau!$AC$85=\"\",\"\",IF(Tableau!$AC$85=\"p\",Tableau!$AA$85,Tableau!$AA$87))","v":"CAILHO FERRENDIER"},{"$f":"IF(Tableau!$AC$85=\"\",\"\",IF(Tableau!$AC$85=\"p\",Tableau!$AB$85,Tableau!$AB$87))","v":"75-4-FENP"}]
["9ème",{"$f":"Tableau!AA70","v":"NICOLAU"},{"$f":"Tableau!AB70","v":"92-4-SDN"}]
["10ème",{"$f":"IF(Tableau!$Z$67=\"\",\"\",IF(Tableau!$Z$67=\"p\",Tableau!$X$67,Tableau!$X$73))","v":"BARRA--SOUSTRE"},{"$f":"IF(Tableau!$Z$67=\"\",\"\",IF(Tableau!$Z$67=\"p\",Tableau!$Y$67,Tableau!$Y$73))","v":"91-4-SCVB"}]
["11ème",{"$f":"Tableau!U83","v":"MUNIER"},{"$f":"Tableau!V83","v":"75-4-PCHP"}]
["12ème",{"$f":"IF(Tableau!$T$83=\"\",\"\",IF(Tableau!$T$83=\"p\",Tableau!$R$83,Tableau!$R$84))","v":"LE GOFF"},{"$f":"IF(Tableau!$T$83=\"\",\"\",IF(Tableau!$T$83=\"p\",Tableau!$S$83,Tableau!$S$84))","v":"92-2-JOP"}]
["13ème",{"$f":"Tableau!X79","v":"GARIN"},{"$f":"Tableau!Y79","v":"92-4-SDN"}]
["14ème",{"$f":"IF(Tableau!$W$78=\"\",\"\",IF(Tableau!$W$78=\"p\",Tableau!$U$78,Tableau!$U$80))","v":"OUDART"},{"$f":"IF(Tableau!$W$78=\"\",\"\",IF(Tableau!$W$78=\"p\",Tableau!$V$78,Tableau!$V$80))","v":"92-4-STVC"}]
["15ème",{"$f":"Tableau!U87","v":"SALOME"},{"$f":"Tableau!V87","v":"75-4-LMAP"}]
["16ème",{"$f":"IF(Tableau!$T$87=\"\",\"\",IF(Tableau!$T$87=\"p\",Tableau!$R$87,Tableau!$R$88))","v":"CHESNOT"},{"$f":"IF(Tableau!$T$87=\"\",\"\",IF(Tableau!$T$87=\"p\",Tableau!$S$87,Tableau!$S$88))","v":"92-2-JOP"}]
["17ème",{"$f":"Tableau!C32","v":""},{"$f":"Tableau!B32","v":""}]
["18ème",{"$f":"IF(Tableau!$D$16=\"\",\"\",IF(Tableau!$D$16=\"p\",Tableau!$F$60,Tableau!$F$48))","v":""},{"$f":"IF(Tableau!$D$16=\"\",\"\",IF(Tableau!$D$16=\"p\",Tableau!$E$16,Tableau!$E$48))","v":""}]
["19ème",{"$f":"Tableau!C61","v":""},{"$f":"Tableau!B61","v":""}]
["20ème",{"$f":"IF(Tableau!D60=\"\",\"\",IF(Tableau!$D$60=\"p\",Tableau!$F$60,Tableau!$F$62))","v":""},{"$f":"IF(Tableau!D60=\"\",\"\",IF(Tableau!$D$60=\"p\",Tableau!$E$60,Tableau!$E$62))","v":""}]
["21ème",{"$f":"Tableau!C87","v":""},{"$f":"Tableau!B87","v":""}]
["22ème",{"$f":"IF(Tableau!$D$86=\"\",\"\",IF(Tableau!$D$86=\"p\",Tableau!$F$86,Tableau!$F$88))","v":""},{"$f":"IF(Tableau!$D$86=\"\",\"\",IF(Tableau!$D$86=\"p\",Tableau!$E$86,Tableau!$E$88))","v":""}]
["23ème",{"$f":"Tableau!C91","v":""},{"$f":"Tableau!B91","v":""}]
["24ème",{"$f":"IF(Tableau!$D$91=\"\",\"\",IF(Tableau!$D$91=\"p\",Tableau!$F$91,Tableau!$F$92))","v":""},{"$f":"IF(Tableau!$D$91=\"\",\"\",IF(Tableau!$D$91=\"p\",Tableau!$E$91,Tableau!$E$92))","v":""}]
["25ème",{"$f":"Tableau!F70","v":""},{"$f":"Tableau!E70","v":""}]
["26ème",{"$f":"IF(Tableau!$G$67=\"\",\"\",IF(Tableau!$G$67=\"p\",Tableau!$I$67,Tableau!$I$73))","v":""},{"$f":"IF(Tableau!$G$67=\"\",\"\",IF(Tableau!$G$67=\"p\",Tableau!$H$73,Tableau!$H$67))","v":""}]
["27ème",{"$f":"Tableau!L83","v":""},{"$f":"Tableau!K83","v":""}]
["28ème",{"$f":"IF(Tableau!$M$83=\"\",\"\",IF(Tableau!$M$83=\"p\",Tableau!$O$83,Tableau!$O$84))","v":""},{"$f":"IF(Tableau!$M$83=\"\",\"\",IF(Tableau!$M$83=\"p\",Tableau!$N$83,Tableau!$N$84))","v":""}]
["29ème",{"$f":"Tableau!I79","v":""},{"$f":"Tableau!H79","v":""}]
["30ème",{"$f":"IF(Tableau!$J$78=\"\",\"\",IF(Tableau!$J$78=\"p\",Tableau!$L$78,Tableau!$L$80))","v":""},{"$f":"IF(Tableau!$J$78=\"\",\"\",IF(Tableau!$J$78=\"p\",Tableau!$K$78,Tableau!$K$80))","v":""}]
["31ème",{"$f":"Tableau!L87","v":""},{"$f":"Tableau!K87","v":""}]
["32ème",{"$f":"IF(Tableau!$M$87=\"\",\"\",IF(Tableau!$M$87=\"p\",Tableau!$O$87,Tableau!$O$88))","v":""},{"$f":"IF(Tableau!$M$87=\"\",\"\",IF(Tableau!$M$87=\"p\",Tableau!$N$87,Tableau!$N$88))","v":""}]