{"text_format":"1","workbook":"xlsx","n_sheets":13,"sheets":["Engagés","Poule 1","Poule 2","Poule 3","Poule 4","Poule 5","Poule 6","Poule 7","Poule 8","Résultats de poule","Tableau","Classement","Feuille de match"],"not_rendered":{"charts":0,"images":82,"macros":1,"external_links":0,"defined_names":1,"comments":0,"pivot_tables":0},"unopened":[],"bounds":{"document_bytes":16777216,"sheet_cells":100000,"rows_first":2000,"rows_last":500,"rows_between":2000,"halvings":0,"cell_chars":16384,"cell_head_chars":4096},"cells_cut":0,"cells_raw":0,"read":"whole","date_system":"1900"}

{"sheet":"Engagés","index":0,"n_rows":37,"n_cols":14,"rows_kept":37,"cut":false,"hidden":false,"merged":[[17,6,17,9],[17,10,17,13],[23,6,23,9],[23,10,23,13],[0,0,2,1],[5,10,5,13],[5,6,5,9],[11,6,11,9],[11,10,11,13],[0,2,2,2]]}
["Championnat Territoire IDF",null,"TENNIS DE TABLE","DATE :","16 fev"]
[null,null,null,"LIEU :","Stanislas"]
[null,null,null,"CATEGORIE :","CJG ELITE"]
["Tête de série","ETABLISSEMENT","NOM","PRENOM","SIGLE"]
[]
[1,"SAINTE URSULE","LE METTER","THEOPHILE","75-3-SUPA",null,"Poule 1",null,null,null,"Poule 2"]
[2,"COLLEGE LYCEE SAINT DOMINIQUE","BOUTEMY","MALO","92-4-SDN",null,1,{"$f":"VLOOKUP($G7,$A$1:$E$37,3,FALSE)","v":"LE METTER"},{"$f":"VLOOKUP($G7,$A$1:$E$37,4,FALSE)","v":"THEOPHILE"},{"$f":"VLOOKUP($G7,$A$1:$E$37,5,FALSE)","v":"75-3-SUPA"},2,{"$f":"VLOOKUP($K7,$A$1:$E$37,3,FALSE)","v":"BOUTEMY"},{"$f":"VLOOKUP($K7,$A$1:$E$37,4,FALSE)","v":"MALO"},{"$f":"VLOOKUP($K7,$A$1:$E$37,5,FALSE)","v":"92-4-SDN"}]
[3,"COLLEGE LYCEE SAINT DOMINIQUE","LEPELTIER","CORENTIN","92-4-SDN",null,16,{"$f":"VLOOKUP($G8,$A$1:$E$37,3,FALSE)","v":"MIQUEU"},{"$f":"VLOOKUP($G8,$A$1:$E$37,4,FALSE)","v":"LOUIS"},{"$f":"VLOOKUP($G8,$A$1:$E$37,5,FALSE)","v":"75-4-LMAP"},15,{"$f":"VLOOKUP($K8,$A$1:$E$37,3,FALSE)","v":"BLANCHET"},{"$f":"VLOOKUP($K8,$A$1:$E$37,4,FALSE)","v":"MARIN"},{"$f":"VLOOKUP($K8,$A$1:$E$37,5,FALSE)","v":"75-3-SUPA"}]
[4,"COLLEGE LYCEE SAINT DOMINIQUE","HEBRAUD","CLEMENT","92-4-SDN",null,17,{"$f":"VLOOKUP($G9,$A$1:$E$37,3,FALSE)","v":"MANSOUR ABDALLA"},{"$f":"VLOOKUP($G9,$A$1:$E$37,4,FALSE)","v":"IHAB"},{"$f":"VLOOKUP($G9,$A$1:$E$37,5,FALSE)","v":"92-4-SDN"},18,{"$f":"VLOOKUP($K9,$A$1:$E$37,3,FALSE)","v":"DIEHL"},{"$f":"VLOOKUP($K9,$A$1:$E$37,4,FALSE)","v":"ALEXANDROS"},{"$f":"VLOOKUP($K9,$A$1:$E$37,5,FALSE)","v":"75-4-LMAP"}]
[5,"FENELON STE MARIE","BAYLE","ALEXANDRE","75-4-FENP",null,32,{"$f":"VLOOKUP($G10,$A$1:$E$37,3,FALSE)","v":0},{"$f":"VLOOKUP($G10,$A$1:$E$37,4,FALSE)","v":0},{"$f":"VLOOKUP($G10,$A$1:$E$37,5,FALSE)","v":0},31,{"$f":"VLOOKUP($K10,$A$1:$E$37,3,FALSE)","v":0},{"$f":"VLOOKUP($K10,$A$1:$E$37,4,FALSE)","v":0},{"$f":"VLOOKUP($K10,$A$1:$E$37,5,FALSE)","v":0}]
[6,"COLLEGE LYCEE SAINT DOMINIQUE","OLIVIER","QUENTIN","92-4-SDN"]
[7,"AS ALMA","JUMERT","LOUIS","75-4-LMAP",null,"Poule 3",null,null,null,"Poule 4"]
[8,"AS ALMA","GIRAT","BASILE","75-4-LMAP",null,3,{"$f":"VLOOKUP($G13,$A$1:$E$37,3,FALSE)","v":"LEPELTIER"},{"$f":"VLOOKUP($G13,$A$1:$E$37,4,FALSE)","v":"CORENTIN"},{"$f":"VLOOKUP($G13,$A$1:$E$37,5,FALSE)","v":"92-4-SDN"},4,{"$f":"VLOOKUP($K13,$A$1:$E$37,3,FALSE)","v":"HEBRAUD"},{"$f":"VLOOKUP($K13,$A$1:$E$37,4,FALSE)","v":"CLEMENT"},{"$f":"VLOOKUP($K13,$A$1:$E$37,5,FALSE)","v":"92-4-SDN"}]
[9,"COLLEGE LYCEE SAINT DOMINIQUE","HUIBAN - NACCACHE","KENTIN","92-4-SDN",null,14,{"$f":"VLOOKUP($G14,$A$1:$E$37,3,FALSE)","v":"NELSON"},{"$f":"VLOOKUP($G14,$A$1:$E$37,4,FALSE)","v":"SAMUEL"},{"$f":"VLOOKUP($G14,$A$1:$E$37,5,FALSE)","v":"75-3-SUPA"},13,{"$f":"VLOOKUP($K14,$A$1:$E$37,3,FALSE)","v":"MATHIAN"},{"$f":"VLOOKUP($K14,$A$1:$E$37,4,FALSE)","v":"ALEC"},{"$f":"VLOOKUP($K14,$A$1:$E$37,5,FALSE)","v":"75-3-SUPA"}]
[10,"COLLEGE LYCEE SAINT DOMINIQUE","MOLINARO","NICOLA","92-4-SDN",null,19,{"$f":"VLOOKUP($G15,$A$1:$E$37,3,FALSE)","v":"BACOT"},{"$f":"VLOOKUP($G15,$A$1:$E$37,4,FALSE)","v":"PAUL EDOUARD"},{"$f":"VLOOKUP($G15,$A$1:$E$37,5,FALSE)","v":"75-4-LMAP"},20,{"$f":"VLOOKUP($K15,$A$1:$E$37,3,FALSE)","v":"DEHAIS"},{"$f":"VLOOKUP($K15,$A$1:$E$37,4,FALSE)","v":"AURELIEN"},{"$f":"VLOOKUP($K15,$A$1:$E$37,5,FALSE)","v":"75-4-LMAP"}]
[11,"AS ALMA","BARSOUM","GABRIEL","75-4-LMAP",null,30,{"$f":"VLOOKUP($G16,$A$1:$E$37,3,FALSE)","v":0},{"$f":"VLOOKUP($G16,$A$1:$E$37,4,FALSE)","v":0},{"$f":"VLOOKUP($G16,$A$1:$E$37,5,FALSE)","v":0},29,{"$f":"VLOOKUP($K16,$A$1:$E$37,3,FALSE)","v":0},{"$f":"VLOOKUP($K16,$A$1:$E$37,4,FALSE)","v":0},{"$f":"VLOOKUP($K16,$A$1:$E$37,5,FALSE)","v":0}]
[12,"COLLEGE LYCEE SAINT DOMINIQUE","CORNET","ACHILLE","92-4-SDN"]
[13,"SAINTE URSULE","MATHIAN","ALEC","75-3-SUPA",null,"Poule 5",null,null,null,"Poule 6"]
[14,"SAINTE URSULE","NELSON","SAMUEL","75-3-SUPA",null,5,{"$f":"VLOOKUP($G19,$A$1:$E$37,3,FALSE)","v":"BAYLE"},{"$f":"VLOOKUP($G19,$A$1:$E$37,4,FALSE)","v":"ALEXANDRE"},{"$f":"VLOOKUP($G19,$A$1:$E$37,5,FALSE)","v":"75-4-FENP"},6,{"$f":"VLOOKUP($K19,$A$1:$E$37,3,FALSE)","v":"OLIVIER"},{"$f":"VLOOKUP($K19,$A$1:$E$37,4,FALSE)","v":"QUENTIN"},{"$f":"VLOOKUP($K19,$A$1:$E$37,5,FALSE)","v":"92-4-SDN"}]
[15,"SAINTE URSULE","BLANCHET","MARIN","75-3-SUPA",null,12,{"$f":"VLOOKUP($G20,$A$1:$E$37,3,FALSE)","v":"CORNET"},{"$f":"VLOOKUP($G20,$A$1:$E$37,4,FALSE)","v":"ACHILLE"},{"$f":"VLOOKUP($G20,$A$1:$E$37,5,FALSE)","v":"92-4-SDN"},11,{"$f":"VLOOKUP($K20,$A$1:$E$37,3,FALSE)","v":"BARSOUM"},{"$f":"VLOOKUP($K20,$A$1:$E$37,4,FALSE)","v":"GABRIEL"},{"$f":"VLOOKUP($K20,$A$1:$E$37,5,FALSE)","v":"75-4-LMAP"}]
[16,"AS ALMA","MIQUEU","LOUIS","75-4-LMAP",null,21,{"$f":"VLOOKUP($G21,$A$1:$E$37,3,FALSE)","v":"CAPELLE"},{"$f":"VLOOKUP($G21,$A$1:$E$37,4,FALSE)","v":"TIMOTHEE"},{"$f":"VLOOKUP($G21,$A$1:$E$37,5,FALSE)","v":"75-3-SUPA"},22,{"$f":"VLOOKUP($K21,$A$1:$E$37,3,FALSE)","v":0},{"$f":"VLOOKUP($K21,$A$1:$E$37,4,FALSE)","v":0},{"$f":"VLOOKUP($K21,$A$1:$E$37,5,FALSE)","v":0}]
[17,"COLLEGE LYCEE SAINT DOMINIQUE","MANSOUR ABDALLA","IHAB","92-4-SDN",null,28,{"$f":"VLOOKUP($G22,$A$1:$E$37,3,FALSE)","v":"COULANGE"},{"$f":"VLOOKUP($G22,$A$1:$E$37,4,FALSE)","v":"ANATOLE"},{"$f":"VLOOKUP($G22,$A$1:$E$37,5,FALSE)","v":"75-4-LMAP"},27,{"$f":"VLOOKUP($K22,$A$1:$E$37,3,FALSE)","v":"JAFFREDOU-DELOBETTE"},{"$f":"VLOOKUP($K22,$A$1:$E$37,4,FALSE)","v":"ELOUAN"},{"$f":"VLOOKUP($K22,$A$1:$E$37,5,FALSE)","v":"75-3-SUPA"}]
[18,"AS ALMA","DIEHL","ALEXANDROS","75-4-LMAP"]
[19,"AS ALMA","BACOT","PAUL EDOUARD","75-4-LMAP",null,"Poule 7",null,null,null,"Poule 8"]
[20,"AS ALMA","DEHAIS","AURELIEN","75-4-LMAP",null,7,{"$f":"VLOOKUP($G25,$A$1:$E$37,3,FALSE)","v":"JUMERT"},{"$f":"VLOOKUP($G25,$A$1:$E$37,4,FALSE)","v":"LOUIS"},{"$f":"VLOOKUP($G25,$A$1:$E$37,5,FALSE)","v":"75-4-LMAP"},8,{"$f":"VLOOKUP($K25,$A$1:$E$37,3,FALSE)","v":"GIRAT"},{"$f":"VLOOKUP($K25,$A$1:$E$37,4,FALSE)","v":"BASILE"},{"$f":"VLOOKUP($K25,$A$1:$E$37,5,FALSE)","v":"75-4-LMAP"}]
[21,"SAINTE URSULE","CAPELLE","TIMOTHEE","75-3-SUPA",null,10,{"$f":"VLOOKUP($G26,$A$1:$E$37,3,FALSE)","v":"MOLINARO"},{"$f":"VLOOKUP($G26,$A$1:$E$37,4,FALSE)","v":"NICOLA"},{"$f":"VLOOKUP($G26,$A$1:$E$37,5,FALSE)","v":"92-4-SDN"},9,{"$f":"VLOOKUP($K26,$A$1:$E$37,3,FALSE)","v":"HUIBAN - NACCACHE"},{"$f":"VLOOKUP($K26,$A$1:$E$37,4,FALSE)","v":"KENTIN"},{"$f":"VLOOKUP($K26,$A$1:$E$37,5,FALSE)","v":"92-4-SDN"}]
[22,null,null,null,null,null,23,{"$f":"VLOOKUP($G27,$A$1:$E$37,3,FALSE)","v":"MICHEL"},{"$f":"VLOOKUP($G27,$A$1:$E$37,4,FALSE)","v":"JOSEPH"},{"$f":"VLOOKUP($G27,$A$1:$E$37,5,FALSE)","v":"75-4-LMAP"},24,{"$f":"VLOOKUP($K27,$A$1:$E$37,3,FALSE)","v":"LEPONT"},{"$f":"VLOOKUP($K27,$A$1:$E$37,4,FALSE)","v":"BASILE"},{"$f":"VLOOKUP($K27,$A$1:$E$37,5,FALSE)","v":"75-4-LMAP"}]
[23,"AS ALMA","MICHEL","JOSEPH","75-4-LMAP",null,26,{"$f":"VLOOKUP($G28,$A$1:$E$37,3,FALSE)","v":0},{"$f":"VLOOKUP($G28,$A$1:$E$37,4,FALSE)","v":0},{"$f":"VLOOKUP($G28,$A$1:$E$37,5,FALSE)","v":0},25,{"$f":"VLOOKUP($K28,$A$1:$E$37,3,FALSE)","v":0},{"$f":"VLOOKUP($K28,$A$1:$E$37,4,FALSE)","v":0},{"$f":"VLOOKUP($K28,$A$1:$E$37,5,FALSE)","v":0}]
[24,"AS ALMA","LEPONT","BASILE","75-4-LMAP"]
[25]
[26]
[27,"SAINTE URSULE","JAFFREDOU-DELOBETTE","ELOUAN","75-3-SUPA"]
[28,"AS ALMA","COULANGE","ANATOLE","75-4-LMAP"]
[29]
[30]
[31]
[32]

{"sheet":"Poule 1","index":1,"n_rows":24,"n_cols":7,"rows_kept":24,"cut":false,"hidden":false,"merged":[[0,0,0,2],[0,3,0,4],[22,0,22,1],[20,2,20,3],[23,4,23,5],[22,4,22,5],[13,0,13,6],[14,3,14,4],[23,2,23,3],[21,0,21,1],[23,0,23,1],[21,2,21,3],[19,4,19,5],[20,4,20,5],[7,0,7,6],[8,3,8,4],[8,0,8,2],[9,0,9,2],[10,0,10,2],[1,0,1,2],[1,3,1,6],[22,2,22,3],[20,0,20,1],[18,4,18,6],[11,0,11,2],[12,0,12,2],[14,0,14,2],[17,0,17,2],[18,0,18,3],[21,4,21,5],[19,0,19,1],[15,0,15,2],[16,0,16,2],[19,2,19,3]]}
[{"$f":"Engagés!C1","v":"TENNIS DE TABLE"},null,null,{"$f":"Engagés!C3","v":0}]
["POULE 1"]
[null,"NOM","Prénom","Sigle","Vict","Def","Classement"]
[1,{"$f":"VLOOKUP($A4,Engagés!$A$1:$E$380,3,FALSE)","v":"LE METTER"},{"$f":"VLOOKUP($A4,Engagés!$A$1:$E$380,4,FALSE)","v":"THEOPHILE"},{"$f":"VLOOKUP($A4,Engagés!$A$1:$E$380,5,FALSE)","v":"75-3-SUPA"},null,null,"1er"]
[16,{"$f":"VLOOKUP($A5,Engagés!$A$1:$E$380,3,FALSE)","v":"MIQUEU"},{"$f":"VLOOKUP($A5,Engagés!$A$1:$E$380,4,FALSE)","v":"LOUIS"},{"$f":"VLOOKUP($A5,Engagés!$A$1:$E$380,5,FALSE)","v":"75-4-LMAP"},null,null,"2ème"]
[17,{"$f":"VLOOKUP($A6,Engagés!$A$1:$E$380,3,FALSE)","v":"MANSOUR ABDALLA"},{"$f":"VLOOKUP($A6,Engagés!$A$1:$E$380,4,FALSE)","v":"IHAB"},{"$f":"VLOOKUP($A6,Engagés!$A$1:$E$380,5,FALSE)","v":"92-4-SDN"},null,null,"3ème"]
[32,{"$f":"VLOOKUP($A7,Engagés!$A$1:$E$380,3,FALSE)","v":0},{"$f":"VLOOKUP($A7,Engagés!$A$1:$E$380,4,FALSE)","v":0},{"$f":"VLOOKUP($A7,Engagés!$A$1:$E$380,5,FALSE)","v":0},null,null,"4ème"]
["Si poule de 4 joueurs alors…"]
["Déroulement",null,null,"Joueurs A contre Joueur B",null,"Vainqueur","Score"]
["Match 1",null,null,{"$f":"B4","v":"LE METTER"},{"$f":"B7","v":0}]
["Match 2",null,null,{"$f":"B5","v":"MIQUEU"},{"$f":"B6","v":"MANSOUR ABDALLA"}]
["Finale vainqueur Match 1 contre vainqueur Match 2",null,null,{"$f":"IF(F10=\"\",\"\",F10)","v":""},{"$f":"IF(F11=\"\",\"\",F11)","v":""}]
["Petite finale entre les deux perdants des matchs 1 et 2",null,null,{"$f":"IF(D12=\"\",\"\",IF(D12=D10,E10,D10))","v":""},{"$f":"IF(E12=\"\",\"\",IF(E12=D11,E11,D11))","v":""}]
["Si poule de 3 joueurs alors…"]
["Déroulement",null,null,"Joueurs A contre Joueur B",null,"Vainqueur","Score"]
["Match 1",null,null,{"$f":"B4","v":"LE METTER"},{"$f":"B6","v":"MANSOUR ABDALLA"},0]
["Match 2",null,null,{"$f":"B5","v":"MIQUEU"},{"$f":"B6","v":"MANSOUR ABDALLA"},0]
["Match 3",null,null,{"$f":"B4","v":"LE METTER"},{"$f":"B5","v":"MIQUEU"},0]
["CLASSEMENT",null,null,null,{"$f":"A2","v":"POULE 1"}]
[null,null,"NOM",null,"PRENOM",null,"SIGLE"]
["1er",null,{"$f":"IF($G$4=\"1er\", $B$4,IF($G$5=\"1er\",$B$5,IF($G$6=\"1er\",$B$6,IF($G$7=\"1er\",$B$7,\"\"))))","v":"LE METTER"},null,{"$f":"IF($G$4=\"1er\", $C$4,IF($G$5=\"1er\",$C$5,IF($G$6=\"1er\",$C$6,IF($G$7=\"1er\",$C$7,\"\"))))","v":"THEOPHILE"},null,{"$f":"IF($G$4=\"1er\", $D$4,IF($G$5=\"1er\",$D$5,IF($G$6=\"1er\",$D$6,IF($G$7=\"1er\",$D$7,\"\"))))","v":"75-3-SUPA"}]
["2ème",null,{"$f":"IF($G$4=\"2ème\", $B$4,IF($G$5=\"2ème\",$B$5,IF($G$6=\"2ème\",$B$6,IF($G$7=\"2ème\",$B$7,\"\"))))","v":"MIQUEU"},null,{"$f":"IF($G$4=\"2ème\", $C$4,IF($G$5=\"2ème\",$C$5,IF($G$6=\"2ème\",$C$6,IF($G$7=\"2ème\",$C$7,\"\"))))","v":"LOUIS"},null,{"$f":"IF($G$4=\"2ème\", $D$4,IF($G$5=\"2ème\",$D$5,IF($G$6=\"2ème\",$D$6,IF($G$7=\"2ème\",$D$7,\"\"))))","v":"75-4-LMAP"}]
["3ème",null,{"$f":"IF($G$4=\"3ème\", $B$4,IF($G$5=\"3ème\",$B$5,IF($G$6=\"3ème\",$B$6,IF($G$7=\"3ème\",$B$7,\"\"))))","v":"MANSOUR ABDALLA"},null,{"$f":"IF($G$4=\"3ème\", $C$4,IF($G$5=\"3ème\",$C$5,IF($G$6=\"3ème\",$C$6,IF($G$7=\"3ème\",$C$7,\"\"))))","v":"IHAB"},null,{"$f":"IF($G$4=\"3ème\", $D$4,IF($G$5=\"3ème\",$D$5,IF($G$6=\"3ème\",$D$6,IF($G$7=\"3ème\",$D$7,\"\"))))","v":"92-4-SDN"}]
["4ème",null,{"$f":"IF($G$4=\"4ème\", $B$4,IF($G$5=\"4ème\",$B$5,IF($G$6=\"4ème\",$B$6,IF($G$7=\"4ème\",$B$7,\"\"))))","v":0},null,{"$f":"IF($G$4=\"4ème\", $C$4,IF($G$5=\"4ème\",$C$5,IF($G$6=\"4ème\",$C$6,IF($G$7=\"4ème\",$C$7,\"\"))))","v":0},null,{"$f":"IF($G$4=\"4ème\", $D$4,IF($G$5=\"4ème\",$D$5,IF($G$6=\"4ème\",$D$6,IF($G$7=\"4ème\",$D$7,\"\"))))","v":0}]

{"sheet":"Poule 2","index":2,"n_rows":24,"n_cols":7,"rows_kept":24,"cut":false,"hidden":false,"merged":[[0,3,0,4],[15,0,15,2],[16,0,16,2],[1,0,1,2],[1,3,1,6],[7,0,7,6],[8,0,8,2],[8,3,8,4],[9,0,9,2],[10,0,10,2],[11,0,11,2],[12,0,12,2],[13,0,13,6],[14,0,14,2],[14,3,14,4],[0,0,0,2],[17,0,17,2],[18,0,18,3],[18,4,18,6],[20,0,20,1],[20,2,20,3],[20,4,20,5],[19,0,19,1],[19,2,19,3],[19,4,19,5],[23,0,23,1],[23,2,23,3],[23,4,23,5],[21,0,21,1],[21,2,21,3],[21,4,21,5],[22,0,22,1],[22,2,22,3],[22,4,22,5]]}
[{"$f":"Engagés!C1","v":"TENNIS DE TABLE"},null,null,{"$f":"Engagés!C3","v":0}]
["POULE 2"]
[null,"NOM","Prénom","Sigle","Vict","Def","Classement"]
[2,{"$f":"VLOOKUP($A4,Engagés!$A$1:$E$380,3,FALSE)","v":"BOUTEMY"},{"$f":"VLOOKUP($A4,Engagés!$A$1:$E$380,4,FALSE)","v":"MALO"},{"$f":"VLOOKUP($A4,Engagés!$A$1:$E$380,5,FALSE)","v":"92-4-SDN"},null,null,"1er"]
[15,{"$f":"VLOOKUP($A5,Engagés!$A$1:$E$380,3,FALSE)","v":"BLANCHET"},{"$f":"VLOOKUP($A5,Engagés!$A$1:$E$380,4,FALSE)","v":"MARIN"},{"$f":"VLOOKUP($A5,Engagés!$A$1:$E$380,5,FALSE)","v":"75-3-SUPA"},null,null,"3ème"]
[18,{"$f":"VLOOKUP($A6,Engagés!$A$1:$E$380,3,FALSE)","v":"DIEHL"},{"$f":"VLOOKUP($A6,Engagés!$A$1:$E$380,4,FALSE)","v":"ALEXANDROS"},{"$f":"VLOOKUP($A6,Engagés!$A$1:$E$380,5,FALSE)","v":"75-4-LMAP"},null,null,"2ème"]
[31,{"$f":"VLOOKUP($A7,Engagés!$A$1:$E$380,3,FALSE)","v":0},{"$f":"VLOOKUP($A7,Engagés!$A$1:$E$380,4,FALSE)","v":0},{"$f":"VLOOKUP($A7,Engagés!$A$1:$E$380,5,FALSE)","v":0},null,null,"4ème"]
["Si poule de 4 joueurs alors…"]
["Déroulement",null,null,"Joueurs A contre Joueur B",null,"Vainqueur","Score"]
["Match 1",null,null,{"$f":"B4","v":"BOUTEMY"},{"$f":"B7","v":0}]
["Match 2",null,null,{"$f":"B5","v":"BLANCHET"},{"$f":"B6","v":"DIEHL"}]
["Finale vainqueur Match 1 contre vainqueur Match 2",null,null,{"$f":"IF(F10=\"\",\"\",F10)","v":""},{"$f":"IF(F11=\"\",\"\",F11)","v":""}]
["Petite finale entre les deux perdants des matchs 1 et 2",null,null,{"$f":"IF(D12=\"\",\"\",IF(D12=D10,E10,D10))","v":""},{"$f":"IF(E12=\"\",\"\",IF(E12=D11,E11,D11))","v":""}]
["Si poule de 3 joueurs alors…"]
["Déroulement",null,null,"Joueurs A contre Joueur B",null,"Vainqueur","Score"]
["Match 1",null,null,{"$f":"B4","v":"BOUTEMY"},{"$f":"B6","v":"DIEHL"},0]
["Match 2",null,null,{"$f":"B5","v":"BLANCHET"},{"$f":"B6","v":"DIEHL"},0]
["Match 3",null,null,{"$f":"B4","v":"BOUTEMY"},{"$f":"B5","v":"BLANCHET"},0]
["CLASSEMENT",null,null,null,{"$f":"A2","v":"POULE 2"}]
[null,null,"NOM",null,"PRENOM",null,"SIGLE"]
["1er",null,{"$f":"IF($G$4=\"1er\", $B$4,IF($G$5=\"1er\",$B$5,IF($G$6=\"1er\",$B$6,IF($G$7=\"1er\",$B$7,\"\"))))","v":"BOUTEMY"},null,{"$f":"IF($G$4=\"1er\", $C$4,IF($G$5=\"1er\",$C$5,IF($G$6=\"1er\",$C$6,IF($G$7=\"1er\",$C$7,\"\"))))","v":"MALO"},null,{"$f":"IF($G$4=\"1er\", $D$4,IF($G$5=\"1er\",$D$5,IF($G$6=\"1er\",$D$6,IF($G$7=\"1er\",$D$7,\"\"))))","v":"92-4-SDN"}]
["2ème",null,{"$f":"IF($G$4=\"2ème\", $B$4,IF($G$5=\"2ème\",$B$5,IF($G$6=\"2ème\",$B$6,IF($G$7=\"2ème\",$B$7,\"\"))))","v":"DIEHL"},null,{"$f":"IF($G$4=\"2ème\", $C$4,IF($G$5=\"2ème\",$C$5,IF($G$6=\"2ème\",$C$6,IF($G$7=\"2ème\",$C$7,\"\"))))","v":"ALEXANDROS"},null,{"$f":"IF($G$4=\"2ème\", $D$4,IF($G$5=\"2ème\",$D$5,IF($G$6=\"2ème\",$D$6,IF($G$7=\"2ème\",$D$7,\"\"))))","v":"75-4-LMAP"}]
["3ème",null,{"$f":"IF($G$4=\"3ème\", $B$4,IF($G$5=\"3ème\",$B$5,IF($G$6=\"3ème\",$B$6,IF($G$7=\"3ème\",$B$7,\"\"))))","v":"BLANCHET"},null,{"$f":"IF($G$4=\"3ème\", $C$4,IF($G$5=\"3ème\",$C$5,IF($G$6=\"3ème\",$C$6,IF($G$7=\"3ème\",$C$7,\"\"))))","v":"MARIN"},null,{"$f":"IF($G$4=\"3ème\", $D$4,IF($G$5=\"3ème\",$D$5,IF($G$6=\"3ème\",$D$6,IF($G$7=\"3ème\",$D$7,\"\"))))","v":"75-3-SUPA"}]
["4ème",null,{"$f":"IF($G$4=\"4ème\", $B$4,IF($G$5=\"4ème\",$B$5,IF($G$6=\"4ème\",$B$6,IF($G$7=\"4ème\",$B$7,\"\"))))","v":0},null,{"$f":"IF($G$4=\"4ème\", $C$4,IF($G$5=\"4ème\",$C$5,IF($G$6=\"4ème\",$C$6,IF($G$7=\"4ème\",$C$7,\"\"))))","v":0},null,{"$f":"IF($G$4=\"4ème\", $D$4,IF($G$5=\"4ème\",$D$5,IF($G$6=\"4ème\",$D$6,IF($G$7=\"4ème\",$D$7,\"\"))))","v":0}]

{"sheet":"Poule 3","index":3,"n_rows":24,"n_cols":7,"rows_kept":24,"cut":false,"hidden":false,"merged":[[0,3,0,4],[15,0,15,2],[16,0,16,2],[1,0,1,2],[1,3,1,6],[7,0,7,6],[8,0,8,2],[8,3,8,4],[9,0,9,2],[10,0,10,2],[11,0,11,2],[12,0,12,2],[13,0,13,6],[14,0,14,2],[14,3,14,4],[0,0,0,2],[17,0,17,2],[18,0,18,3],[18,4,18,6],[20,0,20,1],[20,2,20,3],[20,4,20,5],[19,0,19,1],[19,2,19,3],[19,4,19,5],[23,0,23,1],[23,2,23,3],[23,4,23,5],[21,0,21,1],[21,2,21,3],[21,4,21,5],[22,0,22,1],[22,2,22,3],[22,4,22,5]]}
[{"$f":"Engagés!C1","v":"TENNIS DE TABLE"},null,null,{"$f":"Engagés!C3","v":0}]
["POULE 3"]
[null,"NOM","Prénom","Sigle","Vict","Def","Classement"]
[3,{"$f":"VLOOKUP($A4,Engagés!$A$1:$E$380,3,FALSE)","v":"LEPELTIER"},{"$f":"VLOOKUP($A4,Engagés!$A$1:$E$380,4,FALSE)","v":"CORENTIN"},{"$f":"VLOOKUP($A4,Engagés!$A$1:$E$380,5,FALSE)","v":"92-4-SDN"},null,null,"1er"]
[14,{"$f":"VLOOKUP($A5,Engagés!$A$1:$E$380,3,FALSE)","v":"NELSON"},{"$f":"VLOOKUP($A5,Engagés!$A$1:$E$380,4,FALSE)","v":"SAMUEL"},{"$f":"VLOOKUP($A5,Engagés!$A$1:$E$380,5,FALSE)","v":"75-3-SUPA"},null,null,"3ème"]
[19,{"$f":"VLOOKUP($A6,Engagés!$A$1:$E$380,3,FALSE)","v":"BACOT"},{"$f":"VLOOKUP($A6,Engagés!$A$1:$E$380,4,FALSE)","v":"PAUL EDOUARD"},{"$f":"VLOOKUP($A6,Engagés!$A$1:$E$380,5,FALSE)","v":"75-4-LMAP"},null,null,"2ème"]
[30,{"$f":"VLOOKUP($A7,Engagés!$A$1:$E$380,3,FALSE)","v":0},{"$f":"VLOOKUP($A7,Engagés!$A$1:$E$380,4,FALSE)","v":0},{"$f":"VLOOKUP($A7,Engagés!$A$1:$E$380,5,FALSE)","v":0},null,null,"4ème"]
["Si poule de 4 joueurs alors…"]
["Déroulement",null,null,"Joueurs A contre Joueur B",null,"Vainqueur","Score"]
["Match 1",null,null,{"$f":"B4","v":"LEPELTIER"},{"$f":"B7","v":0}]
["Match 2",null,null,{"$f":"B5","v":"NELSON"},{"$f":"B6","v":"BACOT"}]
["Finale vainqueur Match 1 contre vainqueur Match 2",null,null,{"$f":"IF(F10=\"\",\"\",F10)","v":""},{"$f":"IF(F11=\"\",\"\",F11)","v":""}]
["Petite finale entre les deux perdants des matchs 1 et 2",null,null,{"$f":"IF(D12=\"\",\"\",IF(D12=D10,E10,D10))","v":""},{"$f":"IF(E12=\"\",\"\",IF(E12=D11,E11,D11))","v":""}]
["Si poule de 3 joueurs alors…"]
["Déroulement",null,null,"Joueurs A contre Joueur B",null,"Vainqueur","Score"]
["Match 1",null,null,{"$f":"B4","v":"LEPELTIER"},{"$f":"B6","v":"BACOT"},0]
["Match 2",null,null,{"$f":"B5","v":"NELSON"},{"$f":"B6","v":"BACOT"},0]
["Match 3",null,null,{"$f":"B4","v":"LEPELTIER"},{"$f":"B5","v":"NELSON"},0]
["CLASSEMENT",null,null,null,{"$f":"A2","v":"POULE 3"}]
[null,null,"NOM",null,"PRENOM",null,"SIGLE"]
["1er",null,{"$f":"IF($G$4=\"1er\", $B$4,IF($G$5=\"1er\",$B$5,IF($G$6=\"1er\",$B$6,IF($G$7=\"1er\",$B$7,\"\"))))","v":"LEPELTIER"},null,{"$f":"IF($G$4=\"1er\", $C$4,IF($G$5=\"1er\",$C$5,IF($G$6=\"1er\",$C$6,IF($G$7=\"1er\",$C$7,\"\"))))","v":"CORENTIN"},null,{"$f":"IF($G$4=\"1er\", $D$4,IF($G$5=\"1er\",$D$5,IF($G$6=\"1er\",$D$6,IF($G$7=\"1er\",$D$7,\"\"))))","v":"92-4-SDN"}]
["2ème",null,{"$f":"IF($G$4=\"2ème\", $B$4,IF($G$5=\"2ème\",$B$5,IF($G$6=\"2ème\",$B$6,IF($G$7=\"2ème\",$B$7,\"\"))))","v":"BACOT"},null,{"$f":"IF($G$4=\"2ème\", $C$4,IF($G$5=\"2ème\",$C$5,IF($G$6=\"2ème\",$C$6,IF($G$7=\"2ème\",$C$7,\"\"))))","v":"PAUL EDOUARD"},null,{"$f":"IF($G$4=\"2ème\", $D$4,IF($G$5=\"2ème\",$D$5,IF($G$6=\"2ème\",$D$6,IF($G$7=\"2ème\",$D$7,\"\"))))","v":"75-4-LMAP"}]
["3ème",null,{"$f":"IF($G$4=\"3ème\", $B$4,IF($G$5=\"3ème\",$B$5,IF($G$6=\"3ème\",$B$6,IF($G$7=\"3ème\",$B$7,\"\"))))","v":"NELSON"},null,{"$f":"IF($G$4=\"3ème\", $C$4,IF($G$5=\"3ème\",$C$5,IF($G$6=\"3ème\",$C$6,IF($G$7=\"3ème\",$C$7,\"\"))))","v":"SAMUEL"},null,{"$f":"IF($G$4=\"3ème\", $D$4,IF($G$5=\"3ème\",$D$5,IF($G$6=\"3ème\",$D$6,IF($G$7=\"3ème\",$D$7,\"\"))))","v":"75-3-SUPA"}]
["4ème",null,{"$f":"IF($G$4=\"4ème\", $B$4,IF($G$5=\"4ème\",$B$5,IF($G$6=\"4ème\",$B$6,IF($G$7=\"4ème\",$B$7,\"\"))))","v":0},null,{"$f":"IF($G$4=\"4ème\", $C$4,IF($G$5=\"4ème\",$C$5,IF($G$6=\"4ème\",$C$6,IF($G$7=\"4ème\",$C$7,\"\"))))","v":0},null,{"$f":"IF($G$4=\"4ème\", $D$4,IF($G$5=\"4ème\",$D$5,IF($G$6=\"4ème\",$D$6,IF($G$7=\"4ème\",$D$7,\"\"))))","v":0}]

{"sheet":"Poule 4","index":4,"n_rows":24,"n_cols":7,"rows_kept":24,"cut":false,"hidden":false,"merged":[[0,3,0,4],[15,0,15,2],[16,0,16,2],[1,0,1,2],[1,3,1,6],[7,0,7,6],[8,0,8,2],[8,3,8,4],[9,0,9,2],[10,0,10,2],[11,0,11,2],[12,0,12,2],[13,0,13,6],[14,0,14,2],[14,3,14,4],[0,0,0,2],[17,0,17,2],[18,0,18,3],[18,4,18,6],[20,0,20,1],[20,2,20,3],[20,4,20,5],[19,0,19,1],[19,2,19,3],[19,4,19,5],[23,0,23,1],[23,2,23,3],[23,4,23,5],[21,0,21,1],[21,2,21,3],[21,4,21,5],[22,0,22,1],[22,2,22,3],[22,4,22,5]]}
[{"$f":"Engagés!C1","v":"TENNIS DE TABLE"},null,null,{"$f":"Engagés!C3","v":0}]
["POULE 4"]
[null,"NOM","Prénom","Sigle","Vict","Def","Classement"]
[4,{"$f":"VLOOKUP($A4,Engagés!$A$1:$E$380,3,FALSE)","v":"HEBRAUD"},{"$f":"VLOOKUP($A4,Engagés!$A$1:$E$380,4,FALSE)","v":"CLEMENT"},{"$f":"VLOOKUP($A4,Engagés!$A$1:$E$380,5,FALSE)","v":"92-4-SDN"},null,null,"1er"]
[13,{"$f":"VLOOKUP($A5,Engagés!$A$1:$E$380,3,FALSE)","v":"MATHIAN"},{"$f":"VLOOKUP($A5,Engagés!$A$1:$E$380,4,FALSE)","v":"ALEC"},{"$f":"VLOOKUP($A5,Engagés!$A$1:$E$380,5,FALSE)","v":"75-3-SUPA"},null,null,"3ème"]
[20,{"$f":"VLOOKUP($A6,Engagés!$A$1:$E$380,3,FALSE)","v":"DEHAIS"},{"$f":"VLOOKUP($A6,Engagés!$A$1:$E$380,4,FALSE)","v":"AURELIEN"},{"$f":"VLOOKUP($A6,Engagés!$A$1:$E$380,5,FALSE)","v":"75-4-LMAP"},null,null,"2ème"]
[29,{"$f":"VLOOKUP($A7,Engagés!$A$1:$E$380,3,FALSE)","v":0},{"$f":"VLOOKUP($A7,Engagés!$A$1:$E$380,4,FALSE)","v":0},{"$f":"VLOOKUP($A7,Engagés!$A$1:$E$380,5,FALSE)","v":0},null,null,"4ème"]
["Si poule de 4 joueurs alors…"]
["Déroulement",null,null,"Joueurs A contre Joueur B",null,"Vainqueur","Score"]
["Match 1",null,null,{"$f":"B4","v":"HEBRAUD"},{"$f":"B7","v":0},0]
["Match 2",null,null,{"$f":"B5","v":"MATHIAN"},{"$f":"B6","v":"DEHAIS"},0]
["Finale vainqueur Match 1 contre vainqueur Match 2",null,null,{"$f":"IF(F10=\"\",\"\",F10)","v":0},{"$f":"IF(F11=\"\",\"\",F11)","v":0},0]
["Petite finale entre les deux perdants des matchs 1 et 2",null,null,null,null,0]
["Si poule de 3 joueurs alors…"]
["Déroulement",null,null,"Joueurs A contre Joueur B",null,"Vainqueur","Score"]
["Match 1",null,null,{"$f":"B4","v":"HEBRAUD"},{"$f":"B6","v":"DEHAIS"}]
["Match 2",null,null,{"$f":"B5","v":"MATHIAN"},{"$f":"B6","v":"DEHAIS"}]
["Match 3",null,null,{"$f":"B4","v":"HEBRAUD"},{"$f":"B5","v":"MATHIAN"}]
["CLASSEMENT",null,null,null,{"$f":"A2","v":"POULE 4"}]
[null,null,"NOM",null,"PRENOM",null,"SIGLE"]
["1er",null,{"$f":"IF($G$4=\"1er\", $B$4,IF($G$5=\"1er\",$B$5,IF($G$6=\"1er\",$B$6,IF($G$7=\"1er\",$B$7,\"\"))))","v":"HEBRAUD"},null,{"$f":"IF($G$4=\"1er\", $C$4,IF($G$5=\"1er\",$C$5,IF($G$6=\"1er\",$C$6,IF($G$7=\"1er\",$C$7,\"\"))))","v":"CLEMENT"},null,{"$f":"IF($G$4=\"1er\", $D$4,IF($G$5=\"1er\",$D$5,IF($G$6=\"1er\",$D$6,IF($G$7=\"1er\",$D$7,\"\"))))","v":"92-4-SDN"}]
["2ème",null,{"$f":"IF($G$4=\"2ème\", $B$4,IF($G$5=\"2ème\",$B$5,IF($G$6=\"2ème\",$B$6,IF($G$7=\"2ème\",$B$7,\"\"))))","v":"DEHAIS"},null,{"$f":"IF($G$4=\"2ème\", $C$4,IF($G$5=\"2ème\",$C$5,IF($G$6=\"2ème\",$C$6,IF($G$7=\"2ème\",$C$7,\"\"))))","v":"AURELIEN"},null,{"$f":"IF($G$4=\"2ème\", $D$4,IF($G$5=\"2ème\",$D$5,IF($G$6=\"2ème\",$D$6,IF($G$7=\"2ème\",$D$7,\"\"))))","v":"75-4-LMAP"}]
["3ème",null,{"$f":"IF($G$4=\"3ème\", $B$4,IF($G$5=\"3ème\",$B$5,IF($G$6=\"3ème\",$B$6,IF($G$7=\"3ème\",$B$7,\"\"))))","v":"MATHIAN"},null,{"$f":"IF($G$4=\"3ème\", $C$4,IF($G$5=\"3ème\",$C$5,IF($G$6=\"3ème\",$C$6,IF($G$7=\"3ème\",$C$7,\"\"))))","v":"ALEC"},null,{"$f":"IF($G$4=\"3ème\", $D$4,IF($G$5=\"3ème\",$D$5,IF($G$6=\"3ème\",$D$6,IF($G$7=\"3ème\",$D$7,\"\"))))","v":"75-3-SUPA"}]
["4ème",null,{"$f":"IF($G$4=\"4ème\", $B$4,IF($G$5=\"4ème\",$B$5,IF($G$6=\"4ème\",$B$6,IF($G$7=\"4ème\",$B$7,\"\"))))","v":0},null,{"$f":"IF($G$4=\"4ème\", $C$4,IF($G$5=\"4ème\",$C$5,IF($G$6=\"4ème\",$C$6,IF($G$7=\"4ème\",$C$7,\"\"))))","v":0},null,{"$f":"IF($G$4=\"4ème\", $D$4,IF($G$5=\"4ème\",$D$5,IF($G$6=\"4ème\",$D$6,IF($G$7=\"4ème\",$D$7,\"\"))))","v":0}]

{"sheet":"Poule 5","index":5,"n_rows":24,"n_cols":7,"rows_kept":24,"cut":false,"hidden":false,"merged":[[12,0,12,2],[13,0,13,6],[0,0,0,2],[0,3,0,4],[10,0,10,2],[11,0,11,2],[1,0,1,2],[1,3,1,6],[7,0,7,6],[8,0,8,2],[8,3,8,4],[9,0,9,2],[20,0,20,1],[20,2,20,3],[20,4,20,5],[14,0,14,2],[14,3,14,4],[15,0,15,2],[18,4,18,6],[19,0,19,1],[19,2,19,3],[19,4,19,5],[16,0,16,2],[17,0,17,2],[18,0,18,3],[23,0,23,1],[23,2,23,3],[23,4,23,5],[21,0,21,1],[21,2,21,3],[21,4,21,5],[22,0,22,1],[22,2,22,3],[22,4,22,5]]}
[{"$f":"Engagés!C1","v":"TENNIS DE TABLE"},null,null,{"$f":"Engagés!C3","v":0}]
["POULE 5"]
[null,"NOM","Prénom","Sigle","Vict","Def","Classement"]
[5,{"$f":"VLOOKUP($A4,Engagés!$A$1:$E$380,3,FALSE)","v":"BAYLE"},{"$f":"VLOOKUP($A4,Engagés!$A$1:$E$380,4,FALSE)","v":"ALEXANDRE"},{"$f":"VLOOKUP($A4,Engagés!$A$1:$E$380,5,FALSE)","v":"75-4-FENP"},null,null,"1er"]
[12,{"$f":"VLOOKUP($A5,Engagés!$A$1:$E$380,3,FALSE)","v":"CORNET"},{"$f":"VLOOKUP($A5,Engagés!$A$1:$E$380,4,FALSE)","v":"ACHILLE"},{"$f":"VLOOKUP($A5,Engagés!$A$1:$E$380,5,FALSE)","v":"92-4-SDN"},null,null,"2ème"]
[21,{"$f":"VLOOKUP($A6,Engagés!$A$1:$E$380,3,FALSE)","v":"CAPELLE"},{"$f":"VLOOKUP($A6,Engagés!$A$1:$E$380,4,FALSE)","v":"TIMOTHEE"},{"$f":"VLOOKUP($A6,Engagés!$A$1:$E$380,5,FALSE)","v":"75-3-SUPA"},null,null,"4ème"]
[28,{"$f":"VLOOKUP($A7,Engagés!$A$1:$E$380,3,FALSE)","v":"COULANGE"},{"$f":"VLOOKUP($A7,Engagés!$A$1:$E$380,4,FALSE)","v":"ANATOLE"},{"$f":"VLOOKUP($A7,Engagés!$A$1:$E$380,5,FALSE)","v":"75-4-LMAP"},null,null,"3ème"]
["Si poule de 4 joueurs alors…"]
["Déroulement",null,null,"Joueurs A contre Joueur B",null,"Vainqueur","Score"]
["Match 1",null,null,{"$f":"B4","v":"BAYLE"},{"$f":"B7","v":"COULANGE"},0]
["Match 2",null,null,{"$f":"B5","v":"CORNET"},{"$f":"B6","v":"CAPELLE"},0]
["Finale vainqueur Match 1 contre vainqueur Match 2",null,null,{"$f":"IF(F10=\"\",\"\",F10)","v":0},{"$f":"IF(F11=\"\",\"\",F11)","v":0},0]
["Petite finale entre les deux perdants des matchs 1 et 2",null,null,null,null,0]
["Si poule de 3 joueurs alors…"]
["Déroulement",null,null,"Joueurs A contre Joueur B",null,"Vainqueur","Score"]
["Match 1",null,null,{"$f":"B4","v":"BAYLE"},{"$f":"B6","v":"CAPELLE"}]
["Match 2",null,null,{"$f":"B5","v":"CORNET"},{"$f":"B6","v":"CAPELLE"}]
["Match 3",null,null,{"$f":"B4","v":"BAYLE"},{"$f":"B5","v":"CORNET"}]
["CLASSEMENT",null,null,null,{"$f":"A2","v":"POULE 5"}]
[null,null,"NOM",null,"PRENOM",null,"SIGLE"]
["1er",null,{"$f":"IF($G$4=\"1er\", $B$4,IF($G$5=\"1er\",$B$5,IF($G$6=\"1er\",$B$6,IF($G$7=\"1er\",$B$7,\"\"))))","v":"BAYLE"},null,{"$f":"IF($G$4=\"1er\", $C$4,IF($G$5=\"1er\",$C$5,IF($G$6=\"1er\",$C$6,IF($G$7=\"1er\",$C$7,\"\"))))","v":"ALEXANDRE"},null,{"$f":"IF($G$4=\"1er\", $D$4,IF($G$5=\"1er\",$D$5,IF($G$6=\"1er\",$D$6,IF($G$7=\"1er\",$D$7,\"\"))))","v":"75-4-FENP"}]
["2ème",null,{"$f":"IF($G$4=\"2ème\", $B$4,IF($G$5=\"2ème\",$B$5,IF($G$6=\"2ème\",$B$6,IF($G$7=\"2ème\",$B$7,\"\"))))","v":"CORNET"},null,{"$f":"IF($G$4=\"2ème\", $C$4,IF($G$5=\"2ème\",$C$5,IF($G$6=\"2ème\",$C$6,IF($G$7=\"2ème\",$C$7,\"\"))))","v":"ACHILLE"},null,{"$f":"IF($G$4=\"2ème\", $D$4,IF($G$5=\"2ème\",$D$5,IF($G$6=\"2ème\",$D$6,IF($G$7=\"2ème\",$D$7,\"\"))))","v":"92-4-SDN"}]
["3ème",null,{"$f":"IF($G$4=\"3ème\", $B$4,IF($G$5=\"3ème\",$B$5,IF($G$6=\"3ème\",$B$6,IF($G$7=\"3ème\",$B$7,\"\"))))","v":"COULANGE"},null,{"$f":"IF($G$4=\"3ème\", $C$4,IF($G$5=\"3ème\",$C$5,IF($G$6=\"3ème\",$C$6,IF($G$7=\"3ème\",$C$7,\"\"))))","v":"ANATOLE"},null,{"$f":"IF($G$4=\"3ème\", $D$4,IF($G$5=\"3ème\",$D$5,IF($G$6=\"3ème\",$D$6,IF($G$7=\"3ème\",$D$7,\"\"))))","v":"75-4-LMAP"}]
["4ème",null,{"$f":"IF($G$4=\"4ème\", $B$4,IF($G$5=\"4ème\",$B$5,IF($G$6=\"4ème\",$B$6,IF($G$7=\"4ème\",$B$7,\"\"))))","v":"CAPELLE"},null,{"$f":"IF($G$4=\"4ème\", $C$4,IF($G$5=\"4ème\",$C$5,IF($G$6=\"4ème\",$C$6,IF($G$7=\"4ème\",$C$7,\"\"))))","v":"TIMOTHEE"},null,{"$f":"IF($G$4=\"4ème\", $D$4,IF($G$5=\"4ème\",$D$5,IF($G$6=\"4ème\",$D$6,IF($G$7=\"4ème\",$D$7,\"\"))))","v":"75-3-SUPA"}]

{"sheet":"Poule 6","index":6,"n_rows":24,"n_cols":7,"rows_kept":24,"cut":false,"hidden":false,"merged":[[12,0,12,2],[13,0,13,6],[0,0,0,2],[0,3,0,4],[10,0,10,2],[11,0,11,2],[1,0,1,2],[1,3,1,6],[7,0,7,6],[8,0,8,2],[8,3,8,4],[9,0,9,2],[20,0,20,1],[20,2,20,3],[20,4,20,5],[14,0,14,2],[14,3,14,4],[15,0,15,2],[18,4,18,6],[19,0,19,1],[19,2,19,3],[19,4,19,5],[16,0,16,2],[17,0,17,2],[18,0,18,3],[23,0,23,1],[23,2,23,3],[23,4,23,5],[21,0,21,1],[21,2,21,3],[21,4,21,5],[22,0,22,1],[22,2,22,3],[22,4,22,5]]}
[{"$f":"Engagés!C1","v":"TENNIS DE TABLE"},null,null,{"$f":"Engagés!C3","v":0}]
["POULE 6"]
[null,"NOM","Prénom","Sigle","Vict","Def","Classement"]
[6,{"$f":"VLOOKUP($A4,Engagés!$A$1:$E$380,3,FALSE)","v":"OLIVIER"},{"$f":"VLOOKUP($A4,Engagés!$A$1:$E$380,4,FALSE)","v":"QUENTIN"},{"$f":"VLOOKUP($A4,Engagés!$A$1:$E$380,5,FALSE)","v":"92-4-SDN"},null,null,"2ème"]
[11,{"$f":"VLOOKUP($A5,Engagés!$A$1:$E$380,3,FALSE)","v":"BARSOUM"},{"$f":"VLOOKUP($A5,Engagés!$A$1:$E$380,4,FALSE)","v":"GABRIEL"},{"$f":"VLOOKUP($A5,Engagés!$A$1:$E$380,5,FALSE)","v":"75-4-LMAP"},null,null,"1er"]
[22,{"$f":"VLOOKUP($A6,Engagés!$A$1:$E$380,3,FALSE)","v":0},{"$f":"VLOOKUP($A6,Engagés!$A$1:$E$380,4,FALSE)","v":0},{"$f":"VLOOKUP($A6,Engagés!$A$1:$E$380,5,FALSE)","v":0},null,null,"4ème"]
[27,{"$f":"VLOOKUP($A7,Engagés!$A$1:$E$380,3,FALSE)","v":"JAFFREDOU-DELOBETTE"},{"$f":"VLOOKUP($A7,Engagés!$A$1:$E$380,4,FALSE)","v":"ELOUAN"},{"$f":"VLOOKUP($A7,Engagés!$A$1:$E$380,5,FALSE)","v":"75-3-SUPA"},null,null,"3ème"]
["Si poule de 4 joueurs alors…"]
["Déroulement",null,null,"Joueurs A contre Joueur B",null,"Vainqueur","Score"]
["Match 1",null,null,{"$f":"B4","v":"OLIVIER"},{"$f":"B7","v":"JAFFREDOU-DELOBETTE"},0]
["Match 2",null,null,{"$f":"B5","v":"BARSOUM"},{"$f":"B6","v":0},0]
["Finale vainqueur Match 1 contre vainqueur Match 2",null,null,{"$f":"IF(F10=\"\",\"\",F10)","v":0},{"$f":"IF(F11=\"\",\"\",F11)","v":0},0]
["Petite finale entre les deux perdants des matchs 1 et 2",null,null,null,null,0]
["Si poule de 3 joueurs alors…"]
["Déroulement",null,null,"Joueurs A contre Joueur B",null,"Vainqueur","Score"]
["Match 1",null,null,{"$f":"B4","v":"OLIVIER"},{"$f":"B6","v":0}]
["Match 2",null,null,{"$f":"B5","v":"BARSOUM"},{"$f":"B6","v":0}]
["Match 3",null,null,{"$f":"B4","v":"OLIVIER"},{"$f":"B5","v":"BARSOUM"}]
["CLASSEMENT",null,null,null,{"$f":"A2","v":"POULE 6"}]
[null,null,"NOM",null,"PRENOM",null,"SIGLE"]
["1er",null,{"$f":"IF($G$4=\"1er\", $B$4,IF($G$5=\"1er\",$B$5,IF($G$6=\"1er\",$B$6,IF($G$7=\"1er\",$B$7,\"\"))))","v":"BARSOUM"},null,{"$f":"IF($G$4=\"1er\", $C$4,IF($G$5=\"1er\",$C$5,IF($G$6=\"1er\",$C$6,IF($G$7=\"1er\",$C$7,\"\"))))","v":"GABRIEL"},null,{"$f":"IF($G$4=\"1er\", $D$4,IF($G$5=\"1er\",$D$5,IF($G$6=\"1er\",$D$6,IF($G$7=\"1er\",$D$7,\"\"))))","v":"75-4-LMAP"}]
["2ème",null,{"$f":"IF($G$4=\"2ème\", $B$4,IF($G$5=\"2ème\",$B$5,IF($G$6=\"2ème\",$B$6,IF($G$7=\"2ème\",$B$7,\"\"))))","v":"OLIVIER"},null,{"$f":"IF($G$4=\"2ème\", $C$4,IF($G$5=\"2ème\",$C$5,IF($G$6=\"2ème\",$C$6,IF($G$7=\"2ème\",$C$7,\"\"))))","v":"QUENTIN"},null,{"$f":"IF($G$4=\"2ème\", $D$4,IF($G$5=\"2ème\",$D$5,IF($G$6=\"2ème\",$D$6,IF($G$7=\"2ème\",$D$7,\"\"))))","v":"92-4-SDN"}]
["3ème",null,{"$f":"IF($G$4=\"3ème\", $B$4,IF($G$5=\"3ème\",$B$5,IF($G$6=\"3ème\",$B$6,IF($G$7=\"3ème\",$B$7,\"\"))))","v":"JAFFREDOU-DELOBETTE"},null,{"$f":"IF($G$4=\"3ème\", $C$4,IF($G$5=\"3ème\",$C$5,IF($G$6=\"3ème\",$C$6,IF($G$7=\"3ème\",$C$7,\"\"))))","v":"ELOUAN"},null,{"$f":"IF($G$4=\"3ème\", $D$4,IF($G$5=\"3ème\",$D$5,IF($G$6=\"3ème\",$D$6,IF($G$7=\"3ème\",$D$7,\"\"))))","v":"75-3-SUPA"}]
["4ème",null,{"$f":"IF($G$4=\"4ème\", $B$4,IF($G$5=\"4ème\",$B$5,IF($G$6=\"4ème\",$B$6,IF($G$7=\"4ème\",$B$7,\"\"))))","v":0},null,{"$f":"IF($G$4=\"4ème\", $C$4,IF($G$5=\"4ème\",$C$5,IF($G$6=\"4ème\",$C$6,IF($G$7=\"4ème\",$C$7,\"\"))))","v":0},null,{"$f":"IF($G$4=\"4ème\", $D$4,IF($G$5=\"4ème\",$D$5,IF($G$6=\"4ème\",$D$6,IF($G$7=\"4ème\",$D$7,\"\"))))","v":0}]

{"sheet":"Poule 7","index":7,"n_rows":24,"n_cols":7,"rows_kept":24,"cut":false,"hidden":false,"merged":[[12,0,12,2],[13,0,13,6],[0,0,0,2],[0,3,0,4],[10,0,10,2],[11,0,11,2],[1,0,1,2],[1,3,1,6],[7,0,7,6],[8,0,8,2],[8,3,8,4],[9,0,9,2],[20,0,20,1],[20,2,20,3],[20,4,20,5],[14,0,14,2],[14,3,14,4],[15,0,15,2],[18,4,18,6],[19,0,19,1],[19,2,19,3],[19,4,19,5],[16,0,16,2],[17,0,17,2],[18,0,18,3],[23,0,23,1],[23,2,23,3],[23,4,23,5],[21,0,21,1],[21,2,21,3],[21,4,21,5],[22,0,22,1],[22,2,22,3],[22,4,22,5]]}
[{"$f":"Engagés!C1","v":"TENNIS DE TABLE"},null,null,{"$f":"Engagés!C3","v":0}]
["POULE 7"]
[null,"NOM","Prénom","Sigle","Vict","Def","Classement"]
[7,{"$f":"VLOOKUP($A4,Engagés!$A$1:$E$380,3,FALSE)","v":"JUMERT"},{"$f":"VLOOKUP($A4,Engagés!$A$1:$E$380,4,FALSE)","v":"LOUIS"},{"$f":"VLOOKUP($A4,Engagés!$A$1:$E$380,5,FALSE)","v":"75-4-LMAP"},null,null,"1er"]
[10,{"$f":"VLOOKUP($A5,Engagés!$A$1:$E$380,3,FALSE)","v":"MOLINARO"},{"$f":"VLOOKUP($A5,Engagés!$A$1:$E$380,4,FALSE)","v":"NICOLA"},{"$f":"VLOOKUP($A5,Engagés!$A$1:$E$380,5,FALSE)","v":"92-4-SDN"},null,null,"2ème"]
[23,{"$f":"VLOOKUP($A6,Engagés!$A$1:$E$380,3,FALSE)","v":"MICHEL"},{"$f":"VLOOKUP($A6,Engagés!$A$1:$E$380,4,FALSE)","v":"JOSEPH"},{"$f":"VLOOKUP($A6,Engagés!$A$1:$E$380,5,FALSE)","v":"75-4-LMAP"},null,null,"3ème"]
[26,{"$f":"VLOOKUP($A7,Engagés!$A$1:$E$380,3,FALSE)","v":0},{"$f":"VLOOKUP($A7,Engagés!$A$1:$E$380,4,FALSE)","v":0},{"$f":"VLOOKUP($A7,Engagés!$A$1:$E$380,5,FALSE)","v":0},null,null,"4ème"]
["Si poule de 4 joueurs alors…"]
["Déroulement",null,null,"Joueurs A contre Joueur B",null,"Vainqueur","Score"]
["Match 1",null,null,{"$f":"B4","v":"JUMERT"},{"$f":"B7","v":0},0]
["Match 2",null,null,{"$f":"B5","v":"MOLINARO"},{"$f":"B6","v":"MICHEL"},0]
["Finale vainqueur Match 1 contre vainqueur Match 2",null,null,{"$f":"IF(F10=\"\",\"\",F10)","v":0},{"$f":"IF(F11=\"\",\"\",F11)","v":0},0]
["Petite finale entre les deux perdants des matchs 1 et 2",null,null,null,null,0]
["Si poule de 3 joueurs alors…"]
["Déroulement",null,null,"Joueurs A contre Joueur B",null,"Vainqueur","Score"]
["Match 1",null,null,{"$f":"B4","v":"JUMERT"},{"$f":"B6","v":"MICHEL"}]
["Match 2",null,null,{"$f":"B5","v":"MOLINARO"},{"$f":"B6","v":"MICHEL"}]
["Match 3",null,null,{"$f":"B4","v":"JUMERT"},{"$f":"B5","v":"MOLINARO"}]
["CLASSEMENT",null,null,null,{"$f":"A2","v":"POULE 7"}]
[null,null,"NOM",null,"PRENOM",null,"SIGLE"]
["1er",null,{"$f":"IF($G$4=\"1er\", $B$4,IF($G$5=\"1er\",$B$5,IF($G$6=\"1er\",$B$6,IF($G$7=\"1er\",$B$7,\"\"))))","v":"JUMERT"},null,{"$f":"IF($G$4=\"1er\", $C$4,IF($G$5=\"1er\",$C$5,IF($G$6=\"1er\",$C$6,IF($G$7=\"1er\",$C$7,\"\"))))","v":"LOUIS"},null,{"$f":"IF($G$4=\"1er\", $D$4,IF($G$5=\"1er\",$D$5,IF($G$6=\"1er\",$D$6,IF($G$7=\"1er\",$D$7,\"\"))))","v":"75-4-LMAP"}]
["2ème",null,{"$f":"IF($G$4=\"2ème\", $B$4,IF($G$5=\"2ème\",$B$5,IF($G$6=\"2ème\",$B$6,IF($G$7=\"2ème\",$B$7,\"\"))))","v":"MOLINARO"},null,{"$f":"IF($G$4=\"2ème\", $C$4,IF($G$5=\"2ème\",$C$5,IF($G$6=\"2ème\",$C$6,IF($G$7=\"2ème\",$C$7,\"\"))))","v":"NICOLA"},null,{"$f":"IF($G$4=\"2ème\", $D$4,IF($G$5=\"2ème\",$D$5,IF($G$6=\"2ème\",$D$6,IF($G$7=\"2ème\",$D$7,\"\"))))","v":"92-4-SDN"}]
["3ème",null,{"$f":"IF($G$4=\"3ème\", $B$4,IF($G$5=\"3ème\",$B$5,IF($G$6=\"3ème\",$B$6,IF($G$7=\"3ème\",$B$7,\"\"))))","v":"MICHEL"},null,{"$f":"IF($G$4=\"3ème\", $C$4,IF($G$5=\"3ème\",$C$5,IF($G$6=\"3ème\",$C$6,IF($G$7=\"3ème\",$C$7,\"\"))))","v":"JOSEPH"},null,{"$f":"IF($G$4=\"3ème\", $D$4,IF($G$5=\"3ème\",$D$5,IF($G$6=\"3ème\",$D$6,IF($G$7=\"3ème\",$D$7,\"\"))))","v":"75-4-LMAP"}]
["4ème",null,{"$f":"IF($G$4=\"4ème\", $B$4,IF($G$5=\"4ème\",$B$5,IF($G$6=\"4ème\",$B$6,IF($G$7=\"4ème\",$B$7,\"\"))))","v":0},null,{"$f":"IF($G$4=\"4ème\", $C$4,IF($G$5=\"4ème\",$C$5,IF($G$6=\"4ème\",$C$6,IF($G$7=\"4ème\",$C$7,\"\"))))","v":0},null,{"$f":"IF($G$4=\"4ème\", $D$4,IF($G$5=\"4ème\",$D$5,IF($G$6=\"4ème\",$D$6,IF($G$7=\"4ème\",$D$7,\"\"))))","v":0}]

{"sheet":"Poule 8","index":8,"n_rows":24,"n_cols":7,"rows_kept":24,"cut":false,"hidden":false,"merged":[[12,0,12,2],[13,0,13,6],[0,0,0,2],[0,3,0,4],[10,0,10,2],[11,0,11,2],[1,0,1,2],[1,3,1,6],[7,0,7,6],[8,0,8,2],[8,3,8,4],[9,0,9,2],[20,0,20,1],[20,2,20,3],[20,4,20,5],[14,0,14,2],[14,3,14,4],[15,0,15,2],[18,4,18,6],[19,0,19,1],[19,2,19,3],[19,4,19,5],[16,0,16,2],[17,0,17,2],[18,0,18,3],[23,0,23,1],[23,2,23,3],[23,4,23,5],[21,0,21,1],[21,2,21,3],[21,4,21,5],[22,0,22,1],[22,2,22,3],[22,4,22,5]]}
[{"$f":"Engagés!C1","v":"TENNIS DE TABLE"},null,null,{"$f":"Engagés!C3","v":0}]
["POULE 8"]
[null,"NOM","Prénom","Sigle","Vict","Def","Classement"]
[8,{"$f":"VLOOKUP($A4,Engagés!$A$1:$E$380,3,FALSE)","v":"GIRAT"},{"$f":"VLOOKUP($A4,Engagés!$A$1:$E$380,4,FALSE)","v":"BASILE"},{"$f":"VLOOKUP($A4,Engagés!$A$1:$E$380,5,FALSE)","v":"75-4-LMAP"},null,null,"1er"]
[9,{"$f":"VLOOKUP($A5,Engagés!$A$1:$E$380,3,FALSE)","v":"HUIBAN - NACCACHE"},{"$f":"VLOOKUP($A5,Engagés!$A$1:$E$380,4,FALSE)","v":"KENTIN"},{"$f":"VLOOKUP($A5,Engagés!$A$1:$E$380,5,FALSE)","v":"92-4-SDN"},null,null,"3ème"]
[24,{"$f":"VLOOKUP($A6,Engagés!$A$1:$E$380,3,FALSE)","v":"LEPONT"},{"$f":"VLOOKUP($A6,Engagés!$A$1:$E$380,4,FALSE)","v":"BASILE"},{"$f":"VLOOKUP($A6,Engagés!$A$1:$E$380,5,FALSE)","v":"75-4-LMAP"},null,null,"2ème"]
[25,{"$f":"VLOOKUP($A7,Engagés!$A$1:$E$380,3,FALSE)","v":0},{"$f":"VLOOKUP($A7,Engagés!$A$1:$E$380,4,FALSE)","v":0},{"$f":"VLOOKUP($A7,Engagés!$A$1:$E$380,5,FALSE)","v":0},null,null,"4ème"]
["Si poule de 4 joueurs alors…"]
["Déroulement",null,null,"Joueurs A contre Joueur B",null,"Vainqueur","Score"]
["Match 1",null,null,{"$f":"B4","v":"GIRAT"},{"$f":"B7","v":0},0]
["Match 2",null,null,{"$f":"B5","v":"HUIBAN - NACCACHE"},{"$f":"B6","v":"LEPONT"},0]
["Finale vainqueur Match 1 contre vainqueur Match 2",null,null,{"$f":"IF(F10=\"\",\"\",F10)","v":0},{"$f":"IF(F11=\"\",\"\",F11)","v":0},0]
["Petite finale entre les deux perdants des matchs 1 et 2",null,null,null,null,0]
["Si poule de 3 joueurs alors…"]
["Déroulement",null,null,"Joueurs A contre Joueur B",null,"Vainqueur","Score"]
["Match 1",null,null,{"$f":"B4","v":"GIRAT"},{"$f":"B6","v":"LEPONT"}]
["Match 2",null,null,{"$f":"B5","v":"HUIBAN - NACCACHE"},{"$f":"B6","v":"LEPONT"}]
["Match 3",null,null,{"$f":"B4","v":"GIRAT"},{"$f":"B5","v":"HUIBAN - NACCACHE"}]
["CLASSEMENT",null,null,null,{"$f":"A2","v":"POULE 8"}]
[null,null,"NOM",null,"PRENOM",null,"SIGLE"]
["1er",null,{"$f":"IF($G$4=\"1er\", $B$4,IF($G$5=\"1er\",$B$5,IF($G$6=\"1er\",$B$6,IF($G$7=\"1er\",$B$7,\"\"))))","v":"GIRAT"},null,{"$f":"IF($G$4=\"1er\", $C$4,IF($G$5=\"1er\",$C$5,IF($G$6=\"1er\",$C$6,IF($G$7=\"1er\",$C$7,\"\"))))","v":"BASILE"},null,{"$f":"IF($G$4=\"1er\", $D$4,IF($G$5=\"1er\",$D$5,IF($G$6=\"1er\",$D$6,IF($G$7=\"1er\",$D$7,\"\"))))","v":"75-4-LMAP"}]
["2ème",null,{"$f":"IF($G$4=\"2ème\", $B$4,IF($G$5=\"2ème\",$B$5,IF($G$6=\"2ème\",$B$6,IF($G$7=\"2ème\",$B$7,\"\"))))","v":"LEPONT"},null,{"$f":"IF($G$4=\"2ème\", $C$4,IF($G$5=\"2ème\",$C$5,IF($G$6=\"2ème\",$C$6,IF($G$7=\"2ème\",$C$7,\"\"))))","v":"BASILE"},null,{"$f":"IF($G$4=\"2ème\", $D$4,IF($G$5=\"2ème\",$D$5,IF($G$6=\"2ème\",$D$6,IF($G$7=\"2ème\",$D$7,\"\"))))","v":"75-4-LMAP"}]
["3ème",null,{"$f":"IF($G$4=\"3ème\", $B$4,IF($G$5=\"3ème\",$B$5,IF($G$6=\"3ème\",$B$6,IF($G$7=\"3ème\",$B$7,\"\"))))","v":"HUIBAN - NACCACHE"},null,{"$f":"IF($G$4=\"3ème\", $C$4,IF($G$5=\"3ème\",$C$5,IF($G$6=\"3ème\",$C$6,IF($G$7=\"3ème\",$C$7,\"\"))))","v":"KENTIN"},null,{"$f":"IF($G$4=\"3ème\", $D$4,IF($G$5=\"3ème\",$D$5,IF($G$6=\"3ème\",$D$6,IF($G$7=\"3ème\",$D$7,\"\"))))","v":"92-4-SDN"}]
["4ème",null,{"$f":"IF($G$4=\"4ème\", $B$4,IF($G$5=\"4ème\",$B$5,IF($G$6=\"4ème\",$B$6,IF($G$7=\"4ème\",$B$7,\"\"))))","v":0},null,{"$f":"IF($G$4=\"4ème\", $C$4,IF($G$5=\"4ème\",$C$5,IF($G$6=\"4ème\",$C$6,IF($G$7=\"4ème\",$C$7,\"\"))))","v":0},null,{"$f":"IF($G$4=\"4ème\", $D$4,IF($G$5=\"4ème\",$D$5,IF($G$6=\"4ème\",$D$6,IF($G$7=\"4ème\",$D$7,\"\"))))","v":0}]

{"sheet":"Résultats de poule","index":9,"n_rows":10,"n_cols":16,"rows_kept":10,"cut":false,"hidden":false,"merged":[[0,0,0,3],[0,4,0,7],[0,8,0,11],[0,12,0,15],[5,0,5,3],[5,4,5,7],[5,8,5,11],[5,12,5,15]]}
["Poule 1",null,null,null,"Poule 2",null,null,null,"Poule 3",null,null,null,"Poule 4"]
["1er",{"$f":"'Poule 1'!$C21","v":"LE METTER"},{"$f":"'Poule 1'!$E21","v":"THEOPHILE"},{"$f":"'Poule 1'!$G21","v":"75-3-SUPA"},"1er",{"$f":"'Poule 2'!$C21","v":"BOUTEMY"},{"$f":"'Poule 2'!$E21","v":"MALO"},{"$f":"'Poule 2'!$G21","v":"92-4-SDN"},"1er",{"$f":"'Poule 3'!$C21","v":"LEPELTIER"},{"$f":"'Poule 3'!$E21","v":"CORENTIN"},{"$f":"'Poule 3'!$G21","v":"92-4-SDN"},"1er",{"$f":"'Poule 4'!$C21","v":"HEBRAUD"},{"$f":"'Poule 4'!$E21","v":"CLEMENT"},{"$f":"'Poule 4'!$G21","v":"92-4-SDN"}]
["2ème",{"$f":"'Poule 1'!$C22","v":"MIQUEU"},{"$f":"'Poule 1'!$E22","v":"LOUIS"},{"$f":"'Poule 1'!$G22","v":"75-4-LMAP"},"2ème",{"$f":"'Poule 2'!$C22","v":"DIEHL"},{"$f":"'Poule 2'!$E22","v":"ALEXANDROS"},{"$f":"'Poule 2'!$G22","v":"75-4-LMAP"},"2ème",{"$f":"'Poule 3'!$C22","v":"BACOT"},{"$f":"'Poule 3'!$E22","v":"PAUL EDOUARD"},{"$f":"'Poule 3'!$G22","v":"75-4-LMAP"},"2ème",{"$f":"'Poule 4'!$C22","v":"DEHAIS"},{"$f":"'Poule 4'!$E22","v":"AURELIEN"},{"$f":"'Poule 4'!$G22","v":"75-4-LMAP"}]
["3ème",{"$f":"'Poule 1'!$C23","v":"MANSOUR ABDALLA"},{"$f":"'Poule 1'!$E23","v":"IHAB"},{"$f":"'Poule 1'!$G23","v":"92-4-SDN"},"3ème",{"$f":"'Poule 2'!$C23","v":"BLANCHET"},{"$f":"'Poule 2'!$E23","v":"MARIN"},{"$f":"'Poule 2'!$G23","v":"75-3-SUPA"},"3ème",{"$f":"'Poule 3'!$C23","v":"NELSON"},{"$f":"'Poule 3'!$E23","v":"SAMUEL"},{"$f":"'Poule 3'!$G23","v":"75-3-SUPA"},"3ème",{"$f":"'Poule 4'!$C23","v":"MATHIAN"},{"$f":"'Poule 4'!$E23","v":"ALEC"},{"$f":"'Poule 4'!$G23","v":"75-3-SUPA"}]
["4ème",{"$f":"'Poule 1'!$C24","v":0},{"$f":"'Poule 1'!$E24","v":0},{"$f":"'Poule 1'!$G24","v":0},"4ème",{"$f":"'Poule 2'!$C24","v":0},{"$f":"'Poule 2'!$E24","v":0},{"$f":"'Poule 2'!$G24","v":0},"4ème",{"$f":"'Poule 3'!$C24","v":0},{"$f":"'Poule 3'!$E24","v":0},{"$f":"'Poule 3'!$G24","v":0},"4ème",{"$f":"'Poule 4'!$C24","v":0},{"$f":"'Poule 4'!$E24","v":0},{"$f":"'Poule 4'!$G24","v":0}]
["Poule 5",null,null,null,"Poule 6",null,null,null,"Poule 7",null,null,null,"Poule 8"]
["1er",{"$f":"'Poule 5'!$C21","v":"BAYLE"},{"$f":"'Poule 5'!$E21","v":"ALEXANDRE"},{"$f":"'Poule 5'!$G21","v":"75-4-FENP"},"1er",{"$f":"'Poule 6'!$C21","v":"BARSOUM"},{"$f":"'Poule 6'!$E21","v":"GABRIEL"},{"$f":"'Poule 6'!$G21","v":"75-4-LMAP"},"1er",{"$f":"'Poule 7'!$C21","v":"JUMERT"},{"$f":"'Poule 7'!$E21","v":"LOUIS"},{"$f":"'Poule 7'!$G21","v":"75-4-LMAP"},"1er",{"$f":"'Poule 8'!$C21","v":"GIRAT"},{"$f":"'Poule 8'!$E21","v":"BASILE"},{"$f":"'Poule 8'!$G21","v":"75-4-LMAP"}]
["2ème",{"$f":"'Poule 5'!$C22","v":"CORNET"},{"$f":"'Poule 5'!$E22","v":"ACHILLE"},{"$f":"'Poule 5'!$G22","v":"92-4-SDN"},"2ème",{"$f":"'Poule 6'!$C22","v":"OLIVIER"},{"$f":"'Poule 6'!$E22","v":"QUENTIN"},{"$f":"'Poule 6'!$G22","v":"92-4-SDN"},"2ème",{"$f":"'Poule 7'!$C22","v":"MOLINARO"},{"$f":"'Poule 7'!$E22","v":"NICOLA"},{"$f":"'Poule 7'!$G22","v":"92-4-SDN"},"2ème",{"$f":"'Poule 8'!$C22","v":"LEPONT"},{"$f":"'Poule 8'!$E22","v":"BASILE"},{"$f":"'Poule 8'!$G22","v":"75-4-LMAP"}]
["3ème",{"$f":"'Poule 5'!$C23","v":"COULANGE"},{"$f":"'Poule 5'!$E23","v":"ANATOLE"},{"$f":"'Poule 5'!$G23","v":"75-4-LMAP"},"3ème",{"$f":"'Poule 6'!$C23","v":"JAFFREDOU-DELOBETTE"},{"$f":"'Poule 6'!$E23","v":"ELOUAN"},{"$f":"'Poule 6'!$G23","v":"75-3-SUPA"},"3ème",{"$f":"'Poule 7'!$C23","v":"MICHEL"},{"$f":"'Poule 7'!$E23","v":"JOSEPH"},{"$f":"'Poule 7'!$G23","v":"75-4-LMAP"},"3ème",{"$f":"'Poule 8'!$C23","v":"HUIBAN - NACCACHE"},{"$f":"'Poule 8'!$E23","v":"KENTIN"},{"$f":"'Poule 8'!$G23","v":"92-4-SDN"}]
["4ème",{"$f":"'Poule 5'!$C24","v":"CAPELLE"},{"$f":"'Poule 5'!$E24","v":"TIMOTHEE"},{"$f":"'Poule 5'!$G24","v":"75-3-SUPA"},"4ème",{"$f":"'Poule 6'!$C24","v":0},{"$f":"'Poule 6'!$E24","v":0},{"$f":"'Poule 6'!$G24","v":0},"4ème",{"$f":"'Poule 7'!$C24","v":0},{"$f":"'Poule 7'!$E24","v":0},{"$f":"'Poule 7'!$G24","v":0},"4ème",{"$f":"'Poule 8'!$C24","v":0},{"$f":"'Poule 8'!$E24","v":0},{"$f":"'Poule 8'!$G24","v":0}]

{"sheet":"Tableau","index":10,"n_rows":92,"n_cols":34,"rows_kept":92,"cut":false,"hidden":false,"merged":[[8,10,8,11],[50,20,50,21],[16,10,16,11],[23,10,23,11],[33,10,33,11],[40,10,40,11],[48,10,48,11],[10,20,10,21],[30,32,30,33],[0,16,0,19],[15,29,15,30],[0,0,0,14],[31,29,31,30],[10,1,10,2],[1,4,1,5],[0,20,0,33],[16,26,16,27],[23,23,23,24],[3,20,3,21],[18,20,18,21],[29,4,29,5],[25,20,25,21],[1,10,1,11],[9,23,9,24],[55,10,55,11],[33,4,33,5],[42,1,42,2],[59,29,59,30],[55,23,55,24],[47,29,47,30],[35,20,35,21],[42,20,42,21],[41,23,41,24],[48,26,48,27],[57,20,57,21]]}
["REPECHAGES ET MATCHS DE CLASSEMENT",null,null,null,null,null,null,null,null,null,null,null,null,null,null,null,"1er tour de tableau",null,null,null,"TABLEAU PRINCIPAL"]
[]
[]
[null,null,null,null,null,null,null,null,null,null,null,null,null,null,null,null,"1er poule 1",{"$f":"'Résultats de poule'!B2","v":"LE METTER"},{"$f":"'Résultats de poule'!D2","v":"75-3-SUPA"},"V","1/8 de finale 1"]
[null,null,null,null,null,null,null,null,null,null,null,null,null,{"$f":"IF(T4=\"\",\"\",IF(T4=\"p\",S4,S5))","v":0},{"$f":"IF(T4=\"\",\"\",IF(T4=\"p\",R4,R5))","v":0},null,"4ème poule 8",{"$f":"'Résultats de poule'!N10","v":0},{"$f":"'Résultats de poule'!P10","v":0},"P",{"$f":"IF(T4=\"\",\"\",IF(T4=\"v\",R4,R5))","v":"LE METTER"},{"$f":"IF(T4=\"\",\"\",IF(T4=\"v\",S4,S5))","v":"75-3-SUPA"},"V"]
[null,null,null,null,null,null,null,null,null,null,{"$f":"IF(M5=\"\",\"\",IF(M5=\"v\",N5,N7))","v":""},{"$f":"IF(M5=\"\",\"\",IF(M5=\"v\",O5,O7))","v":""},null,null,null,null,null,null,null,null,null,null,null,{"$f":"IF(W5=\"\",\"\",IF(W5=\"v\",U5,U7))","v":"LE METTER"},{"$f":"IF(W5=\"\",\"\",IF(W5=\"v\",V5,V7))","v":"75-3-SUPA"},"V"]
[null,null,null,null,null,null,null,null,null,null,null,null,null,{"$f":"IF(T7=\"\",\"\",IF(T7=\"p\",S7,S8))","v":"75-3-SUPA"},{"$f":"IF(T7=\"\",\"\",IF(T7=\"p\",R7,R8))","v":"NELSON"},null,"3ème poule 3",{"$f":"'Résultats de poule'!J4","v":"NELSON"},{"$f":"'Résultats de poule'!L4","v":"75-3-SUPA"},"P",{"$f":"IF(T7=\"\",\"\",IF(T7=\"v\",R7,R8))","v":"OLIVIER"},{"$f":"IF(T7=\"\",\"\",IF(T7=\"v\",S7,S8))","v":"92-4-SDN"},"P"]
[null,null,null,null,null,null,null,null,null,null,null,null,null,null,null,null,"2ème poule 6",{"$f":"'Résultats de poule'!F8","v":"OLIVIER"},{"$f":"'Résultats de poule'!H8","v":"92-4-SDN"},"V"]
[null,null,null,null,null,null,null,{"$f":"IF(J6=\"\",\"\",IF(J6=\"v\",K6,K13))","v":""},{"$f":"IF(J6=\"\",\"\",IF(J6=\"v\",L6,L13))","v":""}]
[null,null,null,null,null,null,null,null,null,null,null,null,null,null,null,null,null,null,null,null,null,null,null,"1/4 finale 1",null,null,{"$f":"IF(Z6=\"\",\"\",IF(Z6=\"v\",X6,X13))","v":"LE METTER"},{"$f":"IF(Z6=\"\",\"\",IF(Z6=\"v\",Y6,Y13))","v":"75-3-SUPA"},"V"]
[null,null,null,null,null,null,null,null,null,null,null,null,null,null,null,null,"2ème poule 4",{"$f":"'Résultats de poule'!N3","v":"DEHAIS"},{"$f":"'Résultats de poule'!P3","v":"75-4-LMAP"},"V","1/8 de finale 2"]
[null,null,null,null,null,null,null,null,null,null,null,null,null,{"$f":"IF(T11=\"\",\"\",IF(T11=\"p\",S11,S12))","v":"75-4-LMAP"},{"$f":"IF(T11=\"\",\"\",IF(T11=\"p\",R11,R12))","v":"COULANGE"},null,"3ème poule 5",{"$f":"'Résultats de poule'!B9","v":"COULANGE"},{"$f":"'Résultats de poule'!D9","v":"75-4-LMAP"},"P",{"$f":"IF(T11=\"\",\"\",IF(T11=\"v\",R11,R12))","v":"DEHAIS"},{"$f":"IF(T11=\"\",\"\",IF(T11=\"v\",S11,S12))","v":"75-4-LMAP"},"P"]
[null,null,null,null,null,null,null,null,null,null,{"$f":"IF(M12=\"\",\"\",IF(M12=\"v\",N12,N14))","v":""},{"$f":"IF(M12=\"\",\"\",IF(M12=\"v\",O12,O14))","v":""},null,null,null,null,null,null,null,null,null,null,null,{"$f":"IF(W12=\"\",\"\",IF(W12=\"v\",U12,U14))","v":"JUMERT"},{"$f":"IF(W12=\"\",\"\",IF(W12=\"v\",V12,V14))","v":"75-4-LMAP"},"P"]
[null,null,null,null,null,null,null,null,null,null,null,null,null,{"$f":"IF(T14=\"\",\"\",IF(T14=\"p\",S14,S15))","v":0},{"$f":"IF(T14=\"\",\"\",IF(T14=\"p\",R14,R15))","v":0},null,"4ème poule 2",{"$f":"'Résultats de poule'!F5","v":0},{"$f":"'Résultats de poule'!H5","v":0},"P",{"$f":"IF(T14=\"\",\"\",IF(T14=\"v\",R14,R15))","v":"JUMERT"},{"$f":"IF(T14=\"\",\"\",IF(T14=\"v\",S14,S15))","v":"75-4-LMAP"},"V"]
[null,null,null,null,null,null,null,null,null,null,null,null,null,null,null,null,"1er poule 7",{"$f":"'Résultats de poule'!J7","v":"JUMERT"},{"$f":"'Résultats de poule'!L7","v":"75-4-LMAP"},"V"]
[null,null,null,null,{"$f":"IF(G9=\"\",\"\",IF(G9=\"v\",H9,H24))","v":""},{"$f":"IF(G9=\"\",\"\",IF(G9=\"v\",I9,I24))","v":""}]
[null,null,null,null,null,null,null,null,null,null,null,null,null,null,null,null,null,null,null,null,null,null,null,null,null,null,"1/2 finale A",null,null,{"$f":"IF(AC10=\"\",\"\",IF(AC10=\"v\",AA10,AA24))","v":"LE METTER"},{"$f":"IF(AC10=\"\",\"\",IF(AC10=\"v\",AB10,AB24))","v":"75-3-SUPA"},"V"]
[]
[null,null,null,null,null,null,null,null,null,null,null,null,null,null,null,null,"1er poule 6",{"$f":"'Résultats de poule'!F7","v":"BARSOUM"},{"$f":"'Résultats de poule'!H7","v":"75-4-LMAP"},"V","1/8 de finale 3"]
[null,null,null,null,null,null,null,null,null,null,null,null,null,{"$f":"IF(T19=\"\",\"\",IF(T19=\"p\",S19,S20))","v":0},{"$f":"IF(T19=\"\",\"\",IF(T19=\"p\",R19,R20))","v":0},null,"4ème poule 3",{"$f":"'Résultats de poule'!J5","v":0},{"$f":"'Résultats de poule'!L5","v":0},"P",{"$f":"IF(T19=\"\",\"\",IF(T19=\"v\",R19,R20))","v":"BARSOUM"},{"$f":"IF(T19=\"\",\"\",IF(T19=\"v\",S19,S20))","v":"75-4-LMAP"},"P"]
[null,null,null,null,null,null,null,null,null,null,{"$f":"IF(M20=\"\",\"\",IF(M20=\"v\",N20,N22))","v":""},{"$f":"IF(M20=\"\",\"\",IF(M20=\"v\",O20,O22))","v":""},null,null,null,null,null,null,null,null,null,null,null,{"$f":"IF(W20=\"\",\"\",IF(W20=\"v\",U20,U22))","v":"MIQUEU"},{"$f":"IF(W20=\"\",\"\",IF(W20=\"v\",V20,V22))","v":"75-4-LMAP"},"P"]
[null,null,null,null,null,null,null,null,null,null,null,null,null,{"$f":"IF(T22=\"\",\"\",IF(T22=\"p\",S22,S23))","v":"92-4-SDN"},{"$f":"IF(T22=\"\",\"\",IF(T22=\"p\",R22,R23))","v":"HUIBAN - NACCACHE"},null,"3ème poule 8",{"$f":"'Résultats de poule'!N9","v":"HUIBAN - NACCACHE"},{"$f":"'Résultats de poule'!P9","v":"92-4-SDN"},"P",{"$f":"IF(T22=\"\",\"\",IF(T22=\"v\",R22,R23))","v":"MIQUEU"},{"$f":"IF(T22=\"\",\"\",IF(T22=\"v\",S22,S23))","v":"75-4-LMAP"},"V"]
[null,null,null,null,null,null,null,null,null,null,null,null,null,null,null,null,"2ème poule 1",{"$f":"'Résultats de poule'!B3","v":"MIQUEU"},{"$f":"'Résultats de poule'!D3","v":"75-4-LMAP"},"V"]
[null,null,null,null,null,null,null,{"$f":"IF(J21=\"\",\"\",IF(J21=\"v\",K21,K28))","v":""},{"$f":"IF(J21=\"\",\"\",IF(J21=\"v\",L21,L28))","v":""},null,null,null,null,null,null,null,null,null,null,null,null,null,null,"1/4 finale 2",null,null,{"$f":"IF(Z21=\"\",\"\",IF(Z21=\"v\",X21,X28))","v":"HEBRAUD"},{"$f":"IF(Z21=\"\",\"\",IF(Z21=\"v\",Y21,Y28))","v":"92-4-SDN"},"P"]
[]
[null,null,null,null,null,null,null,null,null,null,null,null,null,null,null,null,"2ème poule 7",{"$f":"'Résultats de poule'!J8","v":"MOLINARO"},{"$f":"'Résultats de poule'!L8","v":"92-4-SDN"},"V","1/8 de finale 4"]
[null,null,null,null,null,null,null,null,null,null,null,null,null,{"$f":"IF(T26=\"\",\"\",IF(T26=\"p\",S26,S27))","v":"75-3-SUPA"},{"$f":"IF(T26=\"\",\"\",IF(T26=\"p\",R26,R27))","v":"BLANCHET"},null,"3ème poule 2",{"$f":"'Résultats de poule'!F4","v":"BLANCHET"},{"$f":"'Résultats de poule'!H4","v":"75-3-SUPA"},"P",{"$f":"IF(T26=\"\",\"\",IF(T26=\"v\",R26,R27))","v":"MOLINARO"},{"$f":"IF(T26=\"\",\"\",IF(T26=\"v\",S26,S27))","v":"92-4-SDN"},"P"]
[null,null,null,null,null,null,null,null,null,null,{"$f":"IF(M27=\"\",\"\",IF(M27=\"v\",N27,N29))","v":""},{"$f":"IF(M27=\"\",\"\",IF(M27=\"v\",O27,O29))","v":""},null,null,null,null,null,null,null,null,null,null,null,{"$f":"IF(W27=\"\",\"\",IF(W27=\"v\",U27,U29))","v":"HEBRAUD"},{"$f":"IF(W27=\"\",\"\",IF(W27=\"v\",V27,V29))","v":"92-4-SDN"},"V"]
[null,null,null,null,null,null,null,null,null,null,null,null,null,{"$f":"IF(T29=\"\",\"\",IF(T29=\"p\",S29,S30))","v":"75-3-SUPA"},{"$f":"IF(T29=\"\",\"\",IF(T29=\"p\",R29,R30))","v":"CAPELLE"},null,"4ème poule 5",{"$f":"'Résultats de poule'!B10","v":"CAPELLE"},{"$f":"'Résultats de poule'!D10","v":"75-3-SUPA"},"P",{"$f":"IF(T29=\"\",\"\",IF(T29=\"v\",R29,R30))","v":"HEBRAUD"},{"$f":"IF(T29=\"\",\"\",IF(T29=\"v\",S29,S30))","v":"92-4-SDN"},"V"]
[null,null,null,null,null,null,null,null,null,null,null,null,null,null,null,null,"1er poule 4",{"$f":"'Résultats de poule'!N2","v":"HEBRAUD"},{"$f":"'Résultats de poule'!P2","v":"92-4-SDN"},"V"]
[null,"17ème",null,null,null,null,null,null,null,null,null,null,null,null,null,null,null,null,null,null,null,null,null,null,null,null,null,null,null,null,null,null,"VAINQUEUR"]
[null,{"$f":"IF(D16=\"\",\"\",IF(D16=\"v\",E16,E48))","v":""},{"$f":"IF(D16=\"\",\"\",IF(D16=\"v\",F16,F48))","v":""},null,null,null,null,null,null,null,null,null,null,null,null,null,null,null,null,null,null,null,null,null,null,null,null,null,null,"FINALE",null,null,{"$f":"IF(AF17=\"\",\"\",IF(AF17=\"v\",AD17,AD49))","v":"LE METTER"},{"$f":"IF(AF17=\"\",\"\",IF(AF17=\"v\",AE17,AE49))","v":"75-3-SUPA"}]
[]
[]
[]
[null,null,null,null,null,null,null,null,null,null,null,null,null,null,null,null,"1er poule 3",{"$f":"'Résultats de poule'!J2","v":"LEPELTIER"},{"$f":"'Résultats de poule'!L2","v":"92-4-SDN"},"V","1/8 de finale 5"]
[null,null,null,null,null,null,null,null,null,null,null,null,null,{"$f":"IF(T36=\"\",\"\",IF(T36=\"p\",S36,S37))","v":0},{"$f":"IF(T36=\"\",\"\",IF(T36=\"p\",R36,R37))","v":0},null,"4ème poule 6",{"$f":"'Résultats de poule'!F10","v":0},{"$f":"'Résultats de poule'!H10","v":0},"P",{"$f":"IF(T36=\"\",\"\",IF(T36=\"v\",R36,R37))","v":"LEPELTIER"},{"$f":"IF(T36=\"\",\"\",IF(T36=\"v\",S36,S37))","v":"92-4-SDN"},"V"]
[null,null,null,null,null,null,null,null,null,null,{"$f":"IF(M37=\"\",\"\",IF(M37=\"v\",N37,N39))","v":""},{"$f":"IF(M37=\"\",\"\",IF(M37=\"v\",O37,O39))","v":""},null,null,null,null,null,null,null,null,null,null,null,{"$f":"IF(W37=\"\",\"\",IF(W37=\"v\",U37,U39))","v":"LEPELTIER"},{"$f":"IF(W37=\"\",\"\",IF(W37=\"v\",V37,V39))","v":"92-4-SDN"},"V"]
[null,null,null,null,null,null,null,null,null,null,null,null,null,{"$f":"IF(T39=\"\",\"\",IF(T39=\"p\",S39,S40))","v":"75-4-LMAP"},{"$f":"IF(T39=\"\",\"\",IF(T39=\"p\",R39,R40))","v":"LEPONT"},null,"3ème poule 1",{"$f":"'Résultats de poule'!B4","v":"MANSOUR ABDALLA"},{"$f":"'Résultats de poule'!D4","v":"92-4-SDN"},"V",{"$f":"IF(T39=\"\",\"\",IF(T39=\"v\",R39,R40))","v":"MANSOUR ABDALLA"},{"$f":"IF(T39=\"\",\"\",IF(T39=\"v\",S39,S40))","v":"92-4-SDN"},"P"]
[null,null,null,null,null,null,null,null,null,null,null,null,null,null,null,null,"2ème poule 8",{"$f":"'Résultats de poule'!N8","v":"LEPONT"},{"$f":"'Résultats de poule'!P8","v":"75-4-LMAP"},"P"]
[null,null,null,null,null,null,null,{"$f":"IF(J38=\"\",\"\",IF(J38=\"v\",K38,K45))","v":""},{"$f":"IF(J38=\"\",\"\",IF(J38=\"v\",L38,L45))","v":""}]
[null,null,null,null,null,null,null,null,null,null,null,null,null,null,null,null,null,null,null,null,null,null,null,"1/4 finale 3",null,null,{"$f":"IF(Z38=\"\",\"\",IF(Z38=\"v\",X38,X45))","v":"LEPELTIER"},{"$f":"IF(Z38=\"\",\"\",IF(Z38=\"v\",Y38,Y45))","v":"92-4-SDN"},"P"]
[null,null,null,null,null,null,null,null,null,null,null,null,null,null,null,null,"2ème poule 2",{"$f":"'Résultats de poule'!F3","v":"DIEHL"},{"$f":"'Résultats de poule'!H3","v":"75-4-LMAP"},"P","1/8 de finale 6"]
[null,null,null,null,null,null,null,null,null,null,null,null,null,{"$f":"IF(T43=\"\",\"\",IF(T43=\"p\",S43,S44))","v":"75-4-LMAP"},{"$f":"IF(T43=\"\",\"\",IF(T43=\"p\",R43,R44))","v":"DIEHL"},null,"3ème poule 7",{"$f":"'Résultats de poule'!J9","v":"MICHEL"},{"$f":"'Résultats de poule'!L9","v":"75-4-LMAP"},"V",{"$f":"IF(T43=\"\",\"\",IF(T43=\"v\",R43,R44))","v":"MICHEL"},{"$f":"IF(T43=\"\",\"\",IF(T43=\"v\",S43,S44))","v":"75-4-LMAP"},"P"]
[null,null,null,null,null,null,null,null,null,null,{"$f":"IF(M44=\"\",\"\",IF(M44=\"v\",N44,N46))","v":""},{"$f":"IF(M44=\"\",\"\",IF(M44=\"v\",O44,O46))","v":""},null,null,null,null,null,null,null,null,null,null,null,{"$f":"IF(W44=\"\",\"\",IF(W44=\"v\",U44,U46))","v":"BAYLE"},{"$f":"IF(W44=\"\",\"\",IF(W44=\"v\",V44,V46))","v":"75-4-FENP"},"P"]
[null,null,null,null,null,null,null,null,null,null,null,null,null,{"$f":"IF(T46=\"\",\"\",IF(T46=\"p\",S46,S47))","v":0},{"$f":"IF(T46=\"\",\"\",IF(T46=\"p\",R46,R47))","v":0},null,"4ème poule 4",{"$f":"'Résultats de poule'!N5","v":0},{"$f":"'Résultats de poule'!P5","v":0},"P",{"$f":"IF(T46=\"\",\"\",IF(T46=\"v\",R46,R47))","v":"BAYLE"},{"$f":"IF(T46=\"\",\"\",IF(T46=\"v\",S46,S47))","v":"75-4-FENP"},"V"]
[null,null,null,null,null,null,null,null,null,null,null,null,null,null,null,null,"1er poule 5",{"$f":"'Résultats de poule'!B7","v":"BAYLE"},{"$f":"'Résultats de poule'!D7","v":"75-4-FENP"},"V"]
[null,null,null,null,{"$f":"IF(G41=\"\",\"\",IF(G41=\"v\",H41,H56))","v":""},{"$f":"IF(G41=\"\",\"\",IF(G41=\"v\",I41,I56))","v":""}]
[null,null,null,null,null,null,null,null,null,null,null,null,null,null,null,null,null,null,null,null,null,null,null,null,null,null,"1/2 finale B",null,null,{"$f":"IF(AC42=\"\",\"\",IF(AC42=\"v\",AA42,AA56))","v":"BOUTEMY"},{"$f":"IF(AC42=\"\",\"\",IF(AC42=\"v\",AB42,AB56))","v":"92-4-SDN"},"P"]
[]
[null,null,null,null,null,null,null,null,null,null,null,null,null,null,null,null,"1er poule 8",{"$f":"'Résultats de poule'!N7","v":"GIRAT"},{"$f":"'Résultats de poule'!P7","v":"75-4-LMAP"},"V","1/8 de finale 7"]
[null,null,null,null,null,null,null,null,null,null,null,null,null,{"$f":"IF(T51=\"\",\"\",IF(T51=\"p\",S51,S52))","v":0},{"$f":"IF(T51=\"\",\"\",IF(T51=\"p\",R51,R52))","v":0},null,"4ème poule 1",{"$f":"'Résultats de poule'!B5","v":0},{"$f":"'Résultats de poule'!D5","v":0},"P",{"$f":"IF(T51=\"\",\"\",IF(T51=\"v\",R51,R52))","v":"GIRAT"},{"$f":"IF(T51=\"\",\"\",IF(T51=\"v\",S51,S52))","v":"75-4-LMAP"},"V"]
[null,null,null,null,null,null,null,null,null,null,{"$f":"IF(M52=\"\",\"\",IF(M52=\"v\",N52,N54))","v":""},{"$f":"IF(M52=\"\",\"\",IF(M52=\"v\",O52,O54))","v":""},null,null,null,null,null,null,null,null,null,null,null,{"$f":"IF(W52=\"\",\"\",IF(W52=\"v\",U52,U54))","v":"GIRAT"},{"$f":"IF(W52=\"\",\"\",IF(W52=\"v\",V52,V54))","v":"75-4-LMAP"},"P"]
[null,null,null,null,null,null,null,null,null,null,null,null,null,{"$f":"IF(T54=\"\",\"\",IF(T54=\"p\",S54,S55))","v":"75-3-SUPA"},{"$f":"IF(T54=\"\",\"\",IF(T54=\"p\",R54,R55))","v":"JAFFREDOU-DELOBETTE"},null,"3ème poule 6",{"$f":"'Résultats de poule'!F9","v":"JAFFREDOU-DELOBETTE"},{"$f":"'Résultats de poule'!H9","v":"75-3-SUPA"},"P",{"$f":"IF(T54=\"\",\"\",IF(T54=\"v\",R54,R55))","v":"BACOT"},{"$f":"IF(T54=\"\",\"\",IF(T54=\"v\",S54,S55))","v":"75-4-LMAP"},"P"]
[null,null,null,null,null,null,null,null,null,null,null,null,null,null,null,null,"2ème poule 3",{"$f":"'Résultats de poule'!J3","v":"BACOT"},{"$f":"'Résultats de poule'!L3","v":"75-4-LMAP"},"V"]
[null,null,null,null,null,null,null,{"$f":"IF(J53=\"\",\"\",IF(J53=\"v\",K53,K60))","v":""},{"$f":"IF(J53=\"\",\"\",IF(J53=\"v\",L53,L60))","v":""},null,null,null,null,null,null,null,null,null,null,null,null,null,null,"1/4 finale 4",null,null,{"$f":"IF(Z53=\"\",\"\",IF(Z53=\"v\",X53,X60))","v":"BOUTEMY"},{"$f":"IF(Z53=\"\",\"\",IF(Z53=\"v\",Y53,Y60))","v":"92-4-SDN"},"V"]
[]
[null,null,null,null,null,null,null,null,null,null,null,null,null,null,null,null,"2ème poule 5",{"$f":"'Résultats de poule'!B8","v":"CORNET"},{"$f":"'Résultats de poule'!D8","v":"92-4-SDN"},"V","1/8 de finale 8"]
[null,null,null,null,null,null,null,null,null,null,null,null,null,{"$f":"IF(T58=\"\",\"\",IF(T58=\"p\",S58,S59))","v":"75-3-SUPA"},{"$f":"IF(T58=\"\",\"\",IF(T58=\"p\",R58,R59))","v":"MATHIAN"},null,"3ème poule 4",{"$f":"'Résultats de poule'!N4","v":"MATHIAN"},{"$f":"'Résultats de poule'!P4","v":"75-3-SUPA"},"P",{"$f":"IF(T58=\"\",\"\",IF(T58=\"v\",R58,R59))","v":"CORNET"},{"$f":"IF(T58=\"\",\"\",IF(T58=\"v\",S58,S59))","v":"92-4-SDN"},"P"]
[null,"19ème",null,null,{"$f":"IF(G9=\"\",\"\",IF(G9=\"p\",H9,H24))","v":""},{"$f":"IF(G9=\"\",\"\",IF(G9=\"p\",I9,I24))","v":""},null,null,null,null,{"$f":"IF(M59=\"\",\"\",IF(M59=\"v\",N59,N61))","v":""},{"$f":"IF(M59=\"\",\"\",IF(M59=\"v\",O59,O61))","v":""},null,null,null,null,null,null,null,null,null,null,null,{"$f":"IF(W59=\"\",\"\",IF(W59=\"v\",U59,U61))","v":"BOUTEMY"},{"$f":"IF(W59=\"\",\"\",IF(W59=\"v\",V59,V61))","v":"92-4-SDN"},"V",null,null,null,"Place de 3ème/4ème"]
[null,{"$f":"IF(D60=\"\",\"\",IF(D60=\"v\",E60,E62))","v":""},{"$f":"IF(D60=\"\",\"\",IF(D60=\"v\",F60,F62))","v":""},null,null,null,null,null,null,null,null,null,null,{"$f":"IF(T61=\"\",\"\",IF(T61=\"p\",S61,S62))","v":0},{"$f":"IF(T61=\"\",\"\",IF(T61=\"p\",R61,R62))","v":0},null,"4ème poule 7",{"$f":"'Résultats de poule'!J10","v":0},{"$f":"'Résultats de poule'!L10","v":0},"P",{"$f":"IF(T61=\"\",\"\",IF(T61=\"v\",R61,R62))","v":"BOUTEMY"},{"$f":"IF(T61=\"\",\"\",IF(T61=\"v\",S61,S62))","v":"92-4-SDN"},"V",null,null,null,null,null,null,{"$f":"IF(AC10=\"\",\"\",IF(AC10=\"p\",AA10,AA24))","v":"HEBRAUD"},{"$f":"IF(AC10=\"\",\"\",IF(AC10=\"p\",AB10,AB24))","v":"92-4-SDN"},"P"]
[null,null,null,null,{"$f":"IF(G41=\"\",\"\",IF(G41=\"p\",H41,H56))","v":""},{"$f":"IF(G41=\"\",\"\",IF(G41=\"p\",I41,I56))","v":""},null,null,null,null,null,null,null,null,null,null,"1er poule 2",{"$f":"'Résultats de poule'!F2","v":"BOUTEMY"},{"$f":"'Résultats de poule'!H2","v":"92-4-SDN"},"V",null,null,null,null,null,null,null,null,null,null,null,null,{"$f":"IF(AF61=\"\",\"\",IF(AF61=\"v\",AD61,AD63))","v":"LEPELTIER"},{"$f":"IF(AF61=\"\",\"\",IF(AF61=\"v\",AE61,AE63))","v":"92-4-SDN"}]
[null,null,null,null,null,null,null,null,null,null,null,null,null,null,null,null,null,null,null,null,null,null,null,null,null,null,null,null,null,{"$f":"IF(AC42=\"\",\"\",IF(AC42=\"p\",AA42,AA56))","v":"LEPELTIER"},{"$f":"IF(AC42=\"\",\"\",IF(AC42=\"p\",AB42,AB56))","v":"92-4-SDN"},"V"]
[]
[null,null,null,null,null,null,null,null,null,null,null,null,null,{"$f":"IF(M5=\"\",\"\",IF(M5=\"p\",N5,N7))","v":""},{"$f":"IF(M5=\"\",\"\",IF(M5=\"p\",O5,O7))","v":""},null,null,{"$f":"IF(W5=\"\",\"\",IF(W5=\"p\",U5,U7))","v":"OLIVIER"},{"$f":"IF(W5=\"\",\"\",IF(W5=\"p\",V5,V7))","v":"92-4-SDN"}]
[null,null,null,null,null,null,null,null,null,null,{"$f":"IF(M65=\"\",\"\",IF(M65=\"v\",N65,N66))","v":""},{"$f":"IF(M65=\"\",\"\",IF(M65=\"v\",O65,O66))","v":""},null,{"$f":"IF(M12=\"\",\"\",IF(M12=\"p\",N12,N14))","v":""},{"$f":"IF(M12=\"\",\"\",IF(M12=\"p\",O12,O14))","v":""},null,null,{"$f":"IF(W12=\"\",\"\",IF(W12=\"p\",U12,U14))","v":"DEHAIS"},{"$f":"IF(W12=\"\",\"\",IF(W12=\"p\",V12,V14))","v":"75-4-LMAP"},null,{"$f":"IF(T65=\"\",\"\",IF(T65=\"v\",R65,R66))","v":""},{"$f":"IF(T65=\"\",\"\",IF(T65=\"v\",S65,S66))","v":""}]
[null,null,null,null,null,null,null,{"$f":"IF(J66=\"\",\"\",IF(J66=\"v\",K66,K68))","v":""},{"$f":"IF(J66=\"\",\"\",IF(J66=\"v\",L66,L68))","v":""},null,null,null,null,null,null,null,null,null,null,null,null,null,null,{"$f":"IF(W66=\"\",\"\",IF(W66=\"v\",U66,U68))","v":""},{"$f":"IF(W66=\"\",\"\",IF(W66=\"v\",V66,V68))","v":""}]
[null,null,null,null,null,null,null,null,null,null,{"$f":"IF(M68=\"\",\"\",IF(M68=\"v\",N68,N69))","v":""},{"$f":"IF(M68=\"\",\"\",IF(M68=\"v\",O68,O69))","v":""},null,{"$f":"IF(M20=\"\",\"\",IF(M20=\"p\",N20,N22))","v":""},{"$f":"IF(M20=\"\",\"\",IF(M20=\"p\",O20,O22))","v":""},null,null,{"$f":"IF(W20=\"\",\"\",IF(W20=\"p\",U20,U22))","v":"BARSOUM"},{"$f":"IF(W20=\"\",\"\",IF(W20=\"p\",V20,V22))","v":"75-4-LMAP"},null,{"$f":"IF(T68=\"\",\"\",IF(T68=\"v\",R68,R69))","v":""},{"$f":"IF(T68=\"\",\"\",IF(T68=\"v\",S68,S69))","v":""}]
[null,null,null,null,"25ème",null,null,null,null,null,null,null,null,{"$f":"IF(M27=\"\",\"\",IF(M27=\"p\",N27,N29))","v":""},{"$f":"IF(M27=\"\",\"\",IF(M27=\"p\",O27,O29))","v":""},null,null,{"$f":"IF(W27=\"\",\"\",IF(W27=\"p\",U27,U29))","v":"MOLINARO"},{"$f":"IF(W27=\"\",\"\",IF(W27=\"p\",V27,V29))","v":"92-4-SDN"},null,null,null,null,null,null,null,null,"9ème"]
[null,null,null,null,{"$f":"IF(G67=\"\",\"\",IF(G67=\"v\",H67,H73))","v":""},{"$f":"IF(G67=\"\",\"\",IF(G67=\"v\",I67,I73))","v":""},null,null,null,null,null,null,null,null,null,null,null,null,null,null,null,null,null,null,null,null,{"$f":"IF(Z67=\"\",\"\",IF(Z67=\"v\",X67,X73))","v":""},{"$f":"IF(Z67=\"\",\"\",IF(Z67=\"v\",Y67,Y73))","v":""}]
[null,null,null,null,null,null,null,null,null,null,null,null,null,{"$f":"IF(M37=\"\",\"\",IF(M37=\"p\",N37,N39))","v":""},{"$f":"IF(M37=\"\",\"\",IF(M37=\"p\",O37,O39))","v":""},null,null,{"$f":"IF(W37=\"\",\"\",IF(W37=\"p\",U37,U39))","v":"MANSOUR ABDALLA"},{"$f":"IF(W37=\"\",\"\",IF(W37=\"p\",V37,V39))","v":"92-4-SDN"}]
[null,null,null,null,null,null,null,null,null,null,{"$f":"IF(M71=\"\",\"\",IF(M71=\"v\",N71,N72))","v":""},{"$f":"IF(M71=\"\",\"\",IF(M71=\"v\",O71,O72))","v":""},null,{"$f":"IF(M44=\"\",\"\",IF(M44=\"p\",N44,N46))","v":""},{"$f":"IF(M44=\"\",\"\",IF(M44=\"p\",O44,O46))","v":""},null,null,{"$f":"IF(W44=\"\",\"\",IF(W44=\"p\",U44,U46))","v":"MICHEL"},{"$f":"IF(W44=\"\",\"\",IF(W44=\"p\",V44,V46))","v":"75-4-LMAP"},null,{"$f":"IF(T71=\"\",\"\",IF(T71=\"v\",R71,R72))","v":""},{"$f":"IF(T71=\"\",\"\",IF(T71=\"v\",S71,S72))","v":""}]
[null,null,null,null,null,null,null,{"$f":"IF(J72=\"\",\"\",IF(J72=\"v\",K72,K74))","v":""},{"$f":"IF(J72=\"\",\"\",IF(J72=\"v\",L72,L74))","v":""},null,null,null,null,null,null,null,null,null,null,null,null,null,null,{"$f":"IF(W72=\"\",\"\",IF(W72=\"v\",U72,U74))","v":""},{"$f":"IF(W72=\"\",\"\",IF(W72=\"v\",V72,V74))","v":""}]
[null,null,null,null,null,null,null,null,null,null,{"$f":"IF(M74=\"\",\"\",IF(M74=\"v\",N74,N75))","v":""},{"$f":"IF(M74=\"\",\"\",IF(M74=\"v\",O74,O75))","v":""},null,{"$f":"IF(M52=\"\",\"\",IF(M52=\"p\",N52,N54))","v":""},{"$f":"IF(M52=\"\",\"\",IF(M52=\"p\",O52,O54))","v":""},null,null,{"$f":"IF(W52=\"\",\"\",IF(W52=\"p\",U52,U54))","v":"BACOT"},{"$f":"IF(W52=\"\",\"\",IF(W52=\"p\",V52,V54))","v":"75-4-LMAP"},null,{"$f":"IF(T74=\"\",\"\",IF(T74=\"v\",R74,R75))","v":""},{"$f":"IF(T74=\"\",\"\",IF(T74=\"v\",S74,S75))","v":""}]
[null,null,null,null,null,null,null,null,null,null,null,null,null,{"$f":"IF(M59=\"\",\"\",IF(M59=\"p\",N59,N61))","v":""},{"$f":"IF(M59=\"\",\"\",IF(M59=\"p\",O59,O61))","v":""},null,null,{"$f":"IF(W59=\"\",\"\",IF(W59=\"p\",U59,U61))","v":"CORNET"},{"$f":"IF(W59=\"\",\"\",IF(W59=\"p\",V59,V61))","v":"92-4-SDN"},null,null,null,null,null,null,null,{"$f":"IF(Z6=\"\",\"\",IF(Z6=\"p\",X6,X13))","v":"JUMERT"},{"$f":"IF(Z6=\"\",\"\",IF(Z6=\"p\",Y6,Y13))","v":"75-4-LMAP"},"P"]
[null,null,null,null,null,null,null,null,null,null,null,null,null,null,null,null,null,null,null,null,null,null,null,null,null,null,null,null,null,{"$f":"IF(AC75=\"\",\"\",IF(AC75=\"v\",AA75,AA77))","v":"MIQUEU"},{"$f":"IF(AC75=\"\",\"\",IF(AC75=\"v\",AB75,AB77))","v":"75-4-LMAP"},"P"]
[null,null,null,null,null,null,null,null,null,null,null,null,null,{"$f":"IF(M65=\"\",\"\",IF(M65=\"p\",N65,N66))","v":""},{"$f":"IF(M65=\"\",\"\",IF(M65=\"p\",O65,O66))","v":""},null,null,{"$f":"IF(T65=\"\",\"\",IF(T65=\"p\",R65,R66))","v":""},{"$f":"IF(T65=\"\",\"\",IF(T65=\"p\",S65,S66))","v":""},null,null,null,null,null,null,null,{"$f":"IF(Z21=\"\",\"\",IF(Z21=\"p\",X21,X28))","v":"MIQUEU"},{"$f":"IF(Z21=\"\",\"\",IF(Z21=\"p\",Y21,Y28))","v":"75-4-LMAP"},"V"]
[null,null,null,null,null,null,null,"29ème",null,null,{"$f":"IF(M77=\"\",\"\",IF(M77=\"v\",N77,N78))","v":""},{"$f":"IF(M77=\"\",\"\",IF(M77=\"v\",O77,O78))","v":""},null,{"$f":"IF(M68=\"\",\"\",IF(M68=\"p\",N68,N69))","v":""},{"$f":"IF(M68=\"\",\"\",IF(M68=\"p\",O68,O69))","v":""},null,null,{"$f":"IF(T68=\"\",\"\",IF(T68=\"p\",R68,R69))","v":""},{"$f":"IF(T68=\"\",\"\",IF(T68=\"p\",S68,S69))","v":""},null,{"$f":"IF(T77=\"\",\"\",IF(T77=\"v\",R77,R78))","v":""},{"$f":"IF(T77=\"\",\"\",IF(T77=\"v\",S77,S78))","v":""},null,null,"13ème",null,null,null,null,null,null,null,null,"5ème"]
[null,null,null,null,null,null,null,{"$f":"IF(J78=\"\",\"\",IF(J78=\"v\",K78,K80))","v":""},{"$f":"IF(J78=\"\",\"\",IF(J78=\"v\",L78,L80))","v":""},null,null,null,null,null,null,null,null,null,null,null,null,null,null,{"$f":"IF(W78=\"\",\"\",IF(W78=\"v\",U78,U80))","v":""},{"$f":"IF(W78=\"\",\"\",IF(W78=\"v\",V78,V80))","v":""},null,null,null,null,null,null,null,{"$f":"IF(AF76=\"\",\"\",IF(AF76=\"v\",AD76,AD82))","v":"BAYLE"},{"$f":"IF(AF76=\"\",\"\",IF(AF76=\"v\",AE76,AE82))","v":"75-4-FENP"}]
[null,null,null,null,null,null,null,null,null,null,{"$f":"IF(M80=\"\",\"\",IF(M80=\"v\",N80,N81))","v":""},{"$f":"IF(M80=\"\",\"\",IF(M80=\"v\",O80,O81))","v":""},null,{"$f":"IF(M71=\"\",\"\",IF(M71=\"p\",N71,N72))","v":""},{"$f":"IF(M71=\"\",\"\",IF(M71=\"p\",O71,O72))","v":""},null,null,{"$f":"IF(T71=\"\",\"\",IF(T71=\"p\",R71,R72))","v":""},{"$f":"IF(T71=\"\",\"\",IF(T71=\"p\",S71,S72))","v":""},null,{"$f":"IF(T80=\"\",\"\",IF(T80=\"v\",R80,R81))","v":""},{"$f":"IF(T80=\"\",\"\",IF(T80=\"v\",S80,S81))","v":""}]
[null,null,null,null,null,null,null,null,null,null,null,null,null,{"$f":"IF(M74=\"\",\"\",IF(M74=\"p\",N74,N75))","v":""},{"$f":"IF(M74=\"\",\"\",IF(M74=\"p\",O74,O75))","v":""},null,null,{"$f":"IF(T74=\"\",\"\",IF(T74=\"p\",R74,R75))","v":""},{"$f":"IF(T74=\"\",\"\",IF(T74=\"p\",S74,S75))","v":""},null,null,null,null,null,null,null,{"$f":"IF(Z38=\"\",\"\",IF(Z38=\"p\",X38,X45))","v":"BAYLE"},{"$f":"IF(Z38=\"\",\"\",IF(Z38=\"p\",Y38,Y45))","v":"75-4-FENP"},"V"]
[null,null,null,null,null,null,null,null,null,null,"27ème",null,null,null,null,null,null,null,null,null,null,"11ème",null,null,null,null,null,null,null,{"$f":"IF(AC81=\"\",\"\",IF(AC81=\"v\",AA81,AA83))","v":"BAYLE"},{"$f":"IF(AC81=\"\",\"\",IF(AC81=\"v\",AB81,AB83))","v":"75-4-FENP"},"V"]
[null,null,null,null,null,null,null,null,null,null,{"$f":"IF(M83=\"\",\"\",IF(M83=\"v\",N83,N84))","v":""},{"$f":"IF(M83=\"\",\"\",IF(M83=\"v\",O83,O84))","v":""},null,{"$f":"IF(J66=\"\",\"\",IF(J66=\"p\",K66,K68))","v":""},{"$f":"IF(J66=\"\",\"\",IF(J66=\"p\",L66,L68))","v":""},null,null,{"$f":"IF(W66=\"\",\"\",IF(W66=\"p\",U66,U68))","v":""},{"$f":"IF(W66=\"\",\"\",IF(W66=\"p\",V66,V68))","v":""},null,{"$f":"IF(T83=\"\",\"\",IF(T83=\"v\",R83,R84))","v":""},{"$f":"IF(T83=\"\",\"\",IF(T83=\"v\",S83,S84))","v":""},null,null,null,null,{"$f":"IF(Z53=\"\",\"\",IF(Z53=\"p\",X53,X60))","v":"GIRAT"},{"$f":"IF(Z53=\"\",\"\",IF(Z53=\"p\",Y53,Y60))","v":"75-4-LMAP"},"P"]
[null,null,null,null,null,null,null,null,null,null,null,null,null,{"$f":"IF(J72=\"\",\"\",IF(J72=\"p\",K72,K74))","v":""},{"$f":"IF(J72=\"\",\"\",IF(J72=\"p\",L72,L74))","v":""},null,null,{"$f":"IF(W72=\"\",\"\",IF(W72=\"p\",U72,U74))","v":""},{"$f":"IF(W72=\"\",\"\",IF(W72=\"p\",V72,V74))","v":""}]
[null,null,null,null,null,null,null,{"$f":"IF(J6=\"\",\"\",IF(J6=\"p\",K6,K13))","v":""},{"$f":"IF(J6=\"\",\"\",IF(J6=\"p\",L6,L13))","v":""},null,null,null,null,null,null,null,null,null,null,null,null,null,null,null,null,null,{"$f":"IF(AC75=\"\",\"\",IF(AC75=\"p\",AA75,AA77))","v":"JUMERT"},{"$f":"IF(AC75=\"\",\"\",IF(AC75=\"p\",AB75,AB77))","v":"75-4-LMAP"},"V",null,"7ème"]
[null,"21ème",null,null,{"$f":"IF(G85=\"\",\"\",IF(G85=\"v\",H85,H86))","v":""},{"$f":"IF(G85=\"\",\"\",IF(G85=\"v\",I85,I86))","v":""},null,{"$f":"IF(J21=\"\",\"\",IF(J21=\"p\",K21,K28))","v":""},{"$f":"IF(J21=\"\",\"\",IF(J21=\"p\",L21,L28))","v":""},null,"31ème",null,null,null,null,null,null,null,null,null,null,"15ème",null,null,null,null,null,null,null,{"$f":"IF(AC85=\"\",\"\",IF(AC85=\"v\",AA85,AA87))","v":"JUMERT"},{"$f":"IF(AC85=\"\",\"\",IF(AC85=\"v\",AB85,AB87))","v":"75-4-LMAP"}]
[null,{"$f":"IF(D86=\"\",\"\",IF(D86=\"v\",E86,E88))","v":""},{"$f":"IF(D86=\"\",\"\",IF(D86=\"v\",F86,F88))","v":""},null,null,null,null,null,null,null,{"$f":"IF(M87=\"\",\"\",IF(M87=\"v\",N87,N88))","v":""},{"$f":"IF(M87=\"\",\"\",IF(M87=\"v\",O87,O88))","v":""},null,{"$f":"IF(M77=\"\",\"\",IF(M77=\"p\",N77,N78))","v":""},{"$f":"IF(M77=\"\",\"\",IF(M77=\"p\",O77,O78))","v":""},null,null,{"$f":"IF(T77=\"\",\"\",IF(T77=\"p\",R77,R78))","v":""},{"$f":"IF(T77=\"\",\"\",IF(T77=\"p\",S77,S78))","v":""},null,{"$f":"IF(T87=\"\",\"\",IF(T87=\"v\",R87,R88))","v":""},{"$f":"IF(T87=\"\",\"\",IF(T87=\"v\",S87,S88))","v":""},null,null,null,null,{"$f":"IF(AC81=\"\",\"\",IF(AC81=\"p\",AA81,AA83))","v":"GIRAT"},{"$f":"IF(AC81=\"\",\"\",IF(AC81=\"p\",AB81,AB83))","v":"75-4-LMAP"},"P"]
[null,null,null,null,{"$f":"IF(G88=\"\",\"\",IF(G88=\"v\",H88,H89))","v":""},{"$f":"IF(G88=\"\",\"\",IF(G88=\"v\",I88,I89))","v":""},null,{"$f":"IF(J38=\"\",\"\",IF(J38=\"p\",K38,K45))","v":""},{"$f":"IF(J38=\"\",\"\",IF(J38=\"p\",L38,L45))","v":""},null,null,null,null,{"$f":"IF(M80=\"\",\"\",IF(M80=\"p\",N80,N81))","v":""},{"$f":"IF(M80=\"\",\"\",IF(M80=\"p\",O80,O81))","v":""},null,null,{"$f":"IF(T80=\"\",\"\",IF(T80=\"p\",R80,R81))","v":""},{"$f":"IF(T80=\"\",\"\",IF(T80=\"p\",S80,S81))","v":""}]
[null,null,null,null,null,null,null,{"$f":"IF(J53=\"\",\"\",IF(J53=\"p\",K53,K60))","v":""},{"$f":"IF(J53=\"\",\"\",IF(J53=\"p\",L53,L60))","v":""}]
[null,"23ème"]
[null,{"$f":"IF(D91=\"\",\"\",IF(D91=\"v\",E91,E92))","v":""},{"$f":"IF(D91=\"\",\"\",IF(D91=\"v\",F91,F92))","v":""},null,{"$f":"IF(G85=\"\",\"\",IF(G85=\"p\",H85,H86))","v":""},{"$f":"IF(G85=\"\",\"\",IF(G85=\"p\",I85,I86))","v":""}]
[null,null,null,null,{"$f":"IF(G88=\"\",\"\",IF(G88=\"p\",H88,H89))","v":""},{"$f":"IF(G88=\"\",\"\",IF(G88=\"p\",I88,I89))","v":""}]

{"sheet":"Classement","index":11,"n_rows":28,"n_cols":4,"rows_kept":28,"cut":false,"hidden":false,"merged":[[1,0,1,2],[0,0,0,2],[11,0,18,0],[19,0,27,0]]}
[{"$f":"IF(Engagés!A1=\"\",\"\",Engagés!A1)","v":"Championnat Territoire IDF"}]
[{"$f":"IF(Engagés!E3=\"\",\"\",Engagés!E3)","v":"CJG ELITE"}]
["CLASSEMENT","NOMS","Etablissement"]
["1er",{"$f":"Tableau!AG32","v":"LE METTER"},{"$f":"Tableau!AH32","v":"75-3-SUPA"},"Q"]
["2ème",{"$f":"IF(Tableau!$AF$17=\"\",\"\",IF(Tableau!$AF$17=\"p\",Tableau!$AD$17,Tableau!$AD$49))","v":"BOUTEMY"},{"$f":"IF(Tableau!$AF$17=\"\",\"\",IF(Tableau!$AF$17=\"p\",Tableau!$AE$17,Tableau!$AE$49))","v":"92-4-SDN"},"Q"]
["3ème",{"$f":"Tableau!AG62","v":"LEPELTIER"},{"$f":"Tableau!AH62","v":"92-4-SDN"},"Q"]
["4ème",{"$f":"IF(Tableau!AF61=\"\",\"\",IF(Tableau!$AF$61=\"p\",Tableau!$AD$61,Tableau!$AD$63))","v":"HEBRAUD"},{"$f":"IF(Tableau!AF61=\"\",\"\",IF(Tableau!$AF$61=\"p\",Tableau!$AE$61,Tableau!$AE$63))","v":"92-4-SDN"},"Q"]
["5ème",{"$f":"Tableau!AG79","v":"BAYLE"},{"$f":"Tableau!AH79","v":"75-4-FENP"}]
["6ème",{"$f":"IF(Tableau!AF76=\"\",\"\",IF(Tableau!$AF$76=\"p\",Tableau!$AD$76,Tableau!$AD$82))","v":"MIQUEU"},{"$f":"IF(Tableau!$AF$76=\"\",\"\",IF(Tableau!$AF$76=\"p\",Tableau!$AE$76,Tableau!$AE$82))","v":"75-4-LMAP"}]
["7ème",{"$f":"Tableau!AD86","v":"JUMERT"},{"$f":"Tableau!AE86","v":"75-4-LMAP"}]
["8ème",{"$f":"IF(Tableau!$AC$85=\"\",\"\",IF(Tableau!$AC$85=\"p\",Tableau!$AA$85,Tableau!$AA$87))","v":"GIRAT"},{"$f":"IF(Tableau!$AC$85=\"\",\"\",IF(Tableau!$AC$85=\"p\",Tableau!$AB$85,Tableau!$AB$87))","v":"75-4-LMAP"}]
["9ème",{"$f":"Tableau!R65","v":"OLIVIER"},{"$f":"Tableau!S65","v":"92-4-SDN"}]
[null,{"$f":"Tableau!R66","v":"DEHAIS"},{"$f":"Tableau!S66","v":"75-4-LMAP"}]
[null,{"$f":"Tableau!R68","v":"BARSOUM"},{"$f":"Tableau!S68","v":"75-4-LMAP"}]
[null,{"$f":"Tableau!R69","v":"MOLINARO"},{"$f":"Tableau!S69","v":"92-4-SDN"}]
[null,{"$f":"Tableau!R71","v":"MANSOUR ABDALLA"},{"$f":"Tableau!S71","v":"92-4-SDN"}]
[null,{"$f":"Tableau!R72","v":"MICHEL"},{"$f":"Tableau!S72","v":"75-4-LMAP"}]
[null,{"$f":"Tableau!R74","v":"BACOT"},{"$f":"Tableau!S74","v":"75-4-LMAP"}]
[null,{"$f":"Tableau!R75","v":"CORNET"},{"$f":"Tableau!S75","v":"92-4-SDN"}]
["17ème",{"$f":"Tableau!O7","v":"NELSON"},{"$f":"Tableau!N7","v":"75-3-SUPA"}]
[null,{"$f":"Tableau!O12","v":"COULANGE"},{"$f":"Tableau!N12","v":"75-4-LMAP"}]
[null,{"$f":"Tableau!O22","v":"HUIBAN - NACCACHE"},{"$f":"Tableau!N22","v":"92-4-SDN"}]
[null,{"$f":"Tableau!O27","v":"BLANCHET"},{"$f":"Tableau!N27","v":"75-3-SUPA"}]
[null,{"$f":"Tableau!O29","v":"CAPELLE"},{"$f":"Tableau!N29","v":"75-3-SUPA"}]
[null,{"$f":"Tableau!O39","v":"LEPONT"},{"$f":"Tableau!N39","v":"75-4-LMAP"}]
[null,{"$f":"Tableau!O44","v":"DIEHL"},{"$f":"Tableau!N44","v":"75-4-LMAP"}]
[null,{"$f":"Tableau!O54","v":"JAFFREDOU-DELOBETTE"},{"$f":"Tableau!N54","v":"75-3-SUPA"}]
[null,{"$f":"Tableau!O59","v":"MATHIAN"},{"$f":"Tableau!N59","v":"75-3-SUPA"}]

{"sheet":"Feuille de match","index":12,"n_rows":49,"n_cols":10,"rows_kept":49,"cut":false,"hidden":false,"merged":[[0,1,0,3],[0,7,0,9],[1,2,13,2],[1,8,13,8],[2,0,2,1],[2,3,2,4],[2,6,2,7],[2,9,2,10],[4,0,4,1],[4,3,4,4],[4,6,4,7],[4,9,4,10],[5,0,5,1],[5,3,5,4],[5,6,5,7],[5,9,5,10],[7,0,7,1],[7,3,7,4],[7,6,7,7],[7,9,7,10],[8,0,8,1],[8,3,8,4],[8,6,8,7],[8,9,8,10],[21,6,21,7],[21,9,21,10],[14,0,15,0],[14,1,15,3],[14,6,15,6],[14,7,15,9],[17,1,17,3],[17,7,17,9],[22,0,22,1],[22,3,22,4],[22,6,22,7],[22,9,22,10],[24,0,24,1],[24,3,24,4],[24,6,24,7],[24,9,24,10],[18,2,30,2],[18,8,30,8],[19,0,19,1],[19,3,19,4],[19,6,19,7],[19,9,19,10],[21,0,21,1],[21,3,21,4],[25,0,25,1],[25,3,25,4],[25,6,25,7],[25,9,25,10],[31,0,32,0],[31,1,32,3],[31,6,32,6],[31,7,32,9],[34,1,34,3],[34,7,34,9],[35,2,47,2],[35,8,47,8],[36,0,36,1],[36,3,36,4],[36,6,36,7],[36,9,36,10],[38,0,38,1],[38,3,38,4],[38,6,38,7],[38,9,38,10],[39,0,39,1],[39,3,39,4],[39,6,39,7],[39,9,39,10],[48,0,49,0],[48,1,49,3],[48,6,49,6],[48,7,49,9],[41,0,41,1],[41,3,41,4],[41,6,41,7],[41,9,41,10],[42,0,42,1],[42,3,42,4],[42,6,42,7],[42,9,42,10]]}
[null,"Tennis de Table",null,null,null,null,null,"Tennis de Table"]
[]
["Catégorie",null,null,{"$f":"Engagés!$E$3","v":"CJG ELITE"},null,null,"Catégorie",null,null,{"$f":"Engagés!$E$3","v":"CJG ELITE"}]
[]
["NOM",null,null,"NOM",null,null,"NOM",null,null,"NOM"]
[]
[]
["SIGLE",null,null,"SIGLE",null,null,"SIGLE",null,null,"SIGLE"]
[]
[]
["1er set",null,null,null,null,null,"1er set"]
["2ème set",null,null,null,null,null,"2ème set"]
["3ème set",null,null,null,null,null,"3ème set"]
[]
["Vainqueur",null,null,null,null,null,"Vainqueur"]
[]
[]
[null,"Tennis de Table",null,null,null,null,null,"Tennis de Table"]
[]
["Catégorie",null,null,{"$f":"Engagés!$E$3","v":"CJG ELITE"},null,null,"Catégorie",null,null,{"$f":"Engagés!$E$3","v":"CJG ELITE"}]
[]
["NOM",null,null,"NOM",null,null,"NOM",null,null,"NOM"]
[]
[]
["SIGLE",null,null,"SIGLE",null,null,"SIGLE",null,null,"SIGLE"]
[]
[]
["1er set",null,null,null,null,null,"1er set"]
["2ème set",null,null,null,null,null,"2ème set"]
["3ème set",null,null,null,null,null,"3ème set"]
[]
["Vainqueur",null,null,null,null,null,"Vainqueur"]
[]
[]
[null,"Tennis de Table",null,null,null,null,null,"Tennis de Table"]
[]
["Catégorie",null,null,{"$f":"Engagés!$E$3","v":"CJG ELITE"},null,null,"Catégorie",null,null,{"$f":"Engagés!$E$3","v":"CJG ELITE"}]
[]
["NOM",null,null,"NOM",null,null,"NOM",null,null,"NOM"]
[]
[]
["SIGLE",null,null,"SIGLE",null,null,"SIGLE",null,null,"SIGLE"]
[]
[]
["1er set",null,null,null,null,null,"1er set"]
["2ème set",null,null,null,null,null,"2ème set"]
["3ème set",null,null,null,null,null,"3ème set"]
[]
["Vainqueur",null,null,null,null,null,"Vainqueur"]