{"text_format":"1","workbook":"xlsx","n_sheets":13,"sheets":["Engagés","Poule 1","Poule 2","Poule 3","Poule 4","Poule 5","Poule 6","Poule 7","Poule 8","Résultats de poule","Tableau","Classement","Feuille de match"],"not_rendered":{"charts":0,"images":82,"macros":1,"external_links":0,"defined_names":1,"comments":0,"pivot_tables":0},"unopened":[],"bounds":{"document_bytes":16777216,"sheet_cells":100000,"rows_first":2000,"rows_last":500,"rows_between":2000,"halvings":0,"cell_chars":16384,"cell_head_chars":4096},"cells_cut":0,"cells_raw":0,"read":"whole","date_system":"1900"}

{"sheet":"Engagés","index":0,"n_rows":37,"n_cols":14,"rows_kept":37,"cut":false,"hidden":false,"merged":[[17,6,17,9],[17,10,17,13],[23,6,23,9],[23,10,23,13],[0,0,2,1],[5,10,5,13],[5,6,5,9],[11,6,11,9],[11,10,11,13],[0,2,2,2]]}
["Championnat Territoire IDF",null,"TENNIS DE TABLE","DATE :","16 fev"]
[null,null,null,"LIEU :","Stanislas"]
[null,null,null,"CATEGORIE :","CJG ELITE"]
["Tête de série","ETABLISSEMENT","NOM","PRENOM","SIGLE"]
[]
[1,"SAINTE URSULE","LE METTER","THEOPHILE","75-3-SUPA",null,"Poule 1",null,null,null,"Poule 2"]
[2,"COLLEGE LYCEE SAINT DOMINIQUE","BOUTEMY","MALO","92-4-SDN",null,1,{"$f":"VLOOKUP($G7,$A$1:$E$37,3,FALSE)","v":"LE METTER"},{"$f":"VLOOKUP($G7,$A$1:$E$37,4,FALSE)","v":"THEOPHILE"},{"$f":"VLOOKUP($G7,$A$1:$E$37,5,FALSE)","v":"75-3-SUPA"},2,{"$f":"VLOOKUP($K7,$A$1:$E$37,3,FALSE)","v":"BOUTEMY"},{"$f":"VLOOKUP($K7,$A$1:$E$37,4,FALSE)","v":"MALO"},{"$f":"VLOOKUP($K7,$A$1:$E$37,5,FALSE)","v":"92-4-SDN"}]
[3,"COLLEGE LYCEE SAINT DOMINIQUE","LEPELTIER","CORENTIN","92-4-SDN",null,16,{"$f":"VLOOKUP($G8,$A$1:$E$37,3,FALSE)","v":"MIQUEU"},{"$f":"VLOOKUP($G8,$A$1:$E$37,4,FALSE)","v":"LOUIS"},{"$f":"VLOOKUP($G8,$A$1:$E$37,5,FALSE)","v":"75-4-LMAP"},15,{"$f":"VLOOKUP($K8,$A$1:$E$37,3,FALSE)","v":"BLANCHET"},{"$f":"VLOOKUP($K8,$A$1:$E$37,4,FALSE)","v":"MARIN"},{"$f":"VLOOKUP($K8,$A$1:$E$37,5,FALSE)","v":"75-3-SUPA"}]
[4,"COLLEGE LYCEE SAINT DOMINIQUE","HEBRAUD","CLEMENT","92-4-SDN",null,17,{"$f":"VLOOKUP($G9,$A$1:$E$37,3,FALSE)","v":"MANSOUR ABDALLA"},{"$f":"VLOOKUP($G9,$A$1:$E$37,4,FALSE)","v":"IHAB"},{"$f":"VLOOKUP($G9,$A$1:$E$37,5,FALSE)","v":"92-4-SDN"},18,{"$f":"VLOOKUP($K9,$A$1:$E$37,3,FALSE)","v":"DIEHL"},{"$f":"VLOOKUP($K9,$A$1:$E$37,4,FALSE)","v":"ALEXANDROS"},{"$f":"VLOOKUP($K9,$A$1:$E$37,5,FALSE)","v":"75-4-LMAP"}]
[5,"FENELON STE MARIE","BAYLE","ALEXANDRE","75-4-FENP",null,32,{"$f":"VLOOKUP($G10,$A$1:$E$37,3,FALSE)","v":0},{"$f":"VLOOKUP($G10,$A$1:$E$37,4,FALSE)","v":0},{"$f":"VLOOKUP($G10,$A$1:$E$37,5,FALSE)","v":0},31,{"$f":"VLOOKUP($K10,$A$1:$E$37,3,FALSE)","v":0},{"$f":"VLOOKUP($K10,$A$1:$E$37,4,FALSE)","v":0},{"$f":"VLOOKUP($K10,$A$1:$E$37,5,FALSE)","v":0}]
{"$rows_left_out":28}
{"sheet":"Poule 1","index":1,"n_rows":24,"n_cols":7,"rows_kept":24,"cut":false,"hidden":false,"merged":[[0,0,0,2],[0,3,0,4],[22,0,22,1],[20,2,20,3],[23,4,23,5],[22,4,22,5],[13,0,13,6],[14,3,14,4],[23,2,23,3],[21,0,21,1],[23,0,23,1],[21,2,21,3],[19,4,19,5],[20,4,20,5],[7,0,7,6],[8,3,8,4],[8,0,8,2],[9,0,9,2],[10,0,10,2],[1,0,1,2],[1,3,1,6],[22,2,22,3],[20,0,20,1],[18,4,18,6],[11,0,11,2],[12,0,12,2],[14,0,14,2],[17,0,17,2],[18,0,18,3],[21,4,21,5],[19,0,19,1],[15,0,15,2],[16,0,16,2],[19,2,19,3]]}
[{"$f":"Engagés!C1","v":"TENNIS DE TABLE"},null,null,{"$f":"Engagés!C3","v":0}]
["POULE 1"]
[null,"NOM","Prénom","Sigle","Vict","Def","Classement"]
[1,{"$f":"VLOOKUP($A4,Engagés!$A$1:$E$380,3,FALSE)","v":"LE METTER"},{"$f":"VLOOKUP($A4,Engagés!$A$1:$E$380,4,FALSE)","v":"THEOPHILE"},{"$f":"VLOOKUP($A4,Engagés!$A$1:$E$380,5,FALSE)","v":"75-3-SUPA"},null,null,"1er"]
[16,{"$f":"VLOOKUP($A5,Engagés!$A$1:$E$380,3,FALSE)","v":"MIQUEU"},{"$f":"VLOOKUP($A5,Engagés!$A$1:$E$380,4,FALSE)","v":"LOUIS"},{"$f":"VLOOKUP($A5,Engagés!$A$1:$E$380,5,FALSE)","v":"75-4-LMAP"},null,null,"2ème"]
[17,{"$f":"VLOOKUP($A6,Engagés!$A$1:$E$380,3,FALSE)","v":"MANSOUR ABDALLA"},{"$f":"VLOOKUP($A6,Engagés!$A$1:$E$380,4,FALSE)","v":"IHAB"},{"$f":"VLOOKUP($A6,Engagés!$A$1:$E$380,5,FALSE)","v":"92-4-SDN"},null,null,"3ème"]
[32,{"$f":"VLOOKUP($A7,Engagés!$A$1:$E$380,3,FALSE)","v":0},{"$f":"VLOOKUP($A7,Engagés!$A$1:$E$380,4,FALSE)","v":0},{"$f":"VLOOKUP($A7,Engagés!$A$1:$E$380,5,FALSE)","v":0},null,null,"4ème"]
["Si poule de 4 joueurs alors…"]
["Déroulement",null,null,"Joueurs A contre Joueur B",null,"Vainqueur","Score"]
["Match 1",null,null,{"$f":"B4","v":"LE METTER"},{"$f":"B7","v":0}]
{"$rows_left_out":15}
{"sheet":"Poule 2","index":2,"n_rows":24,"n_cols":7,"rows_kept":24,"cut":false,"hidden":false,"merged":[[0,3,0,4],[15,0,15,2],[16,0,16,2],[1,0,1,2],[1,3,1,6],[7,0,7,6],[8,0,8,2],[8,3,8,4],[9,0,9,2],[10,0,10,2],[11,0,11,2],[12,0,12,2],[13,0,13,6],[14,0,14,2],[14,3,14,4],[0,0,0,2],[17,0,17,2],[18,0,18,3],[18,4,18,6],[20,0,20,1],[20,2,20,3],[20,4,20,5],[19,0,19,1],[19,2,19,3],[19,4,19,5],[23,0,23,1],[23,2,23,3],[23,4,23,5],[21,0,21,1],[21,2,21,3],[21,4,21,5],[22,0,22,1],[22,2,22,3],[22,4,22,5]]}
[{"$f":"Engagés!C1","v":"TENNIS DE TABLE"},null,null,{"$f":"Engagés!C3","v":0}]
["POULE 2"]
[null,"NOM","Prénom","Sigle","Vict","Def","Classement"]
[2,{"$f":"VLOOKUP($A4,Engagés!$A$1:$E$380,3,FALSE)","v":"BOUTEMY"},{"$f":"VLOOKUP($A4,Engagés!$A$1:$E$380,4,FALSE)","v":"MALO"},{"$f":"VLOOKUP($A4,Engagés!$A$1:$E$380,5,FALSE)","v":"92-4-SDN"},null,null,"1er"]
[15,{"$f":"VLOOKUP($A5,Engagés!$A$1:$E$380,3,FALSE)","v":"BLANCHET"},{"$f":"VLOOKUP($A5,Engagés!$A$1:$E$380,4,FALSE)","v":"MARIN"},{"$f":"VLOOKUP($A5,Engagés!$A$1:$E$380,5,FALSE)","v":"75-3-SUPA"},null,null,"3ème"]
[18,{"$f":"VLOOKUP($A6,Engagés!$A$1:$E$380,3,FALSE)","v":"DIEHL"},{"$f":"VLOOKUP($A6,Engagés!$A$1:$E$380,4,FALSE)","v":"ALEXANDROS"},{"$f":"VLOOKUP($A6,Engagés!$A$1:$E$380,5,FALSE)","v":"75-4-LMAP"},null,null,"2ème"]
[31,{"$f":"VLOOKUP($A7,Engagés!$A$1:$E$380,3,FALSE)","v":0},{"$f":"VLOOKUP($A7,Engagés!$A$1:$E$380,4,FALSE)","v":0},{"$f":"VLOOKUP($A7,Engagés!$A$1:$E$380,5,FALSE)","v":0},null,null,"4ème"]
["Si poule de 4 joueurs alors…"]
["Déroulement",null,null,"Joueurs A contre Joueur B",null,"Vainqueur","Score"]
["Match 1",null,null,{"$f":"B4","v":"BOUTEMY"},{"$f":"B7","v":0}]
{"$rows_left_out":15}
{"sheet":"Poule 3","index":3,"n_rows":24,"n_cols":7,"rows_kept":24,"cut":false,"hidden":false,"merged":[[0,3,0,4],[15,0,15,2],[16,0,16,2],[1,0,1,2],[1,3,1,6],[7,0,7,6],[8,0,8,2],[8,3,8,4],[9,0,9,2],[10,0,10,2],[11,0,11,2],[12,0,12,2],[13,0,13,6],[14,0,14,2],[14,3,14,4],[0,0,0,2],[17,0,17,2],[18,0,18,3],[18,4,18,6],[20,0,20,1],[20,2,20,3],[20,4,20,5],[19,0,19,1],[19,2,19,3],[19,4,19,5],[23,0,23,1],[23,2,23,3],[23,4,23,5],[21,0,21,1],[21,2,21,3],[21,4,21,5],[22,0,22,1],[22,2,22,3],[22,4,22,5]]}
[{"$f":"Engagés!C1","v":"TENNIS DE TABLE"},null,null,{"$f":"Engagés!C3","v":0}]
["POULE 3"]
[null,"NOM","Prénom","Sigle","Vict","Def","Classement"]
[3,{"$f":"VLOOKUP($A4,Engagés!$A$1:$E$380,3,FALSE)","v":"LEPELTIER"},{"$f":"VLOOKUP($A4,Engagés!$A$1:$E$380,4,FALSE)","v":"CORENTIN"},{"$f":"VLOOKUP($A4,Engagés!$A$1:$E$380,5,FALSE)","v":"92-4-SDN"},null,null,"1er"]
[14,{"$f":"VLOOKUP($A5,Engagés!$A$1:$E$380,3,FALSE)","v":"NELSON"},{"$f":"VLOOKUP($A5,Engagés!$A$1:$E$380,4,FALSE)","v":"SAMUEL"},{"$f":"VLOOKUP($A5,Engagés!$A$1:$E$380,5,FALSE)","v":"75-3-SUPA"},null,null,"3ème"]
[19,{"$f":"VLOOKUP($A6,Engagés!$A$1:$E$380,3,FALSE)","v":"BACOT"},{"$f":"VLOOKUP($A6,Engagés!$A$1:$E$380,4,FALSE)","v":"PAUL EDOUARD"},{"$f":"VLOOKUP($A6,Engagés!$A$1:$E$380,5,FALSE)","v":"75-4-LMAP"},null,null,"2ème"]
[30,{"$f":"VLOOKUP($A7,Engagés!$A$1:$E$380,3,FALSE)","v":0},{"$f":"VLOOKUP($A7,Engagés!$A$1:$E$380,4,FALSE)","v":0},{"$f":"VLOOKUP($A7,Engagés!$A$1:$E$380,5,FALSE)","v":0},null,null,"4ème"]
["Si poule de 4 joueurs alors…"]
["Déroulement",null,null,"Joueurs A contre Joueur B",null,"Vainqueur","Score"]
["Match 1",null,null,{"$f":"B4","v":"LEPELTIER"},{"$f":"B7","v":0}]
{"$rows_left_out":15}
{"sheet":"Poule 4","index":4,"n_rows":24,"n_cols":7,"rows_kept":24,"cut":false,"hidden":false,"merged":[[0,3,0,4],[15,0,15,2],[16,0,16,2],[1,0,1,2],[1,3,1,6],[7,0,7,6],[8,0,8,2],[8,3,8,4],[9,0,9,2],[10,0,10,2],[11,0,11,2],[12,0,12,2],[13,0,13,6],[14,0,14,2],[14,3,14,4],[0,0,0,2],[17,0,17,2],[18,0,18,3],[18,4,18,6],[20,0,20,1],[20,2,20,3],[20,4,20,5],[19,0,19,1],[19,2,19,3],[19,4,19,5],[23,0,23,1],[23,2,23,3],[23,4,23,5],[21,0,21,1],[21,2,21,3],[21,4,21,5],[22,0,22,1],[22,2,22,3],[22,4,22,5]]}
[{"$f":"Engagés!C1","v":"TENNIS DE TABLE"},null,null,{"$f":"Engagés!C3","v":0}]
["POULE 4"]
[null,"NOM","Prénom","Sigle","Vict","Def","Classement"]
[4,{"$f":"VLOOKUP($A4,Engagés!$A$1:$E$380,3,FALSE)","v":"HEBRAUD"},{"$f":"VLOOKUP($A4,Engagés!$A$1:$E$380,4,FALSE)","v":"CLEMENT"},{"$f":"VLOOKUP($A4,Engagés!$A$1:$E$380,5,FALSE)","v":"92-4-SDN"},null,null,"1er"]
[13,{"$f":"VLOOKUP($A5,Engagés!$A$1:$E$380,3,FALSE)","v":"MATHIAN"},{"$f":"VLOOKUP($A5,Engagés!$A$1:$E$380,4,FALSE)","v":"ALEC"},{"$f":"VLOOKUP($A5,Engagés!$A$1:$E$380,5,FALSE)","v":"75-3-SUPA"},null,null,"3ème"]
[20,{"$f":"VLOOKUP($A6,Engagés!$A$1:$E$380,3,FALSE)","v":"DEHAIS"},{"$f":"VLOOKUP($A6,Engagés!$A$1:$E$380,4,FALSE)","v":"AURELIEN"},{"$f":"VLOOKUP($A6,Engagés!$A$1:$E$380,5,FALSE)","v":"75-4-LMAP"},null,null,"2ème"]
[29,{"$f":"VLOOKUP($A7,Engagés!$A$1:$E$380,3,FALSE)","v":0},{"$f":"VLOOKUP($A7,Engagés!$A$1:$E$380,4,FALSE)","v":0},{"$f":"VLOOKUP($A7,Engagés!$A$1:$E$380,5,FALSE)","v":0},null,null,"4ème"]
["Si poule de 4 joueurs alors…"]
["Déroulement",null,null,"Joueurs A contre Joueur B",null,"Vainqueur","Score"]
["Match 1",null,null,{"$f":"B4","v":"HEBRAUD"},{"$f":"B7","v":0},0]
{"$rows_left_out":15}
{"sheet":"Poule 5","index":5,"n_rows":24,"n_cols":7,"rows_kept":24,"cut":false,"hidden":false,"merged":[[12,0,12,2],[13,0,13,6],[0,0,0,2],[0,3,0,4],[10,0,10,2],[11,0,11,2],[1,0,1,2],[1,3,1,6],[7,0,7,6],[8,0,8,2],[8,3,8,4],[9,0,9,2],[20,0,20,1],[20,2,20,3],[20,4,20,5],[14,0,14,2],[14,3,14,4],[15,0,15,2],[18,4,18,6],[19,0,19,1],[19,2,19,3],[19,4,19,5],[16,0,16,2],[17,0,17,2],[18,0,18,3],[23,0,23,1],[23,2,23,3],[23,4,23,5],[21,0,21,1],[21,2,21,3],[21,4,21,5],[22,0,22,1],[22,2,22,3],[22,4,22,5]]}
[{"$f":"Engagés!C1","v":"TENNIS DE TABLE"},null,null,{"$f":"Engagés!C3","v":0}]
["POULE 5"]
[null,"NOM","Prénom","Sigle","Vict","Def","Classement"]
[5,{"$f":"VLOOKUP($A4,Engagés!$A$1:$E$380,3,FALSE)","v":"BAYLE"},{"$f":"VLOOKUP($A4,Engagés!$A$1:$E$380,4,FALSE)","v":"ALEXANDRE"},{"$f":"VLOOKUP($A4,Engagés!$A$1:$E$380,5,FALSE)","v":"75-4-FENP"},null,null,"1er"]
[12,{"$f":"VLOOKUP($A5,Engagés!$A$1:$E$380,3,FALSE)","v":"CORNET"},{"$f":"VLOOKUP($A5,Engagés!$A$1:$E$380,4,FALSE)","v":"ACHILLE"},{"$f":"VLOOKUP($A5,Engagés!$A$1:$E$380,5,FALSE)","v":"92-4-SDN"},null,null,"2ème"]
[21,{"$f":"VLOOKUP($A6,Engagés!$A$1:$E$380,3,FALSE)","v":"CAPELLE"},{"$f":"VLOOKUP($A6,Engagés!$A$1:$E$380,4,FALSE)","v":"TIMOTHEE"},{"$f":"VLOOKUP($A6,Engagés!$A$1:$E$380,5,FALSE)","v":"75-3-SUPA"},null,null,"4ème"]
[28,{"$f":"VLOOKUP($A7,Engagés!$A$1:$E$380,3,FALSE)","v":"COULANGE"},{"$f":"VLOOKUP($A7,Engagés!$A$1:$E$380,4,FALSE)","v":"ANATOLE"},{"$f":"VLOOKUP($A7,Engagés!$A$1:$E$380,5,FALSE)","v":"75-4-LMAP"},null,null,"3ème"]
["Si poule de 4 joueurs alors…"]
["Déroulement",null,null,"Joueurs A contre Joueur B",null,"Vainqueur","Score"]
["Match 1",null,null,{"$f":"B4","v":"BAYLE"},{"$f":"B7","v":"COULANGE"},0]
{"$rows_left_out":15}
{"sheet":"Poule 6","index":6,"n_rows":24,"n_cols":7,"rows_kept":24,"cut":false,"hidden":false,"merged":[[12,0,12,2],[13,0,13,6],[0,0,0,2],[0,3,0,4],[10,0,10,2],[11,0,11,2],[1,0,1,2],[1,3,1,6],[7,0,7,6],[8,0,8,2],[8,3,8,4],[9,0,9,2],[20,0,20,1],[20,2,20,3],[20,4,20,5],[14,0,14,2],[14,3,14,4],[15,0,15,2],[18,4,18,6],[19,0,19,1],[19,2,19,3],[19,4,19,5],[16,0,16,2],[17,0,17,2],[18,0,18,3],[23,0,23,1],[23,2,23,3],[23,4,23,5],[21,0,21,1],[21,2,21,3],[21,4,21,5],[22,0,22,1],[22,2,22,3],[22,4,22,5]]}
[{"$f":"Engagés!C1","v":"TENNIS DE TABLE"},null,null,{"$f":"Engagés!C3","v":0}]
["POULE 6"]
[null,"NOM","Prénom","Sigle","Vict","Def","Classement"]
[6,{"$f":"VLOOKUP($A4,Engagés!$A$1:$E$380,3,FALSE)","v":"OLIVIER"},{"$f":"VLOOKUP($A4,Engagés!$A$1:$E$380,4,FALSE)","v":"QUENTIN"},{"$f":"VLOOKUP($A4,Engagés!$A$1:$E$380,5,FALSE)","v":"92-4-SDN"},null,null,"2ème"]
[11,{"$f":"VLOOKUP($A5,Engagés!$A$1:$E$380,3,FALSE)","v":"BARSOUM"},{"$f":"VLOOKUP($A5,Engagés!$A$1:$E$380,4,FALSE)","v":"GABRIEL"},{"$f":"VLOOKUP($A5,Engagés!$A$1:$E$380,5,FALSE)","v":"75-4-LMAP"},null,null,"1er"]
[22,{"$f":"VLOOKUP($A6,Engagés!$A$1:$E$380,3,FALSE)","v":0},{"$f":"VLOOKUP($A6,Engagés!$A$1:$E$380,4,FALSE)","v":0},{"$f":"VLOOKUP($A6,Engagés!$A$1:$E$380,5,FALSE)","v":0},null,null,"4ème"]
[27,{"$f":"VLOOKUP($A7,Engagés!$A$1:$E$380,3,FALSE)","v":"JAFFREDOU-DELOBETTE"},{"$f":"VLOOKUP($A7,Engagés!$A$1:$E$380,4,FALSE)","v":"ELOUAN"},{"$f":"VLOOKUP($A7,Engagés!$A$1:$E$380,5,FALSE)","v":"75-3-SUPA"},null,null,"3ème"]
["Si poule de 4 joueurs alors…"]
["Déroulement",null,null,"Joueurs A contre Joueur B",null,"Vainqueur","Score"]
["Match 1",null,null,{"$f":"B4","v":"OLIVIER"},{"$f":"B7","v":"JAFFREDOU-DELOBETTE"},0]
{"$rows_left_out":15}
{"sheet":"Poule 7","index":7,"n_rows":24,"n_cols":7,"rows_kept":24,"cut":false,"hidden":false,"merged":[[12,0,12,2],[13,0,13,6],[0,0,0,2],[0,3,0,4],[10,0,10,2],[11,0,11,2],[1,0,1,2],[1,3,1,6],[7,0,7,6],[8,0,8,2],[8,3,8,4],[9,0,9,2],[20,0,20,1],[20,2,20,3],[20,4,20,5],[14,0,14,2],[14,3,14,4],[15,0,15,2],[18,4,18,6],[19,0,19,1],[19,2,19,3],[19,4,19,5],[16,0,16,2],[17,0,17,2],[18,0,18,3],[23,0,23,1],[23,2,23,3],[23,4,23,5],[21,0,21,1],[21,2,21,3],[21,4,21,5],[22,0,22,1],[22,2,22,3],[22,4,22,5]]}
[{"$f":"Engagés!C1","v":"TENNIS DE TABLE"},null,null,{"$f":"Engagés!C3","v":0}]
["POULE 7"]
[null,"NOM","Prénom","Sigle","Vict","Def","Classement"]
[7,{"$f":"VLOOKUP($A4,Engagés!$A$1:$E$380,3,FALSE)","v":"JUMERT"},{"$f":"VLOOKUP($A4,Engagés!$A$1:$E$380,4,FALSE)","v":"LOUIS"},{"$f":"VLOOKUP($A4,Engagés!$A$1:$E$380,5,FALSE)","v":"75-4-LMAP"},null,null,"1er"]
[10,{"$f":"VLOOKUP($A5,Engagés!$A$1:$E$380,3,FALSE)","v":"MOLINARO"},{"$f":"VLOOKUP($A5,Engagés!$A$1:$E$380,4,FALSE)","v":"NICOLA"},{"$f":"VLOOKUP($A5,Engagés!$A$1:$E$380,5,FALSE)","v":"92-4-SDN"},null,null,"2ème"]
[23,{"$f":"VLOOKUP($A6,Engagés!$A$1:$E$380,3,FALSE)","v":"MICHEL"},{"$f":"VLOOKUP($A6,Engagés!$A$1:$E$380,4,FALSE)","v":"JOSEPH"},{"$f":"VLOOKUP($A6,Engagés!$A$1:$E$380,5,FALSE)","v":"75-4-LMAP"},null,null,"3ème"]
[26,{"$f":"VLOOKUP($A7,Engagés!$A$1:$E$380,3,FALSE)","v":0},{"$f":"VLOOKUP($A7,Engagés!$A$1:$E$380,4,FALSE)","v":0},{"$f":"VLOOKUP($A7,Engagés!$A$1:$E$380,5,FALSE)","v":0},null,null,"4ème"]
["Si poule de 4 joueurs alors…"]
["Déroulement",null,null,"Joueurs A contre Joueur B",null,"Vainqueur","Score"]
["Match 1",null,null,{"$f":"B4","v":"JUMERT"},{"$f":"B7","v":0},0]
{"$rows_left_out":15}
{"sheet":"Poule 8","index":8,"n_rows":24,"n_cols":7,"rows_kept":24,"cut":false,"hidden":false,"merged":[[12,0,12,2],[13,0,13,6],[0,0,0,2],[0,3,0,4],[10,0,10,2],[11,0,11,2],[1,0,1,2],[1,3,1,6],[7,0,7,6],[8,0,8,2],[8,3,8,4],[9,0,9,2],[20,0,20,1],[20,2,20,3],[20,4,20,5],[14,0,14,2],[14,3,14,4],[15,0,15,2],[18,4,18,6],[19,0,19,1],[19,2,19,3],[19,4,19,5],[16,0,16,2],[17,0,17,2],[18,0,18,3],[23,0,23,1],[23,2,23,3],[23,4,23,5],[21,0,21,1],[21,2,21,3],[21,4,21,5],[22,0,22,1],[22,2,22,3],[22,4,22,5]]}
[{"$f":"Engagés!C1","v":"TENNIS DE TABLE"},null,null,{"$f":"Engagés!C3","v":0}]
["POULE 8"]
[null,"NOM","Prénom","Sigle","Vict","Def","Classement"]
[8,{"$f":"VLOOKUP($A4,Engagés!$A$1:$E$380,3,FALSE)","v":"GIRAT"},{"$f":"VLOOKUP($A4,Engagés!$A$1:$E$380,4,FALSE)","v":"BASILE"},{"$f":"VLOOKUP($A4,Engagés!$A$1:$E$380,5,FALSE)","v":"75-4-LMAP"},null,null,"1er"]
[9,{"$f":"VLOOKUP($A5,Engagés!$A$1:$E$380,3,FALSE)","v":"HUIBAN - NACCACHE"},{"$f":"VLOOKUP($A5,Engagés!$A$1:$E$380,4,FALSE)","v":"KENTIN"},{"$f":"VLOOKUP($A5,Engagés!$A$1:$E$380,5,FALSE)","v":"92-4-SDN"},null,null,"3ème"]
[24,{"$f":"VLOOKUP($A6,Engagés!$A$1:$E$380,3,FALSE)","v":"LEPONT"},{"$f":"VLOOKUP($A6,Engagés!$A$1:$E$380,4,FALSE)","v":"BASILE"},{"$f":"VLOOKUP($A6,Engagés!$A$1:$E$380,5,FALSE)","v":"75-4-LMAP"},null,null,"2ème"]
[25,{"$f":"VLOOKUP($A7,Engagés!$A$1:$E$380,3,FALSE)","v":0},{"$f":"VLOOKUP($A7,Engagés!$A$1:$E$380,4,FALSE)","v":0},{"$f":"VLOOKUP($A7,Engagés!$A$1:$E$380,5,FALSE)","v":0},null,null,"4ème"]
["Si poule de 4 joueurs alors…"]
["Déroulement",null,null,"Joueurs A contre Joueur B",null,"Vainqueur","Score"]
["Match 1",null,null,{"$f":"B4","v":"GIRAT"},{"$f":"B7","v":0},0]
{"$rows_left_out":15}
{"sheet":"Résultats de poule","index":9,"n_rows":10,"n_cols":16,"rows_kept":10,"cut":false,"hidden":false,"merged":[[0,0,0,3],[0,4,0,7],[0,8,0,11],[0,12,0,15],[5,0,5,3],[5,4,5,7],[5,8,5,11],[5,12,5,15]]}
["Poule 1",null,null,null,"Poule 2",null,null,null,"Poule 3",null,null,null,"Poule 4"]
["1er",{"$f":"'Poule 1'!$C21","v":"LE METTER"},{"$f":"'Poule 1'!$E21","v":"THEOPHILE"},{"$f":"'Poule 1'!$G21","v":"75-3-SUPA"},"1er",{"$f":"'Poule 2'!$C21","v":"BOUTEMY"},{"$f":"'Poule 2'!$E21","v":"MALO"},{"$f":"'Poule 2'!$G21","v":"92-4-SDN"},"1er",{"$f":"'Poule 3'!$C21","v":"LEPELTIER"},{"$f":"'Poule 3'!$E21","v":"CORENTIN"},{"$f":"'Poule 3'!$G21","v":"92-4-SDN"},"1er",{"$f":"'Poule 4'!$C21","v":"HEBRAUD"},{"$f":"'Poule 4'!$E21","v":"CLEMENT"},{"$f":"'Poule 4'!$G21","v":"92-4-SDN"}]
["2ème",{"$f":"'Poule 1'!$C22","v":"MIQUEU"},{"$f":"'Poule 1'!$E22","v":"LOUIS"},{"$f":"'Poule 1'!$G22","v":"75-4-LMAP"},"2ème",{"$f":"'Poule 2'!$C22","v":"DIEHL"},{"$f":"'Poule 2'!$E22","v":"ALEXANDROS"},{"$f":"'Poule 2'!$G22","v":"75-4-LMAP"},"2ème",{"$f":"'Poule 3'!$C22","v":"BACOT"},{"$f":"'Poule 3'!$E22","v":"PAUL EDOUARD"},{"$f":"'Poule 3'!$G22","v":"75-4-LMAP"},"2ème",{"$f":"'Poule 4'!$C22","v":"DEHAIS"},{"$f":"'Poule 4'!$E22","v":"AURELIEN"},{"$f":"'Poule 4'!$G22","v":"75-4-LMAP"}]
["3ème",{"$f":"'Poule 1'!$C23","v":"MANSOUR ABDALLA"},{"$f":"'Poule 1'!$E23","v":"IHAB"},{"$f":"'Poule 1'!$G23","v":"92-4-SDN"},"3ème",{"$f":"'Poule 2'!$C23","v":"BLANCHET"},{"$f":"'Poule 2'!$E23","v":"MARIN"},{"$f":"'Poule 2'!$G23","v":"75-3-SUPA"},"3ème",{"$f":"'Poule 3'!$C23","v":"NELSON"},{"$f":"'Poule 3'!$E23","v":"SAMUEL"},{"$f":"'Poule 3'!$G23","v":"75-3-SUPA"},"3ème",{"$f":"'Poule 4'!$C23","v":"MATHIAN"},{"$f":"'Poule 4'!$E23","v":"ALEC"},{"$f":"'Poule 4'!$G23","v":"75-3-SUPA"}]
["4ème",{"$f":"'Poule 1'!$C24","v":0},{"$f":"'Poule 1'!$E24","v":0},{"$f":"'Poule 1'!$G24","v":0},"4ème",{"$f":"'Poule 2'!$C24","v":0},{"$f":"'Poule 2'!$E24","v":0},{"$f":"'Poule 2'!$G24","v":0},"4ème",{"$f":"'Poule 3'!$C24","v":0},{"$f":"'Poule 3'!$E24","v":0},{"$f":"'Poule 3'!$G24","v":0},"4ème",{"$f":"'Poule 4'!$C24","v":0},{"$f":"'Poule 4'!$E24","v":0},{"$f":"'Poule 4'!$G24","v":0}]
["Poule 5",null,null,null,"Poule 6",null,null,null,"Poule 7",null,null,null,"Poule 8"]
["1er",{"$f":"'Poule 5'!$C21","v":"BAYLE"},{"$f":"'Poule 5'!$E21","v":"ALEXANDRE"},{"$f":"'Poule 5'!$G21","v":"75-4-FENP"},"1er",{"$f":"'Poule 6'!$C21","v":"BARSOUM"},{"$f":"'Poule 6'!$E21","v":"GABRIEL"},{"$f":"'Poule 6'!$G21","v":"75-4-LMAP"},"1er",{"$f":"'Poule 7'!$C21","v":"JUMERT"},{"$f":"'Poule 7'!$E21","v":"LOUIS"},{"$f":"'Poule 7'!$G21","v":"75-4-LMAP"},"1er",{"$f":"'Poule 8'!$C21","v":"GIRAT"},{"$f":"'Poule 8'!$E21","v":"BASILE"},{"$f":"'Poule 8'!$G21","v":"75-4-LMAP"}]
["2ème",{"$f":"'Poule 5'!$C22","v":"CORNET"},{"$f":"'Poule 5'!$E22","v":"ACHILLE"},{"$f":"'Poule 5'!$G22","v":"92-4-SDN"},"2ème",{"$f":"'Poule 6'!$C22","v":"OLIVIER"},{"$f":"'Poule 6'!$E22","v":"QUENTIN"},{"$f":"'Poule 6'!$G22","v":"92-4-SDN"},"2ème",{"$f":"'Poule 7'!$C22","v":"MOLINARO"},{"$f":"'Poule 7'!$E22","v":"NICOLA"},{"$f":"'Poule 7'!$G22","v":"92-4-SDN"},"2ème",{"$f":"'Poule 8'!$C22","v":"LEPONT"},{"$f":"'Poule 8'!$E22","v":"BASILE"},{"$f":"'Poule 8'!$G22","v":"75-4-LMAP"}]
["3ème",{"$f":"'Poule 5'!$C23","v":"COULANGE"},{"$f":"'Poule 5'!$E23","v":"ANATOLE"},{"$f":"'Poule 5'!$G23","v":"75-4-LMAP"},"3ème",{"$f":"'Poule 6'!$C23","v":"JAFFREDOU-DELOBETTE"},{"$f":"'Poule 6'!$E23","v":"ELOUAN"},{"$f":"'Poule 6'!$G23","v":"75-3-SUPA"},"3ème",{"$f":"'Poule 7'!$C23","v":"MICHEL"},{"$f":"'Poule 7'!$E23","v":"JOSEPH"},{"$f":"'Poule 7'!$G23","v":"75-4-LMAP"},"3ème",{"$f":"'Poule 8'!$C23","v":"HUIBAN - NACCACHE"},{"$f":"'Poule 8'!$E23","v":"KENTIN"},{"$f":"'Poule 8'!$G23","v":"92-4-SDN"}]
["4ème",{"$f":"'Poule 5'!$C24","v":"CAPELLE"},{"$f":"'Poule 5'!$E24","v":"TIMOTHEE"},{"$f":"'Poule 5'!$G24","v":"75-3-SUPA"},"4ème",{"$f":"'Poule 6'!$C24","v":0},{"$f":"'Poule 6'!$E24","v":0},{"$f":"'Poule 6'!$G24","v":0},"4ème",{"$f":"'Poule 7'!$C24","v":0},{"$f":"'Poule 7'!$E24","v":0},{"$f":"'Poule 7'!$G24","v":0},"4ème",{"$f":"'Poule 8'!$C24","v":0},{"$f":"'Poule 8'!$E24","v":0},{"$f":"'Poule 8'!$G24","v":0}]
{"$rows_left_out":1}
{"sheet":"Tableau","index":10,"n_rows":92,"n_cols":34,"rows_kept":92,"cut":false,"hidden":false,"merged":[[8,10,8,11],[50,20,50,21],[16,10,16,11],[23,10,23,11],[33,10,33,11],[40,10,40,11],[48,10,48,11],[10,20,10,21],[30,32,30,33],[0,16,0,19],[15,29,15,30],[0,0,0,14],[31,29,31,30],[10,1,10,2],[1,4,1,5],[0,20,0,33],[16,26,16,27],[23,23,23,24],[3,20,3,21],[18,20,18,21],[29,4,29,5],[25,20,25,21],[1,10,1,11],[9,23,9,24],[55,10,55,11],[33,4,33,5],[42,1,42,2],[59,29,59,30],[55,23,55,24],[47,29,47,30],[35,20,35,21],[42,20,42,21],[41,23,41,24],[48,26,48,27],[57,20,57,21]]}
["REPECHAGES ET MATCHS DE CLASSEMENT",null,null,null,null,null,null,null,null,null,null,null,null,null,null,null,"1er tour de tableau",null,null,null,"TABLEAU PRINCIPAL"]
[]
[]
[null,null,null,null,null,null,null,null,null,null,null,null,null,null,null,null,"1er poule 1",{"$f":"'Résultats de poule'!B2","v":"LE METTER"},{"$f":"'Résultats de poule'!D2","v":"75-3-SUPA"},"V","1/8 de finale 1"]
[null,null,null,null,null,null,null,null,null,null,null,null,null,{"$f":"IF(T4=\"\",\"\",IF(T4=\"p\",S4,S5))","v":0},{"$f":"IF(T4=\"\",\"\",IF(T4=\"p\",R4,R5))","v":0},null,"4ème poule 8",{"$f":"'Résultats de poule'!N10","v":0},{"$f":"'Résultats de poule'!P10","v":0},"P",{"$f":"IF(T4=\"\",\"\",IF(T4=\"v\",R4,R5))","v":"LE METTER"},{"$f":"IF(T4=\"\",\"\",IF(T4=\"v\",S4,S5))","v":"75-3-SUPA"},"V"]
[null,null,null,null,null,null,null,null,null,null,{"$f":"IF(M5=\"\",\"\",IF(M5=\"v\",N5,N7))","v":""},{"$f":"IF(M5=\"\",\"\",IF(M5=\"v\",O5,O7))","v":""},null,null,null,null,null,null,null,null,null,null,null,{"$f":"IF(W5=\"\",\"\",IF(W5=\"v\",U5,U7))","v":"LE METTER"},{"$f":"IF(W5=\"\",\"\",IF(W5=\"v\",V5,V7))","v":"75-3-SUPA"},"V"]
[null,null,null,null,null,null,null,null,null,null,null,null,null,{"$f":"IF(T7=\"\",\"\",IF(T7=\"p\",S7,S8))","v":"75-3-SUPA"},{"$f":"IF(T7=\"\",\"\",IF(T7=\"p\",R7,R8))","v":"NELSON"},null,"3ème poule 3",{"$f":"'Résultats de poule'!J4","v":"NELSON"},{"$f":"'Résultats de poule'!L4","v":"75-3-SUPA"},"P",{"$f":"IF(T7=\"\",\"\",IF(T7=\"v\",R7,R8))","v":"OLIVIER"},{"$f":"IF(T7=\"\",\"\",IF(T7=\"v\",S7,S8))","v":"92-4-SDN"},"P"]
[null,null,null,null,null,null,null,null,null,null,null,null,null,null,null,null,"2ème poule 6",{"$f":"'Résultats de poule'!F8","v":"OLIVIER"},{"$f":"'Résultats de poule'!H8","v":"92-4-SDN"},"V"]
[null,null,null,null,null,null,null,{"$f":"IF(J6=\"\",\"\",IF(J6=\"v\",K6,K13))","v":""},{"$f":"IF(J6=\"\",\"\",IF(J6=\"v\",L6,L13))","v":""}]
[null,null,null,null,null,null,null,null,null,null,null,null,null,null,null,null,null,null,null,null,null,null,null,"1/4 finale 1",null,null,{"$f":"IF(Z6=\"\",\"\",IF(Z6=\"v\",X6,X13))","v":"LE METTER"},{"$f":"IF(Z6=\"\",\"\",IF(Z6=\"v\",Y6,Y13))","v":"75-3-SUPA"},"V"]
{"$rows_left_out":83}
{"sheet":"Classement","index":11,"n_rows":28,"n_cols":4,"rows_kept":28,"cut":false,"hidden":false,"merged":[[1,0,1,2],[0,0,0,2],[11,0,18,0],[19,0,27,0]]}
[{"$f":"IF(Engagés!A1=\"\",\"\",Engagés!A1)","v":"Championnat Territoire IDF"}]
[{"$f":"IF(Engagés!E3=\"\",\"\",Engagés!E3)","v":"CJG ELITE"}]
["CLASSEMENT","NOMS","Etablissement"]
["1er",{"$f":"Tableau!AG32","v":"LE METTER"},{"$f":"Tableau!AH32","v":"75-3-SUPA"},"Q"]
["2ème",{"$f":"IF(Tableau!$AF$17=\"\",\"\",IF(Tableau!$AF$17=\"p\",Tableau!$AD$17,Tableau!$AD$49))","v":"BOUTEMY"},{"$f":"IF(Tableau!$AF$17=\"\",\"\",IF(Tableau!$AF$17=\"p\",Tableau!$AE$17,Tableau!$AE$49))","v":"92-4-SDN"},"Q"]
["3ème",{"$f":"Tableau!AG62","v":"LEPELTIER"},{"$f":"Tableau!AH62","v":"92-4-SDN"},"Q"]
["4ème",{"$f":"IF(Tableau!AF61=\"\",\"\",IF(Tableau!$AF$61=\"p\",Tableau!$AD$61,Tableau!$AD$63))","v":"HEBRAUD"},{"$f":"IF(Tableau!AF61=\"\",\"\",IF(Tableau!$AF$61=\"p\",Tableau!$AE$61,Tableau!$AE$63))","v":"92-4-SDN"},"Q"]
["5ème",{"$f":"Tableau!AG79","v":"BAYLE"},{"$f":"Tableau!AH79","v":"75-4-FENP"}]
["6ème",{"$f":"IF(Tableau!AF76=\"\",\"\",IF(Tableau!$AF$76=\"p\",Tableau!$AD$76,Tableau!$AD$82))","v":"MIQUEU"},{"$f":"IF(Tableau!$AF$76=\"\",\"\",IF(Tableau!$AF$76=\"p\",Tableau!$AE$76,Tableau!$AE$82))","v":"75-4-LMAP"}]
["7ème",{"$f":"Tableau!AD86","v":"JUMERT"},{"$f":"Tableau!AE86","v":"75-4-LMAP"}]
{"$rows_left_out":19}
{"sheet":"Feuille de match","index":12,"n_rows":49,"n_cols":10,"rows_kept":49,"cut":false,"hidden":false,"merged":[[0,1,0,3],[0,7,0,9],[1,2,13,2],[1,8,13,8],[2,0,2,1],[2,3,2,4],[2,6,2,7],[2,9,2,10],[4,0,4,1],[4,3,4,4],[4,6,4,7],[4,9,4,10],[5,0,5,1],[5,3,5,4],[5,6,5,7],[5,9,5,10],[7,0,7,1],[7,3,7,4],[7,6,7,7],[7,9,7,10],[8,0,8,1],[8,3,8,4],[8,6,8,7],[8,9,8,10],[21,6,21,7],[21,9,21,10],[14,0,15,0],[14,1,15,3],[14,6,15,6],[14,7,15,9],[17,1,17,3],[17,7,17,9],[22,0,22,1],[22,3,22,4],[22,6,22,7],[22,9,22,10],[24,0,24,1],[24,3,24,4],[24,6,24,7],[24,9,24,10],[18,2,30,2],[18,8,30,8],[19,0,19,1],[19,3,19,4],[19,6,19,7],[19,9,19,10],[21,0,21,1],[21,3,21,4],[25,0,25,1],[25,3,25,4],[25,6,25,7],[25,9,25,10],[31,0,32,0],[31,1,32,3],[31,6,32,6],[31,7,32,9],[34,1,34,3],[34,7,34,9],[35,2,47,2],[35,8,47,8],[36,0,36,1],[36,3,36,4],[36,6,36,7],[36,9,36,10],[38,0,38,1],[38,3,38,4],[38,6,38,7],[38,9,38,10],[39,0,39,1],[39,3,39,4],[39,6,39,7],[39,9,39,10],[48,0,49,0],[48,1,49,3],[48,6,49,6],[48,7,49,9],[41,0,41,1],[41,3,41,4],[41,6,41,7],[41,9,41,10],[42,0,42,1],[42,3,42,4],[42,6,42,7],[42,9,42,10]]}
[null,"Tennis de Table",null,null,null,null,null,"Tennis de Table"]
[]
["Catégorie",null,null,{"$f":"Engagés!$E$3","v":"CJG ELITE"},null,null,"Catégorie",null,null,{"$f":"Engagés!$E$3","v":"CJG ELITE"}]
[]
["NOM",null,null,"NOM",null,null,"NOM",null,null,"NOM"]
[]
[]
["SIGLE",null,null,"SIGLE",null,null,"SIGLE",null,null,"SIGLE"]
[]
[]
{"$rows_left_out":39}