{"text_format":"1","workbook":"xlsx","n_sheets":16,"sheets":["Calendrier général","Calendrier BG","Cls B1","Cls B2","Cls BMixte","Calendrier MG","Cls M1","Cls M2","Cls Mixte","Calendriers CG","Cls CG","Classements","Indispos profs","Listing profs","Installations","Répart Japy-Frag"],"not_rendered":{"charts":0,"images":0,"macros":0,"external_links":0,"defined_names":1,"comments":0,"pivot_tables":0},"unopened":[],"bounds":{"document_bytes":16777216,"sheet_cells":100000,"rows_first":2000,"rows_last":500,"rows_between":2000,"halvings":0,"cell_chars":16384,"cell_head_chars":4096},"cells_cut":0,"cells_raw":0,"read":"whole","date_system":"1900"}

{"sheet":"Calendrier général","index":0,"n_rows":94,"n_cols":23,"rows_kept":94,"cut":false,"hidden":false,"merged":[[83,8,94,8],[84,12,86,12],[89,12,91,12],[56,8,61,8],[64,12,65,12],[69,12,70,12],[56,9,61,14],[62,8,71,8],[66,9,66,14],[56,1,61,6],[66,1,66,6],[69,1,69,6],[72,1,72,6],[75,1,75,6],[82,0,90,0],[86,4,87,4],[82,1,82,6],[85,1,85,6],[88,1,88,6],[64,4,65,4],[72,0,81,0],[76,4,77,4],[79,1,79,6],[14,0,23,0],[53,9,53,14],[33,9,33,14],[38,9,38,14],[39,12,40,12],[41,12,43,12],[21,1,21,6],[14,1,14,6],[17,1,17,6],[18,4,20,4],[19,9,19,14],[12,8,21,8],[34,12,37,12],[12,9,12,14],[16,9,16,14],[2,0,13,0],[9,9,9,14],[22,9,22,14],[27,12,28,12],[2,8,11,8],[22,8,32,8],[7,4,9,4],[11,1,11,6],[50,1,50,6],[33,8,46,8],[47,1,47,6],[0,17,0,22],[1,21,1,22],[2,17,2,22],[3,20,5,20],[0,9,0,14],[1,13,1,14],[2,16,6,16],[2,9,2,14],[5,9,5,14],[6,12,8,12],[1,5,1,6],[0,1,0,6],[2,1,2,6],[3,4,5,4],[6,1,6,6],[23,16,28,16],[25,9,25,14],[30,9,30,14],[33,0,41,0],[44,4,46,4],[42,0,52,0],[33,1,33,6],[36,1,36,6],[39,1,39,6],[42,1,42,6],[44,9,44,14],[24,1,24,6],[27,1,27,6],[30,1,30,6],[24,0,32,0],[47,9,47,14],[50,9,50,14],[47,8,55,8],[48,4,49,4],[62,1,62,6],[62,9,62,14],[56,0,61,0],[62,0,71,0],[73,12,74,12],[71,9,71,14],[76,12,78,12],[72,8,82,8]]}
[null," CALENDRIER BENJAMINS ",null,null,null,null,null,null,null," CALENDRIER MINIMES",null,null,null,null,null,null,null," CALENDRIER LYCEE"]
["Date","Match","Equipe A","Equipe B","Lieux","Résultats",null,null,"Date","Match","Equipe A","Equipe B","Lieux","Résultats",null,null,"Date","Match","Equipe A","Equipe B","Lieux","Résultats"]
["2021-11-17","DIVISION 1",null,null,null,null,null,null,"2021-11-17","DIVISION 1",null,null,null,null,null,null,"2021-11-17","CADETS"]
[null,5,{"$f":"'Calendrier BG'!C4","v":"LBSI"},{"$f":"'Calendrier BG'!D4","v":"FEN 1"},"LBSI à 14h",{"$f":"'Calendrier BG'!F4","v":13},{"$f":"'Calendrier BG'!G4","v":4},null,null,null,null,null,null,null,null,null,null,1,{"$f":"'Calendriers CG'!C4","v":"SBE"},{"$f":"'Calendriers CG'!D4","v":"SMP"},"LR à 14h",30,26]
[null,15,{"$f":"'Calendrier BG'!C5","v":"LBSI"},{"$f":"'Calendrier BG'!D5","v":"MASS 1"},null,{"$f":"'Calendrier BG'!F5","v":22},{"$f":"'Calendrier BG'!G5","v":4},null,null,null,null,null,null,null,null,null,null,2,{"$f":"'Calendriers CG'!C5","v":"SBE"},{"$f":"'Calendriers CG'!D5","v":"LR"},null,53,10]
[null,3,{"$f":"'Calendrier BG'!C6","v":"MASS 1"},{"$f":"'Calendrier BG'!D6","v":"FEN 1"},null,{"$f":"'Calendrier BG'!F6","v":12},{"$f":"'Calendrier BG'!G6","v":2},null,null,"DIVISION 2 ",null,null,null,null,null,null,null,3,{"$f":"'Calendriers CG'!C6","v":"SMP"},{"$f":"'Calendriers CG'!D6","v":"LR"},null,57,27]
[null,"DIVISION 2 ",null,null,null,null,null,null,null,51,{"$f":"'Calendrier MG'!C7","v":"LBSI"},{"$f":"'Calendrier MG'!D7","v":"MASS 2"},"LBSI à 14h",{"$f":"'Calendrier MG'!F7","v":18},{"$f":"'Calendrier MG'!G7","v":4}]
[null,54,{"$f":"'Calendrier BG'!C8","v":"SJFF 2"},{"$f":"'Calendrier BG'!D8","v":"MASS 2"},"Croix de Nivert TA à 14h",{"$f":"'Calendrier BG'!F8","v":0},{"$f":"'Calendrier BG'!G8","v":6},null,null,54,{"$f":"'Calendrier MG'!C8","v":"FEN 2"},{"$f":"'Calendrier MG'!D8","v":"LBSI"},null,{"$f":"'Calendrier MG'!F8","v":2},{"$f":"'Calendrier MG'!G8","v":18}]
[null,51,{"$f":"'Calendrier BG'!C9","v":"FEN 2"},{"$f":"'Calendrier BG'!D9","v":"MASS 2"},null,{"$f":"'Calendrier BG'!F9","v":0},{"$f":"'Calendrier BG'!G9","v":7},null,null,57,{"$f":"'Calendrier MG'!C9","v":"FEN 2"},{"$f":"'Calendrier MG'!D9","v":"MASS 2"},null,{"$f":"'Calendrier MG'!F9","v":4},{"$f":"'Calendrier MG'!G9","v":20}]
[null,43,{"$f":"'Calendrier BG'!C10","v":"SJFF 2"},{"$f":"'Calendrier BG'!D10","v":"FEN 2"},null,{"$f":"'Calendrier BG'!F10","v":4},{"$f":"'Calendrier BG'!G10","v":6},null,null,"DIVISION FILLE"]
[null,52,{"$f":"'Calendrier BG'!C11","v":"SJG"},{"$f":"'Calendrier BG'!D11","v":"NDF"},"Japy à 14h",{"$f":"'Calendrier BG'!F11","v":27},{"$f":"'Calendrier BG'!G11","v":13}]
[null,"DIVISION MIXTE"]
[null,75,{"$f":"'Calendrier BG'!C13","v":"SJFF 3 (F)"},{"$f":"'Calendrier BG'!D13","v":"MASS 3"},"Croix de Nivert TB à 14h",{"$f":"'Calendrier BG'!F13","v":14},{"$f":"'Calendrier BG'!G13","v":4},null,"2021-11-24","DIVISION 1"]
[null,null,null,null,null,null,null,null,null,7,{"$f":"'Calendrier MG'!C14","v":"SBE 1"},{"$f":"'Calendrier MG'!D14","v":"SBE 2"},"SMP à 14h",{"$f":"'Calendrier MG'!F14","v":0},{"$f":"'Calendrier MG'!G14","v":0}]
["2021-11-24","DIVISION 1"]
[]
[null,null,null,null,null,null,null,null,null,"DIVISION 2 "]
[null,"DIVISION 2 ",null,null,null,null,null,null,null,55,{"$f":"'Calendrier MG'!C18","v":"SJG"},{"$f":"'Calendrier MG'!D18","v":"SJFF 2"},"SJFF à 14h",{"$f":"'Calendrier MG'!F18","v":30},{"$f":"'Calendrier MG'!G18","v":4}]
[null,46,{"$f":"'Calendrier BG'!C19","v":"FEN 2"},{"$f":"'Calendrier BG'!D19","v":"NDF"},"Fragonard à 14h",{"$f":"'Calendrier BG'!F19","v":0},{"$f":"'Calendrier BG'!G19","v":30},null,null,null,null,null,null,{"$f":"IFERROR(VLOOKUP($B18,'Cls B2'!$A$1:$G$15,4,FALSE),\"\")","v":""},{"$f":"IFERROR(VLOOKUP($B18,'Cls B2'!$A$1:$G$15,5,FALSE),\"\")","v":""}]
[null,null,null,null,null,{"$f":"'Calendrier BG'!F20","v":""},{"$f":"'Calendrier BG'!G20","v":""},null,null,"DIVISION FILLE"]
[null,null,null,null,null,{"$f":"'Calendrier BG'!F21","v":""},{"$f":"'Calendrier BG'!G21","v":""}]
[null,"DIVISION MIXTE",null,null,null,null,null,null,null,102,{"$f":"'Calendrier MG'!C22","v":"SJFF"},{"$f":"'Calendrier MG'!D22","v":"SJG"},"SJFF à 14h",{"$f":"'Calendrier MG'!F22","v":12},{"$f":"'Calendrier MG'!G22","v":4}]
[null,null,null,null,null,null,null,null,"2021-12-01","DIVISION 1"]
[null,null,null,null,null,null,null,null,null,11,{"$f":"'Calendrier MG'!C24","v":"MASS 1"},{"$f":"'Calendrier MG'!D24","v":"FEN 1"},"Japy à 14h",{"$f":"'Calendrier MG'!F24","v":21},{"$f":"'Calendrier MG'!G24","v":7},null,"2021-12-01",7,{"$f":"'Calendriers CG'!C14","v":"SBE"},{"$f":"'Calendriers CG'!D14","v":"SMSM"},"SMSM à 14h",36,29]
["2021-12-01","DIVISION 1"]
[null,18,{"$f":"'Calendrier BG'!C26","v":"SJFF 1"},{"$f":"'Calendrier BG'!D26","v":"MASS 1"},"Japy à 14h",{"$f":"'Calendrier BG'!F26","v":10},{"$f":"'Calendrier BG'!G26","v":3},null,null,"DIVISION 2 "]
[null,19,{"$f":"'Calendrier BG'!C27","v":"FEN 1"},{"$f":"'Calendrier BG'!D27","v":"SMSM"},"SMSM à 14h",{"$f":"'Calendrier BG'!F27","v":12},{"$f":"'Calendrier BG'!G27","v":7},null,null,48,{"$f":"'Calendrier MG'!C27","v":"SJG"},{"$f":"'Calendrier MG'!D27","v":"LBSI"},"LBSI à 14h",{"$f":"'Calendrier MG'!F27","v":11},{"$f":"'Calendrier MG'!G27","v":30}]
[null,"DIVISION 2 ",null,null,null,null,null,null,null,45,{"$f":"'Calendrier MG'!C28","v":"MASS 2"},{"$f":"'Calendrier MG'!D28","v":"SJFF 2"},"SJFF à 14h",{"$f":"'Calendrier MG'!F28","v":22},{"$f":"'Calendrier MG'!G28","v":0}]
[null,50,{"$f":"'Calendrier BG'!C29","v":"NDF"},{"$f":"'Calendrier BG'!D29","v":"SJFF 2"},"SJFF à 14h",{"$f":"'Calendrier BG'!F29","v":16},{"$f":"'Calendrier BG'!G29","v":0},null,null,67,{"$f":"'Calendrier MG'!C29","v":"SJFF 2"},{"$f":"'Calendrier MG'!D29","v":"MASS 3"},null,{"$f":"'Calendrier MG'!F29","v":4},{"$f":"'Calendrier MG'!G29","v":6}]
[null,null,null,null,null,null,null,null,null,63,{"$f":"'Calendrier MG'!C30","v":"SMSM"},{"$f":"'Calendrier MG'!D30","v":"FEN 2"},"SMSM à 14h",{"$f":"'Calendrier MG'!F30","v":9},{"$f":"'Calendrier MG'!G30","v":4}]
[null,"DIVISION MIXTE",null,null,null,null,null,null,null,"DIVISION FILLE"]
[]
[]
["2021-12-08","DIVISION 1",null,null,null,null,null,null,"2021-12-08","DIVISION 1"]
[null,10,{"$f":"'Calendrier BG'!C35","v":"FEN 1"},{"$f":"'Calendrier BG'!D35","v":"LR"},"LR à 14h",{"$f":"'Calendrier BG'!F35","v":12},{"$f":"'Calendrier BG'!G35","v":10},null,null,3,{"$f":"'Calendrier MG'!C35","v":"FEN 1"},{"$f":"'Calendrier MG'!D35","v":"SBE 1"},"Fragonard à 14h",{"$f":"'Calendrier MG'!F35","v":14},{"$f":"'Calendrier MG'!G35","v":9}]
[null,null,null,null,null,null,null,null,null,9,{"$f":"'Calendrier MG'!C36","v":"SBE 2"},{"$f":"'Calendrier MG'!D36","v":"MASS 1"},null,{"$f":"'Calendrier MG'!F36","v":4},{"$f":"'Calendrier MG'!G36","v":15}]
[null,"DIVISION 2 ",null,null,null,null,null,null,null,12,{"$f":"'Calendrier MG'!C37","v":"SBE 1"},{"$f":"'Calendrier MG'!D37","v":"MASS 1"},null,{"$f":"'Calendrier MG'!F37","v":14},{"$f":"'Calendrier MG'!G37","v":17}]
[null,47,{"$f":"'Calendrier BG'!C38","v":"SJG"},{"$f":"'Calendrier BG'!D38","v":"MASS 2"},"LBSI à 14h",{"$f":"'Calendrier BG'!F38","v":42},{"$f":"'Calendrier BG'!G38","v":2},null,null,15,{"$f":"'Calendrier MG'!C38","v":"FEN 1"},{"$f":"'Calendrier MG'!D38","v":"SBE 2"},null,{"$f":"'Calendrier MG'!F38","v":10},{"$f":"'Calendrier MG'!G38","v":15}]
[null,null,null,null,null,{"$f":"IFERROR(VLOOKUP($B39,'Cls B2'!$A$1:$G$15,4,FALSE),\"\")","v":""},{"$f":"IFERROR(VLOOKUP($B39,'Cls B2'!$A$1:$G$15,5,FALSE),\"\")","v":""},null,null,"DIVISION 2 "]
[null,"DIVISION MIXTE",null,null,null,null,null,null,null,69,{"$f":"'Calendrier MG'!C40","v":"LBSI"},{"$f":"'Calendrier MG'!D40","v":"MASS 3"},"LBSI à 14h",{"$f":"'Calendrier MG'!F40","v":41},{"$f":"'Calendrier MG'!G40","v":8}]
[null,null,null,null,null,null,null,null,null,68,{"$f":"'Calendrier MG'!C41","v":"SJG"},{"$f":"'Calendrier MG'!D41","v":"MASS 3"},null,{"$f":"'Calendrier MG'!F41","v":39},{"$f":"'Calendrier MG'!G41","v":2}]
[null,null,null,null,null,null,null,null,null,52,{"$f":"'Calendrier MG'!C42","v":"SJFF 2"},{"$f":"'Calendrier MG'!D42","v":"LR"},"LR à 14h",{"$f":"'Calendrier MG'!F42","v":6},{"$f":"'Calendrier MG'!G42","v":16}]
["2021-12-15","DIVISION 1",null,null,null,null,null,null,null,47,{"$f":"'Calendrier MG'!C43","v":"FEN 2"},{"$f":"'Calendrier MG'!D43","v":"SJFF 2"},null,{"$f":"'Calendrier MG'!F43","v":5},{"$f":"'Calendrier MG'!G43","v":6}]
[null,7,{"$f":"'Calendrier BG'!C44","v":"FEN 1"},{"$f":"'Calendrier BG'!D44","v":"SJFF 1"},"Japy à 14h",{"$f":"'Calendrier BG'!F44","v":18},{"$f":"'Calendrier BG'!G44","v":20},null,null,43,{"$f":"'Calendrier MG'!C44","v":"LR"},{"$f":"'Calendrier MG'!D44","v":"FEN 2"},null,{"$f":"'Calendrier MG'!F44","v":18},{"$f":"'Calendrier MG'!G44","v":10}]
[null,16,{"$f":"'Calendrier BG'!C45","v":"LR"},{"$f":"'Calendrier BG'!D45","v":"SMSM"},"SMSM à 14h",{"$f":"'Calendrier BG'!F45","v":6},{"$f":"'Calendrier BG'!G45","v":4},null,null,"DIVISION FILLE"]
[null,20,{"$f":"'Calendrier BG'!C46","v":"MASS 1"},{"$f":"'Calendrier BG'!D46","v":"LR"},null,{"$f":"'Calendrier BG'!F46","v":4},{"$f":"'Calendrier BG'!G46","v":16}]
[null,9,{"$f":"'Calendrier BG'!C47","v":"SMSM"},{"$f":"'Calendrier BG'!D47","v":"MASS 1"},null,{"$f":"'Calendrier BG'!F47","v":5},{"$f":"'Calendrier BG'!G47","v":4}]
[null,"DIVISION 2 ",null,null,null,null,null,null,"2021-12-15","DIVISION 1"]
[null,55,{"$f":"'Calendrier BG'!C49","v":"FEN 2"},{"$f":"'Calendrier BG'!D49","v":"SJG"},"Japy à 14h",{"$f":"'Calendrier BG'!F49","v":0},{"$f":"'Calendrier BG'!G49","v":74}]
[null,56,{"$f":"'Calendrier BG'!C50","v":"NDF"},{"$f":"'Calendrier BG'!D50","v":"MASS 2"},null,{"$f":"'Calendrier BG'!F50","v":21},{"$f":"'Calendrier BG'!G50","v":4}]
[null,"DIVISION MIXTE",null,null,null,null,null,null,null,"DIVISION 2 "]
[null,73,{"$f":"'Calendrier BG'!C52","v":"LR 2 (F)"},{"$f":"'Calendrier BG'!D52","v":"MASS 3"},"SMSM à 14h",{"$f":"'Calendrier BG'!F52","v":16},{"$f":"'Calendrier BG'!G52","v":4},null,null,46,{"$f":"'Calendrier MG'!C52","v":"SMSM"},{"$f":"'Calendrier MG'!D52","v":"LR"},"SMSM à 14h",{"$f":"'Calendrier MG'!F52","v":0},{"$f":"'Calendrier MG'!G52","v":8}]
[null,null,null,null,null,{"$f":"'Calendrier BG'!F53","v":""},{"$f":"'Calendrier BG'!G53","v":""},null,null,59,{"$f":"'Calendrier MG'!C53","v":"FEN 2"},{"$f":"'Calendrier MG'!D53","v":"SJG"},"Japy à 14h",{"$f":"'Calendrier MG'!F53","v":2},{"$f":"'Calendrier MG'!G53","v":44}]
[null,null,null,null,null,null,null,null,null,"DIVISION FILLE"]
[]
[]
["2021-03-09","ENTRAINEMENT",null,null,null,null,null,null,"2022-03-09","ENTRAINEMENT"]
[]
[]
[]
[]
[]
["2022-03-16","DIVISION 1",null,null,null,null,null,null,"2022-03-16","DIVISION 1"]
[null,4,{"$f":"'Calendrier BG'!C61","v":"SJFF 1"},{"$f":"'Calendrier BG'!D61","v":"LR"},"Croix de Nivert 14h",{"$f":"IFERROR(VLOOKUP($B64,'Cls B1'!$A$1:$G$45,4,FALSE),\"\")","v":0},{"$f":"IFERROR(VLOOKUP($B64,'Cls B1'!$A$1:$G$45,5,FALSE),\"\")","v":0},null,null,6,{"$f":"'Calendrier MG'!C64","v":"SJFF 1"},{"$f":"'Calendrier MG'!D64","v":"FEN 1"},"SJFF à 14h"]
[null,12,{"$f":"'Calendrier BG'!C62","v":"LBSI"},{"$f":"'Calendrier BG'!D62","v":"SMSM"},"LBSI à 14h",{"$f":"IFERROR(VLOOKUP($B65,'Cls B1'!$A$1:$G$45,4,FALSE),\"\")","v":0},{"$f":"IFERROR(VLOOKUP($B65,'Cls B1'!$A$1:$G$45,5,FALSE),\"\")","v":0},null,null,24,{"$f":"'Calendrier MG'!C65","v":"MASS 1"},{"$f":"'Calendrier MG'!D65","v":"SBE 2"},"Japy à 14h"]
[null,36,{"$f":"'Calendrier BG'!C63","v":"MASS 1"},{"$f":"'Calendrier BG'!D63","v":"LBSI"},null,{"$f":"IFERROR(VLOOKUP($B66,'Cls B1'!$A$1:$G$45,4,FALSE),\"\")","v":0},{"$f":"IFERROR(VLOOKUP($B66,'Cls B1'!$A$1:$G$45,5,FALSE),\"\")","v":0},null,null,27,{"$f":"'Calendrier MG'!C66","v":"MASS 1"},{"$f":"'Calendrier MG'!D66","v":"SBE 1"}]
[null,"DIVISION 2 ",null,null,null,null,null,null,null,"DIVISION 2 "]
[null,58,{"$f":"'Calendrier BG'!C65","v":"FEN 2"},{"$f":"'Calendrier BG'!D65","v":"SJFF 2"},"SJFF à 14h",{"$f":"IFERROR(VLOOKUP($B68,'Cls B2'!$A$1:$G$33,4,FALSE),\"\")","v":0},{"$f":"IFERROR(VLOOKUP($B68,'Cls B2'!$A$1:$G$33,5,FALSE),\"\")","v":0},null,null,56,{"$f":"'Calendrier MG'!C68","v":"LBSI"},{"$f":"'Calendrier MG'!D68","v":"SMSM"},"LBSI à 14h"]
[null,67,{"$f":"'Calendrier BG'!C66","v":"NDF"},{"$f":"'Calendrier BG'!D66","v":"SJG"},"Croix de Nivert 14h",{"$f":"IFERROR(VLOOKUP($B69,'Cls B2'!$A$1:$G$33,4,FALSE),\"\")","v":0},{"$f":"IFERROR(VLOOKUP($B69,'Cls B2'!$A$1:$G$33,5,FALSE),\"\")","v":0},null,null,50,{"$f":"'Calendrier MG'!C69","v":"SJG"},{"$f":"'Calendrier MG'!D69","v":"LR"},"Croix de Nivert 14h"]
[null,"DIVISION MIXTE",null,null,null,null,null,null,null,94,{"$f":"'Calendrier MG'!C70","v":"MASS 3"},{"$f":"'Calendrier MG'!D70","v":"FEN 2"},"Japy à 14h"]
[null,77,{"$f":"'Calendrier BG'!C68","v":"SJFF 3 (F)"},{"$f":"'Calendrier BG'!D68","v":"LR 2 (F)"},"Croix de Nivert 14h",{"$f":"IFERROR(VLOOKUP($B71,'Cls BMixte'!$A$1:$G$15,4,FALSE),\"\")","v":0},{"$f":"IFERROR(VLOOKUP($B71,'Cls BMixte'!$A$1:$G$15,5,FALSE),\"\")","v":0},null,null,85,{"$f":"'Calendrier MG'!C71","v":"MASS 2"},{"$f":"'Calendrier MG'!D71","v":"FEN 2"}]
[null,null,null,null,null,{"$f":"IFERROR(VLOOKUP($B72,'Cls BMixte'!$A$1:$G$15,4,FALSE),\"\")","v":""},{"$f":"IFERROR(VLOOKUP($B72,'Cls BMixte'!$A$1:$G$15,5,FALSE),\"\")","v":""},null,null,"DIVISION FILLE"]
["2022-03-23","DIVISION 1",null,null,null,null,null,null,"2022-03-23","DIVISION 1"]
[null,1,{"$f":"'Calendrier BG'!C71","v":"LR"},{"$f":"'Calendrier BG'!D71","v":"LBSI"},"LBSI à 13h45",{"$f":"IFERROR(VLOOKUP($B74,'Cls B1'!$A$1:$G$45,4,FALSE),\"\")","v":0},{"$f":"IFERROR(VLOOKUP($B74,'Cls B1'!$A$1:$G$45,5,FALSE),\"\")","v":0},null,null,4,{"$f":"'Calendrier MG'!C76","v":"SBE 2"},{"$f":"'Calendrier MG'!D76","v":"SJFF 1"},"SMSM à 14h",{"$f":"IFERROR(VLOOKUP($B76,'Cls M1'!$A$1:$G$33,4,FALSE),\"\")","v":""},{"$f":"IFERROR(VLOOKUP($B76,'Cls M1'!$A$1:$G$33,5,FALSE),\"\")","v":""}]
[null,24,{"$f":"'Calendrier BG'!C72","v":"FEN 1"},{"$f":"'Calendrier BG'!D72","v":"MASS 1"},"Fragonard à 14h",{"$f":"IFERROR(VLOOKUP($B75,'Cls B1'!$A$1:$G$45,4,FALSE),\"\")","v":0},{"$f":"IFERROR(VLOOKUP($B75,'Cls B1'!$A$1:$G$45,5,FALSE),\"\")","v":0},null,null,8,{"$f":"'Calendrier MG'!C77","v":"SJFF 1"},{"$f":"'Calendrier MG'!D77","v":"SBE 1"},null,{"$f":"IFERROR(VLOOKUP($B77,'Cls M1'!$A$1:$G$33,4,FALSE),\"\")","v":""},{"$f":"IFERROR(VLOOKUP($B77,'Cls M1'!$A$1:$G$33,5,FALSE),\"\")","v":""}]
[null,"DIVISION 2 ",null,null,null,null,null,null,null,"DIVISION 2 "]
[null,49,{"$f":"'Calendrier BG'!C74","v":"SJG"},{"$f":"'Calendrier BG'!D74","v":"SJFF 2"},"SJFF à 14h",{"$f":"IFERROR(VLOOKUP($B77,'Cls B2'!$A$1:$G$33,4,FALSE),\"\")","v":0},{"$f":"IFERROR(VLOOKUP($B77,'Cls B2'!$A$1:$G$33,5,FALSE),\"\")","v":0},null,null,58,{"$f":"'Calendrier MG'!C79","v":"LR"},{"$f":"'Calendrier MG'!D79","v":"LBSI"},"LBSI à 13h45"]
[null,65,{"$f":"'Calendrier BG'!C75","v":"SJFF 2"},{"$f":"'Calendrier BG'!D75","v":"NDF"},null,{"$f":"IFERROR(VLOOKUP($B78,'Cls B2'!$A$1:$G$33,4,FALSE),\"\")","v":0},{"$f":"IFERROR(VLOOKUP($B78,'Cls B2'!$A$1:$G$33,5,FALSE),\"\")","v":0},null,null,62,{"$f":"'Calendrier MG'!C80","v":"MASS 2"},{"$f":"'Calendrier MG'!D80","v":"LR"}]
[null,66,{"$f":"'Calendrier BG'!C76","v":"MASS 2"},{"$f":"'Calendrier BG'!D76","v":"FEN 2"},"Fragonard à 14h",{"$f":"IFERROR(VLOOKUP($B79,'Cls B2'!$A$1:$G$33,4,FALSE),\"\")","v":0},{"$f":"IFERROR(VLOOKUP($B79,'Cls B2'!$A$1:$G$33,5,FALSE),\"\")","v":0},null,null,79,{"$f":"'Calendrier MG'!C81","v":"MASS 2"},{"$f":"'Calendrier MG'!D81","v":"LBSI"}]
[null,"DIVISION MIXTE",null,null,null,null,null,null,null,49,{"$f":"'Calendrier MG'!C82","v":"SJFF 2"},{"$f":"'Calendrier MG'!D82","v":"SMSM"},"SMSM à 14h"]
[null,79,{"$f":"'Calendrier BG'!C78","v":"MASS 3"},{"$f":"'Calendrier BG'!D78","v":"LR 2 (F)"},"LBSI à 13h45",{"$f":"IFERROR(VLOOKUP($B81,'Cls BMixte'!$A$1:$G$15,4,FALSE),\"\")","v":0},{"$f":"IFERROR(VLOOKUP($B81,'Cls BMixte'!$A$1:$G$15,5,FALSE),\"\")","v":0},null,null,66,{"$f":"'Calendrier MG'!C83","v":"FEN 2"},{"$f":"'Calendrier MG'!D83","v":"MASS 3"},"Fragonard à 14h"]
[null,null,null,null,null,{"$f":"IFERROR(VLOOKUP($B82,'Cls BMixte'!$A$1:$G$15,4,FALSE),\"\")","v":""},{"$f":"IFERROR(VLOOKUP($B82,'Cls BMixte'!$A$1:$G$15,5,FALSE),\"\")","v":""},null,null,"DIVISION FILLE"]
["2022-03-30","DIVISION 1",null,null,null,null,null,null,null,99,{"$f":"'Calendrier MG'!C85","v":"SBE"},{"$f":"'Calendrier MG'!D85","v":"SJFF"},"SMSM à 14h"]
[null,28,{"$f":"'Calendrier BG'!C81","v":"SJFF 1"},{"$f":"'Calendrier BG'!D81","v":"FEN 1"},"SJFF à 14h",{"$f":"IFERROR(VLOOKUP($B84,'Cls B1'!$A$1:$G$45,4,FALSE),\"\")","v":0},{"$f":"IFERROR(VLOOKUP($B84,'Cls B1'!$A$1:$G$45,5,FALSE),\"\")","v":0},null,"2022-03-30","DIVISION 1"]
[null,22,{"$f":"'Calendrier BG'!C82","v":"LBSI"},{"$f":"'Calendrier BG'!D82","v":"LR"},"LR à 14h",{"$f":"IFERROR(VLOOKUP($B85,'Cls B1'!$A$1:$G$45,4,FALSE),\"\")","v":0},{"$f":"IFERROR(VLOOKUP($B85,'Cls B1'!$A$1:$G$45,5,FALSE),\"\")","v":0},null,null,21,{"$f":"'Calendrier MG'!C88","v":"FEN 1"},{"$f":"'Calendrier MG'!D88","v":"SJFF 1"},"Japy à 14h",{"$f":"IFERROR(VLOOKUP($B88,'Cls M1'!$A$1:$G$33,4,FALSE),\"\")","v":""},{"$f":"IFERROR(VLOOKUP($B88,'Cls M1'!$A$1:$G$33,5,FALSE),\"\")","v":""}]
[null,"DIVISION 2 ",null,null,null,null,null,null,null,18,{"$f":"'Calendrier MG'!C89","v":"SBE 1"},{"$f":"'Calendrier MG'!D89","v":"FEN 1"},null,{"$f":"IFERROR(VLOOKUP($B89,'Cls M1'!$A$1:$G$33,4,FALSE),\"\")","v":""},{"$f":"IFERROR(VLOOKUP($B89,'Cls M1'!$A$1:$G$33,5,FALSE),\"\")","v":""}]
[null,58,{"$f":"'Calendrier BG'!C84","v":"FEN 2"},{"$f":"'Calendrier BG'!D84","v":"SJFF 2"},"SJFF à 14h",{"$f":"IFERROR(VLOOKUP($B87,'Cls B2'!$A$1:$G$33,4,FALSE),\"\")","v":0},{"$f":"IFERROR(VLOOKUP($B87,'Cls B2'!$A$1:$G$33,5,FALSE),\"\")","v":0},null,null,19,{"$f":"'Calendrier MG'!C90","v":"SJFF 1"},{"$f":"'Calendrier MG'!D90","v":"SBE 2"},null,{"$f":"IFERROR(VLOOKUP($B90,'Cls M1'!$A$1:$G$33,4,FALSE),\"\")","v":""},{"$f":"IFERROR(VLOOKUP($B90,'Cls M1'!$A$1:$G$33,5,FALSE),\"\")","v":""}]
[null,61,{"$f":"'Calendrier BG'!C85","v":"NDF"},{"$f":"'Calendrier BG'!D85","v":"FEN 2"},null,{"$f":"IFERROR(VLOOKUP($B88,'Cls B2'!$A$1:$G$33,4,FALSE),\"\")","v":0},{"$f":"IFERROR(VLOOKUP($B88,'Cls B2'!$A$1:$G$33,5,FALSE),\"\")","v":0},null,null,"DIVISION 2 "]
[null,"DIVISION MIXTE",null,null,null,null,null,null,null,75,{"$f":"'Calendrier MG'!C92","v":"SJFF 2"},{"$f":"'Calendrier MG'!D92","v":"FEN 2"},"SJFF à 14h",{"$f":"IFERROR(VLOOKUP($B92,'Cls M2'!$A$1:$G$54,4,FALSE),\"\")","v":""},{"$f":"IFERROR(VLOOKUP($B92,'Cls M2'!$A$1:$G$54,5,FALSE),\"\")","v":""}]
[null,null,null,null,null,{"$f":"IFERROR(VLOOKUP($B90,'Cls BMixte'!$A$1:$G$15,4,FALSE),\"\")","v":""},{"$f":"IFERROR(VLOOKUP($B90,'Cls BMixte'!$A$1:$G$15,5,FALSE),\"\")","v":""},null,null,86,{"$f":"'Calendrier MG'!C93","v":"LBSI"},{"$f":"'Calendrier MG'!D93","v":"LR"},"LR à 14h",{"$f":"IFERROR(VLOOKUP($B93,'Cls M2'!$A$1:$G$54,4,FALSE),\"\")","v":""},{"$f":"IFERROR(VLOOKUP($B93,'Cls M2'!$A$1:$G$54,5,FALSE),\"\")","v":""}]
[null,null,null,null,null,{"$f":"IFERROR(VLOOKUP($B91,'Cls BMixte'!$A$1:$G$15,4,FALSE),\"\")","v":""},{"$f":"IFERROR(VLOOKUP($B91,'Cls BMixte'!$A$1:$G$15,5,FALSE),\"\")","v":""},null,null,76,{"$f":"'Calendrier MG'!C94","v":"LBSI"},{"$f":"'Calendrier MG'!D94","v":"SJG"},null,{"$f":"IFERROR(VLOOKUP($B94,'Cls M2'!$A$1:$G$54,4,FALSE),\"\")","v":""},{"$f":"IFERROR(VLOOKUP($B94,'Cls M2'!$A$1:$G$54,5,FALSE),\"\")","v":""}]
[null,null,null,null,null,null,null,null,null,78,{"$f":"'Calendrier MG'!C95","v":"LR"},{"$f":"'Calendrier MG'!D95","v":"SJG"},null,{"$f":"IFERROR(VLOOKUP($B95,'Cls M2'!$A$1:$G$54,4,FALSE),\"\")","v":""},{"$f":"IFERROR(VLOOKUP($B95,'Cls M2'!$A$1:$G$54,5,FALSE),\"\")","v":""}]
[null,null,null,null,null,null,null,null,null,"DIVISION FILLE"]
[null,null,null,null,null,null,null,null,null,105,{"$f":"'Calendrier MG'!C97","v":"SJFF"},{"$f":"'Calendrier MG'!D97","v":"SBE"},"Japy à 14h"]

{"sheet":"Calendrier BG","index":1,"n_rows":88,"n_cols":26,"rows_kept":88,"cut":false,"hidden":false,"merged":[[79,0,87,0],[79,1,79,7],[80,7,81,7],[82,1,82,7],[85,1,85,7],[83,7,84,7],[86,7,87,7],[83,4,84,4],[42,0,52,0],[33,0,41,0],[24,0,32,0],[14,0,23,0],[2,0,13,0],[12,24,12,25],[12,12,12,13],[0,9,0,25],[2,9,2,10],[1,21,1,22],[2,21,2,22],[12,18,12,19],[0,1,0,7],[1,5,1,6],[2,15,2,16],[1,15,1,16],[1,9,1,10],[21,1,21,7],[24,1,24,7],[27,1,27,7],[30,1,30,7],[2,1,2,7],[3,4,5,4],[7,4,9,4],[6,1,6,7],[11,1,11,7],[18,4,20,4],[14,1,14,7],[17,1,17,7],[50,1,50,7],[47,1,47,7],[43,7,46,7],[44,4,46,4],[33,1,33,7],[36,1,36,7],[48,4,49,4],[39,1,39,7],[42,1,42,7],[53,0,58,0],[53,1,58,7],[59,1,59,7],[63,1,63,7],[66,1,66,7],[59,0,68,0],[60,7,61,7],[61,4,62,4],[69,0,78,0],[69,1,69,7],[72,1,72,7],[76,1,76,7],[73,4,74,4]]}
[null," CALENDRIER BENJAMINS ",null,null,null,null,null,null,null,"POULES ET MATCHS BENJAMINS"]
["Date","Match","Equipe A","Equipe B","Lieux","Résultats",null,"Indisponibilités",null,"DIVISION 1",null,null,null,null,null,"DIVISION 2 ",null,null,null,null,null,"DIVISION MIXTE"]
["2021-11-17","DIVISION 1",null,null,null,null,null,null,null,"Etablissements",null,null,null,null,null,"Etablissements",null,null,null,null,null,"Etablissements"]
[null,5,{"$f":"VLOOKUP($B4,$J$13:$N$55,4)","v":"LBSI"},{"$f":"VLOOKUP($B4,$J$13:$N$55,5)","v":"FEN 1"},"LBSI à 14h",{"$f":"IFERROR(VLOOKUP($B4,'Cls B1'!$A$1:$G$45,4,FALSE),\"\")","v":13},{"$f":"IFERROR(VLOOKUP($B4,'Cls B1'!$A$1:$G$45,5,FALSE),\"\")","v":4},null,null,1,"SJFF 1",null,null,null,null,1,"SMP 2",null,null,null,null,1,"SMP 3 (F)"]
[null,15,{"$f":"VLOOKUP($B5,$J$13:$N$55,4)","v":"LBSI"},{"$f":"VLOOKUP($B5,$J$13:$N$55,5)","v":"MASS 1"},null,{"$f":"IFERROR(VLOOKUP($B5,'Cls B1'!$A$1:$G$45,4,FALSE),\"\")","v":22},{"$f":"IFERROR(VLOOKUP($B5,'Cls B1'!$A$1:$G$45,5,FALSE),\"\")","v":4},null,null,2,"LR",null,null,null,null,2,"SJFF 2",null,null,null,null,2,"SJFF 3 (F)"]
[null,3,{"$f":"VLOOKUP($B6,$J$13:$N$55,4)","v":"MASS 1"},{"$f":"VLOOKUP($B6,$J$13:$N$55,5)","v":"FEN 1"},null,{"$f":"IFERROR(VLOOKUP($B6,'Cls B1'!$A$1:$G$45,4,FALSE),\"\")","v":12},{"$f":"IFERROR(VLOOKUP($B6,'Cls B1'!$A$1:$G$45,5,FALSE),\"\")","v":2},null,null,3,"LBSI",null,null,null,null,3,"FEN 2",null,null,null,null,3,"LR 2 (F)"]
[null,"DIVISION 2 ",null,null,null,null,null,null,null,4,"FEN 1",null,null,null,null,4,"NDF",null,null,null,null,4,"MASS 3"]
[null,54,{"$f":"VLOOKUP($B8,$P$13:$T$43,4)","v":"SJFF 2"},{"$f":"VLOOKUP($B8,$P$13:$T$43,5)","v":"MASS 2"},"Croix de Nivert TA à 14h",{"$f":"IFERROR(VLOOKUP($B8,'Cls B2'!$A$1:$G$33,4,FALSE),\"\")","v":0},{"$f":"IFERROR(VLOOKUP($B8,'Cls B2'!$A$1:$G$33,5,FALSE),\"\")","v":6},null,null,5,"SMP 1",null,null,null,null,5,"SJG",null,null,null,null,5]
[null,51,{"$f":"VLOOKUP($B9,$P$13:$T$43,4)","v":"FEN 2"},{"$f":"VLOOKUP($B9,$P$13:$T$43,5)","v":"MASS 2"},null,{"$f":"IFERROR(VLOOKUP($B9,'Cls B2'!$A$1:$G$33,4,FALSE),\"\")","v":0},{"$f":"IFERROR(VLOOKUP($B9,'Cls B2'!$A$1:$G$33,5,FALSE),\"\")","v":7},null,null,6,"SMSM",null,null,null,null,6,"MASS 2"]
[null,43,{"$f":"VLOOKUP($B10,$P$13:$T$43,4)","v":"SJFF 2"},{"$f":"VLOOKUP($B10,$P$13:$T$43,5)","v":"FEN 2"},null,{"$f":"IFERROR(VLOOKUP($B10,'Cls B2'!$A$1:$G$33,4,FALSE),\"\")","v":4},{"$f":"IFERROR(VLOOKUP($B10,'Cls B2'!$A$1:$G$33,5,FALSE),\"\")","v":6},null,null,7,"MASS 1",null,null,null,null,7]
[null,52,{"$f":"VLOOKUP($B11,$P$13:$T$43,4)","v":"SJG"},{"$f":"VLOOKUP($B11,$P$13:$T$43,5)","v":"NDF"},"Japy à 14h",{"$f":"IFERROR(VLOOKUP($B11,'Cls B2'!$A$1:$G$33,4,FALSE),\"\")","v":27},{"$f":"IFERROR(VLOOKUP($B11,'Cls B2'!$A$1:$G$33,5,FALSE),\"\")","v":13},null,null,null,null,null,null,null,null,8]
[null,"DIVISION MIXTE"]
[null,75,{"$f":"VLOOKUP($B13,$V$13:$Z$31,4)","v":"SJFF 3 (F)"},{"$f":"VLOOKUP($B13,$V$13:$Z$31,5)","v":"MASS 3"},"Croix de Nivert TB à 14h",{"$f":"IFERROR(VLOOKUP($B13,'Cls BMixte'!$A$1:$G$15,4,FALSE),\"\")","v":14},{"$f":"IFERROR(VLOOKUP($B13,'Cls BMixte'!$A$1:$G$15,5,FALSE),\"\")","v":4},null,null,"N° Match","Equipe A","Equipe B","Match",null,null,"N° Match","Equipe A","Equipe B","Match",null,null,"N° Match","Equipe A","Equipe B","Match"]
[null,null,{"$f":"VLOOKUP($B14,$V$13:$Z$31,4)","v":{"$error":"#N/A"}},{"$f":"VLOOKUP($B14,$V$13:$Z$31,5)","v":{"$error":"#N/A"}},"LR à 14h",{"$f":"IFERROR(VLOOKUP($B14,'Cls BMixte'!$A$1:$G$15,4,FALSE),\"\")","v":""},{"$f":"IFERROR(VLOOKUP($B14,'Cls BMixte'!$A$1:$G$15,5,FALSE),\"\")","v":""},null,null,1,2,3,{"$f":"VLOOKUP(K14,$J$2:$K$10,2)","v":"LR"},{"$f":"VLOOKUP(L14,$J$2:$K$10,2)","v":"LBSI"},null,43,2,3,{"$f":"VLOOKUP(Q14,$P$2:$Q$10,2)","v":"SJFF 2"},{"$f":"VLOOKUP(R14,$P$2:$Q$10,2)","v":"FEN 2"},null,72,1,2,{"$f":"VLOOKUP(W14,$V$2:$W$11,2)","v":"SMP 3 (F)"},{"$f":"VLOOKUP(X14,$V$2:$W$11,2)","v":"SJFF 3 (F)"}]
["2021-11-24","DIVISION 1",null,null,null,null,null,null,null,2,1,5,{"$f":"VLOOKUP(K15,$J$2:$K$10,2)","v":"SJFF 1"},{"$f":"VLOOKUP(L15,$J$2:$K$10,2)","v":"SMP 1"},null,44,1,5,{"$f":"VLOOKUP(Q15,$P$2:$Q$10,2)","v":"SMP 2"},{"$f":"VLOOKUP(R15,$P$2:$Q$10,2)","v":"SJG"},null,73,3,4,{"$f":"VLOOKUP(W15,$V$2:$W$11,2)","v":"LR 2 (F)"},{"$f":"VLOOKUP(X15,$V$2:$W$11,2)","v":"MASS 3"}]
[null,null,null,null,null,null,null,null,null,3,7,4,"MASS 1","FEN 1",null,45,1,2,"SMP 2","SJFF 2",null,74,1,3,"SMP 3 (F)","LR 2 (F)"]
[null,null,null,null,null,null,null,null,null,4,1,2,"SJFF 1","LR",null,46,3,4,"FEN 2","NDF",null,75,2,4,"SJFF 3 (F)","MASS 3"]
[null,"DIVISION 2 ",null,null,null,null,null,null,null,5,3,4,"LBSI","FEN 1",null,47,5,6,"SJG","MASS 2",null,76,1,4,"SMP 3 (F)","MASS 3"]
[null,46,{"$f":"VLOOKUP($B19,$P$13:$T$43,4)","v":"FEN 2"},{"$f":"VLOOKUP($B19,$P$13:$T$43,5)","v":"NDF"},"Fragonard à 14h",{"$f":"IFERROR(VLOOKUP($B19,'Cls B2'!$A$1:$G$33,4,FALSE),\"\")","v":0},{"$f":"IFERROR(VLOOKUP($B19,'Cls B2'!$A$1:$G$33,5,FALSE),\"\")","v":30},null,null,6,5,6,"SMP 1","SMSM",null,48,4,1,"NDF","SMP 2",null,77,2,3,"SJFF 3 (F)","LR 2 (F)"]
[null,null,{"$f":"VLOOKUP($B20,$P$13:$T$43,4)","v":{"$error":"#N/A"}},{"$f":"VLOOKUP($B20,$P$13:$T$43,5)","v":{"$error":"#N/A"}},null,{"$f":"IFERROR(VLOOKUP($B20,'Cls B2'!$A$1:$G$33,4,FALSE),\"\")","v":""},{"$f":"IFERROR(VLOOKUP($B20,'Cls B2'!$A$1:$G$33,5,FALSE),\"\")","v":""},null,null,7,4,1,"FEN 1","SJFF 1",null,49,5,2,"SJG","SJFF 2",null,78,2,1,"SJFF 3 (F)","SMP 3 (F)"]
[null,null,{"$f":"VLOOKUP($B21,$P$13:$T$43,4)","v":{"$error":"#N/A"}},{"$f":"VLOOKUP($B21,$P$13:$T$43,5)","v":{"$error":"#N/A"}},null,{"$f":"IFERROR(VLOOKUP($B21,'Cls B2'!$A$1:$G$33,4,FALSE),\"\")","v":""},{"$f":"IFERROR(VLOOKUP($B21,'Cls B2'!$A$1:$G$33,5,FALSE),\"\")","v":""},null,null,8,5,2,"SMP 1","LR",null,50,4,2,"NDF","SJFF 2",null,79,4,3,"MASS 3","LR 2 (F)"]
[null,"DIVISION MIXTE",null,null,null,null,null,null,null,9,6,7,"SMSM","MASS 1",null,51,3,6,"FEN 2","MASS 2",null,80,3,1,"LR 2 (F)","SMP 3 (F)"]
[null,null,null,null,null,null,null,null,null,10,4,2,"FEN 1","LR",null,52,5,4,"SJG","NDF",null,81,4,2,"MASS 3","SJFF 3 (F)"]
[null,null,null,null,null,null,null,null,null,11,7,5,"MASS 1","SMP 1",null,53,6,1,"MASS 2","SMP 2",null,82,4,1,"MASS 3","SMP 3 (F)"]
["2021-12-01","DIVISION 1",null,null,null,null,null,null,null,12,3,6,"LBSI","SMSM",null,54,2,6,"SJFF 2","MASS 2",null,83,3,2,"LR 2 (F)","SJFF 3 (F)"]
[null,18,{"$f":"VLOOKUP($B26,$J$13:$N$55,4)","v":"SJFF 1"},{"$f":"VLOOKUP($B26,$J$13:$N$55,5)","v":"MASS 1"},"Japy à 14h",{"$f":"IFERROR(VLOOKUP($B26,'Cls B1'!$A$1:$G$45,4,FALSE),\"\")","v":10},{"$f":"IFERROR(VLOOKUP($B26,'Cls B1'!$A$1:$G$45,5,FALSE),\"\")","v":3},null,null,13,5,4,"SMP 1","FEN 1",null,55,3,5,"FEN 2","SJG",null,84,null,null,{"$f":"VLOOKUP(W26,$V$2:$W$11,2)","v":{"$error":"#N/A"}},{"$f":"VLOOKUP(X26,$V$2:$W$11,2)","v":{"$error":"#N/A"}}]
[null,19,{"$f":"VLOOKUP($B27,$J$13:$N$55,4)","v":"FEN 1"},{"$f":"VLOOKUP($B27,$J$13:$N$55,5)","v":"SMSM"},"SMSM à 14h",{"$f":"IFERROR(VLOOKUP($B27,'Cls B1'!$A$1:$G$45,4,FALSE),\"\")","v":12},{"$f":"IFERROR(VLOOKUP($B27,'Cls B1'!$A$1:$G$45,5,FALSE),\"\")","v":7},null,null,14,6,1,"SMSM","SJFF 1",null,56,4,6,"NDF","MASS 2",null,85,null,null,{"$error":"#N/A"},{"$error":"#N/A"}]
[null,"DIVISION 2 ",null,null,null,null,null,null,null,15,3,7,"LBSI","MASS 1",null,57,1,3,"SMP 2","FEN 2",null,86,null,null,{"$error":"#N/A"},{"$error":"#N/A"}]
[null,50,{"$f":"VLOOKUP($B29,$P$13:$T$43,4)","v":"NDF"},{"$f":"VLOOKUP($B29,$P$13:$T$43,5)","v":"SJFF 2"},"SJFF à 14h",{"$f":"IFERROR(VLOOKUP($B29,'Cls B2'!$A$1:$G$33,4,FALSE),\"\")","v":16},{"$f":"IFERROR(VLOOKUP($B29,'Cls B2'!$A$1:$G$33,5,FALSE),\"\")","v":0},null,null,16,2,6,"LR","SMSM",null,58,3,2,"FEN 2","SJFF 2",null,87,null,null,{"$error":"#N/A"},{"$error":"#N/A"}]
[null,null,null,null,null,null,null,null,null,17,3,5,"LBSI","SMP 1",null,59,5,1,"SJG","SMP 2",null,88,null,null,{"$error":"#N/A"},{"$error":"#N/A"}]
[null,"DIVISION MIXTE",null,null,null,null,null,null,null,18,1,7,"SJFF 1","MASS 1",null,60,2,1,"SJFF 2","SMP 2",null,89,null,null,{"$error":"#N/A"},{"$error":"#N/A"}]
[null,null,null,null,null,null,null,null,null,19,4,6,"FEN 1","SMSM",null,61,4,3,"NDF","FEN 2"]
[null,null,null,null,null,null,null,null,null,20,7,2,"MASS 1","LR",null,62,6,5,"MASS 2","SJG"]
["2021-12-08","DIVISION 1",null,null,null,null,null,null,null,21,1,3,"SJFF 1","LBSI",null,63,1,4,"SMP 2","NDF"]
[null,10,{"$f":"VLOOKUP($B35,$J$13:$N$55,4)","v":"FEN 1"},{"$f":"VLOOKUP($B35,$J$13:$N$55,5)","v":"LR"},"LR à 14h",{"$f":"IFERROR(VLOOKUP($B35,'Cls B1'!$A$1:$G$45,4,FALSE),\"\")","v":12},{"$f":"IFERROR(VLOOKUP($B35,'Cls B1'!$A$1:$G$45,5,FALSE),\"\")","v":10},null,null,22,3,2,"LBSI","LR",null,64,2,5,"SJFF 2","SJG"]
[null,null,null,null,null,null,null,null,null,23,5,1,"SMP 1","SJFF 1",null,65,2,4,"SJFF 2","NDF"]
[null,"DIVISION 2 ",null,null,null,null,null,null,null,24,4,7,"FEN 1","MASS 1",null,66,6,3,"MASS 2","FEN 2"]
[null,47,{"$f":"VLOOKUP($B38,$P$13:$T$43,4)","v":"SJG"},{"$f":"VLOOKUP($B38,$P$13:$T$43,5)","v":"MASS 2"},"LBSI à 14h",{"$f":"IFERROR(VLOOKUP($B38,'Cls B2'!$A$1:$G$33,4,FALSE),\"\")","v":42},{"$f":"IFERROR(VLOOKUP($B38,'Cls B2'!$A$1:$G$33,5,FALSE),\"\")","v":2},null,null,25,2,1,"LR","SJFF 1",null,67,4,5,"NDF","SJG"]
[null,null,null,null,null,{"$f":"IFERROR(VLOOKUP($B39,'Cls B2'!$A$1:$G$15,4,FALSE),\"\")","v":""},{"$f":"IFERROR(VLOOKUP($B39,'Cls B2'!$A$1:$G$15,5,FALSE),\"\")","v":""},null,null,26,4,3,"FEN 1","LBSI",null,68,1,6,"SMP 2","MASS 2"]
[null,"DIVISION MIXTE",null,null,null,null,null,null,null,27,6,5,"SMSM","SMP 1",null,69,6,2,"MASS 2","SJFF 2"]
[null,null,null,null,null,null,null,null,null,28,1,4,"SJFF 1","FEN 1",null,70,5,3,"SJG","FEN 2"]
[null,null,null,null,null,null,null,null,null,29,2,5,"LR","SMP 1",null,71,6,4,"MASS 2","NDF"]
["2021-12-15","DIVISION 1",null,null,null,null,null,null,null,30,7,6,"MASS 1","SMSM",null,72,3,1,"FEN 2","SMP 2"]
[null,7,{"$f":"VLOOKUP($B44,$J$13:$N$55,4)","v":"FEN 1"},{"$f":"VLOOKUP($B44,$J$13:$N$55,5)","v":"SJFF 1"},"Japy à 14h",{"$f":"IFERROR(VLOOKUP($B44,'Cls B1'!$A$1:$G$45,4,FALSE),\"\")","v":18},{"$f":"IFERROR(VLOOKUP($B44,'Cls B1'!$A$1:$G$45,5,FALSE),\"\")","v":20},"LBSI",null,31,2,4,"LR","FEN 1"]
[null,16,{"$f":"VLOOKUP($B45,$J$13:$N$55,4)","v":"LR"},{"$f":"VLOOKUP($B45,$J$13:$N$55,5)","v":"SMSM"},"SMSM à 14h",{"$f":"IFERROR(VLOOKUP($B45,'Cls B1'!$A$1:$G$45,4,FALSE),\"\")","v":6},{"$f":"IFERROR(VLOOKUP($B45,'Cls B1'!$A$1:$G$45,5,FALSE),\"\")","v":4},null,null,32,5,7,"SMP 1","MASS 1"]
[null,20,{"$f":"VLOOKUP($B46,$J$13:$N$55,4)","v":"MASS 1"},{"$f":"VLOOKUP($B46,$J$13:$N$55,5)","v":"LR"},null,{"$f":"IFERROR(VLOOKUP($B46,'Cls B1'!$A$1:$G$45,4,FALSE),\"\")","v":4},{"$f":"IFERROR(VLOOKUP($B46,'Cls B1'!$A$1:$G$45,5,FALSE),\"\")","v":16},null,null,33,6,3,"SMSM","LBSI"]
[null,9,{"$f":"VLOOKUP($B47,$J$13:$N$55,4)","v":"SMSM"},{"$f":"VLOOKUP($B47,$J$13:$N$55,5)","v":"MASS 1"},null,{"$f":"IFERROR(VLOOKUP($B47,'Cls B1'!$A$1:$G$45,4,FALSE),\"\")","v":5},{"$f":"IFERROR(VLOOKUP($B47,'Cls B1'!$A$1:$G$45,5,FALSE),\"\")","v":4},null,null,34,4,5,"FEN 1","SMP 1"]
[null,"DIVISION 2 ",null,null,null,null,null,null,null,35,1,6,"SJFF 1","SMSM"]
[null,55,{"$f":"VLOOKUP($B49,$P$13:$T$43,4)","v":"FEN 2"},{"$f":"VLOOKUP($B49,$P$13:$T$43,5)","v":"SJG"},"Japy à 14h",{"$f":"IFERROR(VLOOKUP($B49,'Cls B2'!$A$1:$G$33,4,FALSE),\"\")","v":0},{"$f":"IFERROR(VLOOKUP($B49,'Cls B2'!$A$1:$G$33,5,FALSE),\"\")","v":74},null,null,36,7,3,"MASS 1","LBSI"]
[null,56,{"$f":"VLOOKUP($B50,$P$13:$T$43,4)","v":"NDF"},{"$f":"VLOOKUP($B50,$P$13:$T$43,5)","v":"MASS 2"},null,{"$f":"IFERROR(VLOOKUP($B50,'Cls B2'!$A$1:$G$33,4,FALSE),\"\")","v":21},{"$f":"IFERROR(VLOOKUP($B50,'Cls B2'!$A$1:$G$33,5,FALSE),\"\")","v":4},null,null,37,6,2,"SMSM","LR"]
[null,"DIVISION MIXTE",null,null,null,null,null,null,null,38,5,3,"SMP 1","LBSI"]
[null,73,{"$f":"VLOOKUP($B52,$V$13:$Z$31,4)","v":"LR 2 (F)"},{"$f":"VLOOKUP($B52,$V$13:$Z$31,5)","v":"MASS 3"},"SMSM à 14h",{"$f":"IFERROR(VLOOKUP($B52,'Cls BMixte'!$A$1:$G$15,4,FALSE),\"\")","v":16},{"$f":"IFERROR(VLOOKUP($B52,'Cls BMixte'!$A$1:$G$15,5,FALSE),\"\")","v":4},null,null,39,7,1,"MASS 1","SJFF 1"]
[null,null,null,null,null,{"$f":"IFERROR(VLOOKUP($B53,'Cls BMixte'!$A$1:$G$15,4,FALSE),\"\")","v":""},{"$f":"IFERROR(VLOOKUP($B53,'Cls BMixte'!$A$1:$G$15,5,FALSE),\"\")","v":""},null,null,40,6,4,"SMSM","FEN 1"]
["2021-03-09","ENTRAINEMENT",null,null,null,null,null,null,null,41,2,7,"LR","MASS 1"]
[null,null,null,null,null,null,null,null,null,42,3,1,"LBSI","SJFF 1"]
[]
[]
[]
[]
["2022-03-16","DIVISION 1"]
[null,4,{"$f":"VLOOKUP($B61,$J$13:$N$55,4)","v":"SJFF 1"},{"$f":"VLOOKUP($B61,$J$13:$N$55,5)","v":"LR"},"Croix de Nivert 14h",{"$f":"IFERROR(VLOOKUP($B61,'Cls B1'!$A$1:$G$45,4,FALSE),\"\")","v":0},{"$f":"IFERROR(VLOOKUP($B61,'Cls B1'!$A$1:$G$45,5,FALSE),\"\")","v":0}]
[null,12,{"$f":"VLOOKUP($B62,$J$13:$N$55,4)","v":"LBSI"},{"$f":"VLOOKUP($B62,$J$13:$N$55,5)","v":"SMSM"},"LBSI à 14h",{"$f":"IFERROR(VLOOKUP($B62,'Cls B1'!$A$1:$G$45,4,FALSE),\"\")","v":0},{"$f":"IFERROR(VLOOKUP($B62,'Cls B1'!$A$1:$G$45,5,FALSE),\"\")","v":0}]
[null,36,{"$f":"VLOOKUP($B63,$J$13:$N$55,4)","v":"MASS 1"},{"$f":"VLOOKUP($B63,$J$13:$N$55,5)","v":"LBSI"},null,{"$f":"IFERROR(VLOOKUP($B63,'Cls B1'!$A$1:$G$45,4,FALSE),\"\")","v":0},{"$f":"IFERROR(VLOOKUP($B63,'Cls B1'!$A$1:$G$45,5,FALSE),\"\")","v":0}]
[null,"DIVISION 2 "]
[null,58,{"$f":"VLOOKUP($B65,$P$13:$T$43,4)","v":"FEN 2"},{"$f":"VLOOKUP($B65,$P$13:$T$43,5)","v":"SJFF 2"},"SJFF à 14h",{"$f":"IFERROR(VLOOKUP($B65,'Cls B2'!$A$1:$G$33,4,FALSE),\"\")","v":0},{"$f":"IFERROR(VLOOKUP($B65,'Cls B2'!$A$1:$G$33,5,FALSE),\"\")","v":0}]
[null,67,{"$f":"VLOOKUP($B66,$P$13:$T$43,4)","v":"NDF"},{"$f":"VLOOKUP($B66,$P$13:$T$43,5)","v":"SJG"},"Croix de Nivert 14h",{"$f":"IFERROR(VLOOKUP($B66,'Cls B2'!$A$1:$G$33,4,FALSE),\"\")","v":0},{"$f":"IFERROR(VLOOKUP($B66,'Cls B2'!$A$1:$G$33,5,FALSE),\"\")","v":0}]
[null,"DIVISION MIXTE"]
[null,77,{"$f":"VLOOKUP($B68,$V$13:$Z$31,4)","v":"SJFF 3 (F)"},{"$f":"VLOOKUP($B68,$V$13:$Z$31,5)","v":"LR 2 (F)"},"Croix de Nivert 14h",{"$f":"IFERROR(VLOOKUP($B68,'Cls BMixte'!$A$1:$G$15,4,FALSE),\"\")","v":0},{"$f":"IFERROR(VLOOKUP($B68,'Cls BMixte'!$A$1:$G$15,5,FALSE),\"\")","v":0}]
[null,null,null,null,null,{"$f":"IFERROR(VLOOKUP($B69,'Cls BMixte'!$A$1:$G$15,4,FALSE),\"\")","v":""},{"$f":"IFERROR(VLOOKUP($B69,'Cls BMixte'!$A$1:$G$15,5,FALSE),\"\")","v":""}]
["2022-03-23","DIVISION 1"]
[null,1,{"$f":"VLOOKUP($B71,$J$13:$N$55,4)","v":"LR"},{"$f":"VLOOKUP($B71,$J$13:$N$55,5)","v":"LBSI"},"LBSI à 13h45",{"$f":"IFERROR(VLOOKUP($B71,'Cls B1'!$A$1:$G$45,4,FALSE),\"\")","v":0},{"$f":"IFERROR(VLOOKUP($B71,'Cls B1'!$A$1:$G$45,5,FALSE),\"\")","v":0}]
[null,24,{"$f":"VLOOKUP($B72,$J$13:$N$55,4)","v":"FEN 1"},{"$f":"VLOOKUP($B72,$J$13:$N$55,5)","v":"MASS 1"},"Fragonard à 14h",{"$f":"IFERROR(VLOOKUP($B72,'Cls B1'!$A$1:$G$45,4,FALSE),\"\")","v":0},{"$f":"IFERROR(VLOOKUP($B72,'Cls B1'!$A$1:$G$45,5,FALSE),\"\")","v":0}]
[null,"DIVISION 2 "]
[null,49,{"$f":"VLOOKUP($B74,$P$13:$T$43,4)","v":"SJG"},{"$f":"VLOOKUP($B74,$P$13:$T$43,5)","v":"SJFF 2"},"SJFF à 14h",{"$f":"IFERROR(VLOOKUP($B74,'Cls B2'!$A$1:$G$33,4,FALSE),\"\")","v":0},{"$f":"IFERROR(VLOOKUP($B74,'Cls B2'!$A$1:$G$33,5,FALSE),\"\")","v":0}]
[null,65,{"$f":"VLOOKUP($B75,$P$13:$T$43,4)","v":"SJFF 2"},{"$f":"VLOOKUP($B75,$P$13:$T$43,5)","v":"NDF"},null,{"$f":"IFERROR(VLOOKUP($B75,'Cls B2'!$A$1:$G$33,4,FALSE),\"\")","v":0},{"$f":"IFERROR(VLOOKUP($B75,'Cls B2'!$A$1:$G$33,5,FALSE),\"\")","v":0}]
[null,66,{"$f":"VLOOKUP($B76,$P$13:$T$43,4)","v":"MASS 2"},{"$f":"VLOOKUP($B76,$P$13:$T$43,5)","v":"FEN 2"},"Fragonard à 14h",{"$f":"IFERROR(VLOOKUP($B76,'Cls B2'!$A$1:$G$33,4,FALSE),\"\")","v":0},{"$f":"IFERROR(VLOOKUP($B76,'Cls B2'!$A$1:$G$33,5,FALSE),\"\")","v":0}]
[null,"DIVISION MIXTE"]
[null,79,{"$f":"VLOOKUP($B78,$V$13:$Z$31,4)","v":"MASS 3"},{"$f":"VLOOKUP($B78,$V$13:$Z$31,5)","v":"LR 2 (F)"},"LBSI à 13h45",{"$f":"IFERROR(VLOOKUP($B78,'Cls BMixte'!$A$1:$G$15,4,FALSE),\"\")","v":0},{"$f":"IFERROR(VLOOKUP($B78,'Cls BMixte'!$A$1:$G$15,5,FALSE),\"\")","v":0}]
[null,null,null,null,null,{"$f":"IFERROR(VLOOKUP($B79,'Cls BMixte'!$A$1:$G$15,4,FALSE),\"\")","v":""},{"$f":"IFERROR(VLOOKUP($B79,'Cls BMixte'!$A$1:$G$15,5,FALSE),\"\")","v":""}]
["2022-03-30","DIVISION 1"]
[null,28,{"$f":"VLOOKUP($B81,$J$13:$N$55,4)","v":"SJFF 1"},{"$f":"VLOOKUP($B81,$J$13:$N$55,5)","v":"FEN 1"},"SJFF à 14h",{"$f":"IFERROR(VLOOKUP($B81,'Cls B1'!$A$1:$G$45,4,FALSE),\"\")","v":0},{"$f":"IFERROR(VLOOKUP($B81,'Cls B1'!$A$1:$G$45,5,FALSE),\"\")","v":0},"MASS"]
[null,22,{"$f":"VLOOKUP($B82,$J$13:$N$55,4)","v":"LBSI"},{"$f":"VLOOKUP($B82,$J$13:$N$55,5)","v":"LR"},"LR à 14h",{"$f":"IFERROR(VLOOKUP($B82,'Cls B1'!$A$1:$G$45,4,FALSE),\"\")","v":0},{"$f":"IFERROR(VLOOKUP($B82,'Cls B1'!$A$1:$G$45,5,FALSE),\"\")","v":0}]
[null,"DIVISION 2 "]
[null,58,{"$f":"VLOOKUP($B84,$P$13:$T$43,4)","v":"FEN 2"},{"$f":"VLOOKUP($B84,$P$13:$T$43,5)","v":"SJFF 2"},"SJFF à 14h",{"$f":"IFERROR(VLOOKUP($B84,'Cls B2'!$A$1:$G$33,4,FALSE),\"\")","v":0},{"$f":"IFERROR(VLOOKUP($B84,'Cls B2'!$A$1:$G$33,5,FALSE),\"\")","v":0},"MASS"]
[null,61,{"$f":"VLOOKUP($B85,$P$13:$T$43,4)","v":"NDF"},{"$f":"VLOOKUP($B85,$P$13:$T$43,5)","v":"FEN 2"},null,{"$f":"IFERROR(VLOOKUP($B85,'Cls B2'!$A$1:$G$33,4,FALSE),\"\")","v":0},{"$f":"IFERROR(VLOOKUP($B85,'Cls B2'!$A$1:$G$33,5,FALSE),\"\")","v":0}]
[null,"DIVISION MIXTE"]
[null,null,null,null,null,{"$f":"IFERROR(VLOOKUP($B87,'Cls BMixte'!$A$1:$G$15,4,FALSE),\"\")","v":""},{"$f":"IFERROR(VLOOKUP($B87,'Cls BMixte'!$A$1:$G$15,5,FALSE),\"\")","v":""},"MASS"]
[null,null,null,null,null,{"$f":"IFERROR(VLOOKUP($B88,'Cls BMixte'!$A$1:$G$15,4,FALSE),\"\")","v":""},{"$f":"IFERROR(VLOOKUP($B88,'Cls BMixte'!$A$1:$G$15,5,FALSE),\"\")","v":""}]

{"sheet":"Cls B1","index":2,"n_rows":45,"n_cols":20,"rows_kept":45,"cut":false,"hidden":false,"merged":[[2,3,2,4],[0,0,1,6]]}
["BENJAMINS DIVISION 1"]
[]
["N° Match","Equipe A","Equipe B","Scores",null,"Vainqueur","Perdant",null,null,"SIGLE","Etablissement","Matchs joués","Victoires","Nuls ","Défaites","Points Pour","Points Contre","Différence","Points"]
[1,{"$f":"'Calendrier BG'!M14","v":"LR"},{"$f":"'Calendrier BG'!N14","v":"LBSI"},null,null,{"$f":"IF(D4<>\"\",IF(D4>E4,B4,IF(D4<E4,C4,\"nul\")),\"\")","v":""},{"$f":"IF(E4<>\"\",IF(E4<D4,C4,IF(E4>D4,B4,\"nul\")),\"\")","v":""},null,{"$f":"RANK(T4,$T$4:$T$9)","v":5},"SJFF 1","Saint Joseph 1",{"$f":"COUNT(D7,D10,D17,D21,D24,D38,D28,D31,D42,D45)","v":2},{"$f":"COUNTIF($F$3:$F$45,J4)","v":2},{"$f":"L4-M4-O4","v":0},{"$f":"COUNTIF(G3:G45,J4)","v":0},{"$f":"SUM(D5,D7,E10,E17,D21,E26,D24,D38,E28,D31,E42,D45)","v":30},{"$f":"SUM(E5,E7,D10,D17,E21,D26,E24,E38,D28,E31,D42,E45)","v":21},{"$f":"P4-Q4","v":9},{"$f":"M4*3+N4*2+O4*1","v":6},{"$f":"SUM(S4*1000000+R4*10000+P4*100+L4*10)","v":6093020}]
[2,{"$f":"'Calendrier BG'!M15","v":"SJFF 1"},{"$f":"'Calendrier BG'!N15","v":"SMP 1"},null,null,{"$f":"IF(D5<>\"\",IF(D5>E5,B5,IF(D5<E5,C5,\"nul\")),\"\")","v":""},{"$f":"IF(E5<>\"\",IF(E5<D5,C5,IF(E5>D5,B5,\"nul\")),\"\")","v":""},null,{"$f":"RANK(T5,$T$4:$T$9)","v":2},"LR","La Rochefoucauld",{"$f":"COUNT(D4,D7,D13,D19,D25,D23,D34,D28,D40,D44)","v":3},{"$f":"COUNTIF($F$3:$F$45,J5)","v":2},0,{"$f":"COUNTIF(G4:G46,J5)","v":1},{"$f":"SUM(D4,E7,E11,E13,D19,E25,E23,D34,D28,D32,E40,D44)","v":32},{"$f":"SUM(E4,D7,D11,D13,E19,D25,D23,E34,E28,E32,D40,E44)","v":20},{"$f":"P5-Q5","v":12},{"$f":"M5*3+N5*2+O5*1","v":7},{"$f":"SUM(S5*1000000+R5*10000+P5*100+L5*10)","v":7123230}]
[3,{"$f":"'Calendrier BG'!M16","v":"MASS 1"},{"$f":"'Calendrier BG'!N16","v":"FEN 1"},12,2,"MASS 1","FEN 1",null,4,"LBSI","La Bruyère Sainte Isabelle",{"$f":"COUNT(D4,D8,D15,D18,D29,D25,D36,D39,D45,D47,D24)","v":2},2,0,0,{"$f":"SUM(E4,D8,D15,D18,D20,E29,D25,E41,E36,E39,D45,E24)","v":35},{"$f":"SUM(D4,E8,E15,E18,E20,D29,E25,D41,D36,D39,E45,D24)","v":8},{"$f":"P6-Q6","v":27},6,6273520]
[4,{"$f":"'Calendrier BG'!M17","v":"SJFF 1"},{"$f":"'Calendrier BG'!N17","v":"LR"},null,null,"","",null,1,"FEN 1","Fénelon Ste Marie 1",{"$f":"COUNT(D6,D8,D10,D13,D22,D29,D27,D43,D31,D34)","v":5},2,0,3,{"$f":"SUM(E6,E8,D10,D13,D22,D29,D27,E43,E31,E34)","v":48},{"$f":"SUM(D6,D8,E10,E13,E22,E29,E27,D43,D31,D34)","v":62},-14,9,8864850]
[5,{"$f":"'Calendrier BG'!M18","v":"LBSI"},{"$f":"'Calendrier BG'!N18","v":"FEN 1"},13,4,"LBSI","FEN 1",null,6,"SMSM","Saint Michel Saint Mandé",{"$f":"COUNT(D19,D12,D15,D22,D17,D40,D38,D43,D33,D36)","v":3},1,{"$f":"L8-M8-O8","v":0},2,{"$f":"SUM(E19,D12,E15,E22,D17,D40,E38,D43,E33,D36)","v":16},{"$f":"SUM(D19,E12,D15,D22,E17,E40,D38,E43,D33,E36)","v":22},{"$f":"P8-Q8","v":-6},{"$f":"M8*3+N8*2+O8*1","v":5},{"$f":"SUM(S8*1000000+R8*10000+P8*100+L8*10)","v":4941630}]
[6,{"$f":"'Calendrier BG'!M19","v":"SMP 1"},{"$f":"'Calendrier BG'!N19","v":"SMSM"},null,null,"","",null,3,"MASS 1","Massillon 1",{"$f":"COUNT(D6,D12,D18,D21,D23,D33,D27,D44,D39,D42)","v":5},1,{"$f":"L9-M9-O9","v":0},4,{"$f":"SUM(D6,E12,E18,E21,D23,D33,E27,E44,D39,D42)","v":27},{"$f":"SUM(E6,D12,D18,D21,E23,E33,D27,D44,E39,E42)","v":55},{"$f":"P9-Q9","v":-28},{"$f":"M9*3+N9*2+O9*1","v":7},{"$f":"SUM(S9*1000000+R9*10000+P9*100+L9*10)","v":6722750}]
[7,{"$f":"'Calendrier BG'!M20","v":"FEN 1"},{"$f":"'Calendrier BG'!N20","v":"SJFF 1"},18,20,"SJFF 1","FEN 1"]
[8,{"$f":"'Calendrier BG'!M21","v":"SMP 1"},{"$f":"'Calendrier BG'!N21","v":"LR"},null,null,"","",null,"Classement","SIGLE","Etablissement","Matchs joués","Victoires","Nuls ","Défaites","Points Pour","Points Contre","Différence","Points"]
[9,{"$f":"'Calendrier BG'!M22","v":"SMSM"},{"$f":"'Calendrier BG'!N22","v":"MASS 1"},5,4,"SMSM","MASS 1",null,1,{"$f":"VLOOKUP($I12,$I$3:$S$9,COLUMNS($J11:J11)+1,FALSE)","v":"FEN 1"},{"$f":"VLOOKUP($I12,$I$3:$S$9,COLUMNS($J11:K11)+1,FALSE)","v":"Fénelon Ste Marie 1"},{"$f":"VLOOKUP($I12,$I$3:$S$9,COLUMNS($J11:L11)+1,FALSE)","v":5},{"$f":"VLOOKUP($I12,$I$3:$S$9,COLUMNS($J11:M11)+1,FALSE)","v":2},{"$f":"VLOOKUP($I12,$I$3:$S$9,COLUMNS($J11:N11)+1,FALSE)","v":0},{"$f":"VLOOKUP($I12,$I$3:$S$9,COLUMNS($J11:O11)+1,FALSE)","v":3},{"$f":"VLOOKUP($I12,$I$3:$S$9,COLUMNS($J11:P11)+1,FALSE)","v":48},{"$f":"VLOOKUP($I12,$I$3:$S$9,COLUMNS($J11:Q11)+1,FALSE)","v":62},{"$f":"VLOOKUP($I12,$I$3:$S$9,COLUMNS($J11:R11)+1,FALSE)","v":-14},{"$f":"VLOOKUP($I12,$I$3:$S$9,COLUMNS($J11:S11)+1,FALSE)","v":9}]
[10,{"$f":"'Calendrier BG'!M23","v":"FEN 1"},{"$f":"'Calendrier BG'!N23","v":"LR"},12,10,"FEN 1","LR",null,2,{"$f":"VLOOKUP($I13,$I$3:$S$9,COLUMNS($J12:J12)+1,FALSE)","v":"LR"},{"$f":"VLOOKUP($I13,$I$3:$S$9,COLUMNS($J12:K12)+1,FALSE)","v":"La Rochefoucauld"},{"$f":"VLOOKUP($I13,$I$3:$S$9,COLUMNS($J12:L12)+1,FALSE)","v":3},{"$f":"VLOOKUP($I13,$I$3:$S$9,COLUMNS($J12:M12)+1,FALSE)","v":2},{"$f":"VLOOKUP($I13,$I$3:$S$9,COLUMNS($J12:N12)+1,FALSE)","v":0},{"$f":"VLOOKUP($I13,$I$3:$S$9,COLUMNS($J12:O12)+1,FALSE)","v":1},{"$f":"VLOOKUP($I13,$I$3:$S$9,COLUMNS($J12:P12)+1,FALSE)","v":32},{"$f":"VLOOKUP($I13,$I$3:$S$9,COLUMNS($J12:Q12)+1,FALSE)","v":20},{"$f":"VLOOKUP($I13,$I$3:$S$9,COLUMNS($J12:R12)+1,FALSE)","v":12},{"$f":"VLOOKUP($I13,$I$3:$S$9,COLUMNS($J12:S12)+1,FALSE)","v":7}]
[11,{"$f":"'Calendrier BG'!M24","v":"MASS 1"},{"$f":"'Calendrier BG'!N24","v":"SMP 1"},null,null,"","",null,3,{"$f":"VLOOKUP($I14,$I$3:$S$9,COLUMNS($J13:J13)+1,FALSE)","v":"MASS 1"},{"$f":"VLOOKUP($I14,$I$3:$S$9,COLUMNS($J13:K13)+1,FALSE)","v":"Massillon 1"},{"$f":"VLOOKUP($I14,$I$3:$S$9,COLUMNS($J13:L13)+1,FALSE)","v":5},{"$f":"VLOOKUP($I14,$I$3:$S$9,COLUMNS($J13:M13)+1,FALSE)","v":1},{"$f":"VLOOKUP($I14,$I$3:$S$9,COLUMNS($J13:N13)+1,FALSE)","v":0},{"$f":"VLOOKUP($I14,$I$3:$S$9,COLUMNS($J13:O13)+1,FALSE)","v":4},{"$f":"VLOOKUP($I14,$I$3:$S$9,COLUMNS($J13:P13)+1,FALSE)","v":27},{"$f":"VLOOKUP($I14,$I$3:$S$9,COLUMNS($J13:Q13)+1,FALSE)","v":55},{"$f":"VLOOKUP($I14,$I$3:$S$9,COLUMNS($J13:R13)+1,FALSE)","v":-28},{"$f":"VLOOKUP($I14,$I$3:$S$9,COLUMNS($J13:S13)+1,FALSE)","v":7}]
[12,{"$f":"'Calendrier BG'!M25","v":"LBSI"},{"$f":"'Calendrier BG'!N25","v":"SMSM"},null,null,"","",null,4,{"$f":"VLOOKUP($I15,$I$3:$S$9,COLUMNS($J14:J14)+1,FALSE)","v":"LBSI"},{"$f":"VLOOKUP($I15,$I$3:$S$9,COLUMNS($J14:K14)+1,FALSE)","v":"La Bruyère Sainte Isabelle"},{"$f":"VLOOKUP($I15,$I$3:$S$9,COLUMNS($J14:L14)+1,FALSE)","v":2},{"$f":"VLOOKUP($I15,$I$3:$S$9,COLUMNS($J14:M14)+1,FALSE)","v":2},{"$f":"VLOOKUP($I15,$I$3:$S$9,COLUMNS($J14:N14)+1,FALSE)","v":0},{"$f":"VLOOKUP($I15,$I$3:$S$9,COLUMNS($J14:O14)+1,FALSE)","v":0},{"$f":"VLOOKUP($I15,$I$3:$S$9,COLUMNS($J14:P14)+1,FALSE)","v":35},{"$f":"VLOOKUP($I15,$I$3:$S$9,COLUMNS($J14:Q14)+1,FALSE)","v":8},{"$f":"VLOOKUP($I15,$I$3:$S$9,COLUMNS($J14:R14)+1,FALSE)","v":27},{"$f":"VLOOKUP($I15,$I$3:$S$9,COLUMNS($J14:S14)+1,FALSE)","v":6}]
[13,{"$f":"'Calendrier BG'!M26","v":"SMP 1"},{"$f":"'Calendrier BG'!N26","v":"FEN 1"},null,null,"","",null,5,{"$f":"VLOOKUP($I16,$I$3:$S$9,COLUMNS($J15:J15)+1,FALSE)","v":"SJFF 1"},{"$f":"VLOOKUP($I16,$I$3:$S$9,COLUMNS($J15:K15)+1,FALSE)","v":"Saint Joseph 1"},{"$f":"VLOOKUP($I16,$I$3:$S$9,COLUMNS($J15:L15)+1,FALSE)","v":2},{"$f":"VLOOKUP($I16,$I$3:$S$9,COLUMNS($J15:M15)+1,FALSE)","v":2},{"$f":"VLOOKUP($I16,$I$3:$S$9,COLUMNS($J15:N15)+1,FALSE)","v":0},{"$f":"VLOOKUP($I16,$I$3:$S$9,COLUMNS($J15:O15)+1,FALSE)","v":0},{"$f":"VLOOKUP($I16,$I$3:$S$9,COLUMNS($J15:P15)+1,FALSE)","v":30},{"$f":"VLOOKUP($I16,$I$3:$S$9,COLUMNS($J15:Q15)+1,FALSE)","v":21},{"$f":"VLOOKUP($I16,$I$3:$S$9,COLUMNS($J15:R15)+1,FALSE)","v":9},{"$f":"VLOOKUP($I16,$I$3:$S$9,COLUMNS($J15:S15)+1,FALSE)","v":6}]
[14,{"$f":"'Calendrier BG'!M27","v":"SMSM"},{"$f":"'Calendrier BG'!N27","v":"SJFF 1"},null,null,"","",null,6,{"$f":"VLOOKUP($I17,$I$3:$S$9,COLUMNS($J16:J16)+1,FALSE)","v":"SMSM"},{"$f":"VLOOKUP($I17,$I$3:$S$9,COLUMNS($J16:K16)+1,FALSE)","v":"Saint Michel Saint Mandé"},{"$f":"VLOOKUP($I17,$I$3:$S$9,COLUMNS($J16:L16)+1,FALSE)","v":3},{"$f":"VLOOKUP($I17,$I$3:$S$9,COLUMNS($J16:M16)+1,FALSE)","v":1},{"$f":"VLOOKUP($I17,$I$3:$S$9,COLUMNS($J16:N16)+1,FALSE)","v":0},{"$f":"VLOOKUP($I17,$I$3:$S$9,COLUMNS($J16:O16)+1,FALSE)","v":2},{"$f":"VLOOKUP($I17,$I$3:$S$9,COLUMNS($J16:P16)+1,FALSE)","v":16},{"$f":"VLOOKUP($I17,$I$3:$S$9,COLUMNS($J16:Q16)+1,FALSE)","v":22},{"$f":"VLOOKUP($I17,$I$3:$S$9,COLUMNS($J16:R16)+1,FALSE)","v":-6},{"$f":"VLOOKUP($I17,$I$3:$S$9,COLUMNS($J16:S16)+1,FALSE)","v":5}]
[15,{"$f":"'Calendrier BG'!M28","v":"LBSI"},{"$f":"'Calendrier BG'!N28","v":"MASS 1"},22,4,"LBSI","MASS 1"]
[16,{"$f":"'Calendrier BG'!M29","v":"LR"},{"$f":"'Calendrier BG'!N29","v":"SMSM"},6,4,"LR","SMSM"]
[17,{"$f":"'Calendrier BG'!M30","v":"LBSI"},{"$f":"'Calendrier BG'!N30","v":"SMP 1"},null,null,"",""]
[18,{"$f":"'Calendrier BG'!M31","v":"SJFF 1"},{"$f":"'Calendrier BG'!N31","v":"MASS 1"},10,3,"SJFF 1","MASS 1"]
[19,{"$f":"'Calendrier BG'!M32","v":"FEN 1"},{"$f":"'Calendrier BG'!N32","v":"SMSM"},12,7,"FEN 1","SMSM"]
[20,{"$f":"'Calendrier BG'!M33","v":"MASS 1"},{"$f":"'Calendrier BG'!N33","v":"LR"},4,16,"LR","MASS 1"]
[21,{"$f":"'Calendrier BG'!M34","v":"SJFF 1"},{"$f":"'Calendrier BG'!N34","v":"LBSI"},null,null,"",""]
[22,{"$f":"'Calendrier BG'!M35","v":"LBSI"},{"$f":"'Calendrier BG'!N35","v":"LR"},null,null,"",""]
[23,{"$f":"'Calendrier BG'!M36","v":"SMP 1"},{"$f":"'Calendrier BG'!N36","v":"SJFF 1"},null,null,"",""]
[24,{"$f":"'Calendrier BG'!M37","v":"FEN 1"},{"$f":"'Calendrier BG'!N37","v":"MASS 1"},null,null,"",""]
[25,{"$f":"'Calendrier BG'!M38","v":"LR"},{"$f":"'Calendrier BG'!N38","v":"SJFF 1"},null,null,"",""]
[26,{"$f":"'Calendrier BG'!M39","v":"FEN 1"},{"$f":"'Calendrier BG'!N39","v":"LBSI"},null,null,"",""]
[27,{"$f":"'Calendrier BG'!M40","v":"SMSM"},{"$f":"'Calendrier BG'!N40","v":"SMP 1"},null,null,"",""]
[28,{"$f":"'Calendrier BG'!M41","v":"SJFF 1"},{"$f":"'Calendrier BG'!N41","v":"FEN 1"},null,null,"",""]
[29,{"$f":"'Calendrier BG'!M42","v":"LR"},{"$f":"'Calendrier BG'!N42","v":"SMP 1"},null,null,"",""]
[30,{"$f":"'Calendrier BG'!M43","v":"MASS 1"},{"$f":"'Calendrier BG'!N43","v":"SMSM"},null,null,"",""]
[31,{"$f":"'Calendrier BG'!M44","v":"LR"},{"$f":"'Calendrier BG'!N44","v":"FEN 1"},null,null,"",""]
[32,{"$f":"'Calendrier BG'!M45","v":"SMP 1"},{"$f":"'Calendrier BG'!N45","v":"MASS 1"},null,null,"",""]
[33,{"$f":"'Calendrier BG'!M46","v":"SMSM"},{"$f":"'Calendrier BG'!N46","v":"LBSI"},null,null,"",""]
[34,{"$f":"'Calendrier BG'!M47","v":"FEN 1"},{"$f":"'Calendrier BG'!N47","v":"SMP 1"},null,null,"",""]
[35,{"$f":"'Calendrier BG'!M48","v":"SJFF 1"},{"$f":"'Calendrier BG'!N48","v":"SMSM"},null,null,"",""]
[36,{"$f":"'Calendrier BG'!M49","v":"MASS 1"},{"$f":"'Calendrier BG'!N49","v":"LBSI"},null,null,"",""]
[37,{"$f":"'Calendrier BG'!M50","v":"SMSM"},{"$f":"'Calendrier BG'!N50","v":"LR"},null,null,"",""]
[38,{"$f":"'Calendrier BG'!M51","v":"SMP 1"},{"$f":"'Calendrier BG'!N51","v":"LBSI"},null,null,"",""]
[39,{"$f":"'Calendrier BG'!M52","v":"MASS 1"},{"$f":"'Calendrier BG'!N52","v":"SJFF 1"},null,null,"",""]
[40,{"$f":"'Calendrier BG'!M53","v":"SMSM"},{"$f":"'Calendrier BG'!N53","v":"FEN 1"},null,null,"",""]
[41,{"$f":"'Calendrier BG'!M54","v":"LR"},{"$f":"'Calendrier BG'!N54","v":"MASS 1"},null,null,"",""]
[42,{"$f":"'Calendrier BG'!M55","v":"LBSI"},{"$f":"'Calendrier BG'!N55","v":"SJFF 1"},null,null,"",""]

{"sheet":"Cls B2","index":3,"n_rows":33,"n_cols":20,"rows_kept":33,"cut":false,"hidden":false,"merged":[[2,1,2,2],[2,3,2,4],[0,0,1,6]]}
["BENJAMINS DIVISION 2 POULE A"]
[]
["N° Match","Match",null,"Scores",null,"Vainqueur","Perdant",null,null,"SIGLE","Etablissement","Matchs joués","Victoires","Nuls ","Défaites","Points Pour","Points Contre","Différence","Points"]
[43,{"$f":"'Calendrier BG'!S14","v":"SJFF 2"},{"$f":"'Calendrier BG'!T14","v":"FEN 2"},4,6,{"$f":"IF(D4<>\"\",IF(D4>E4,B4,IF(D4<E4,C4,\"nul\")),\"\")","v":"FEN 2"},{"$f":"IF(E4<>\"\",IF(E4<D4,C4,IF(E4>D4,B4,\"nul\")),\"\")","v":"SJFF 2"},null,{"$f":"RANK(T4,$T$4:$T$8)","v":5},"SJFF 2","Saint Joseph 2",{"$f":"COUNT(D4,D10,D11,D15,D19,D25,D26,D30)","v":3},{"$f":"COUNTIF($F$3:$F$33,J4)","v":0},{"$f":"L4-M4-O4","v":0},{"$f":"COUNTIF($G$3:$G$33,J4)","v":3},{"$f":"SUM(D4,E10,E11,D15,E19,D25,D26,E30)","v":4},{"$f":"SUM(E4,D10,D11,E15,D19,E25,E26,D30)","v":28},{"$f":"P4-Q4","v":-24},{"$f":"M4*3+N4*2+O4*1","v":3},{"$f":"SUM(S4*1000000+R4*10000+P4*100+L4*10)","v":2760430}]
[44,{"$f":"'Calendrier BG'!S15","v":"SMP 2"},{"$f":"'Calendrier BG'!T15","v":"SJG"},null,null,{"$f":"IF(D5<>\"\",IF(D5>E5,B5,IF(D5<E5,C5,\"nul\")),\"\")","v":""},{"$f":"IF(E5<>\"\",IF(E5<D5,C5,IF(E5>D5,B5,\"nul\")),\"\")","v":""},null,{"$f":"RANK(T5,$T$4:$T$8)","v":4},"FEN 2","Fénelon 2",{"$f":"COUNT(D4,D7,D12,D16,D19,D22,D27,D31)","v":4},{"$f":"COUNTIF($F$3:$F$33,J5)","v":1},{"$f":"L5-M5-O5","v":0},{"$f":"COUNTIF($G$3:$G$33,J5)","v":3},{"$f":"SUM(E4,D7,D12,D16,D19,E22,E27,E31)","v":6},{"$f":"SUM(D4,E7,E12,E16,E19,D22,D27,D31)","v":115},{"$f":"P5-Q5","v":-109},{"$f":"M5*3+N5*2+O5*1","v":6},4910640]
[45,{"$f":"'Calendrier BG'!S16","v":"SMP 2"},{"$f":"'Calendrier BG'!T16","v":"SJFF 2"},null,null,"","",null,{"$f":"RANK(T6,$T$4:$T$8)","v":1},"NDF","Notre Dame de France",{"$f":"COUNT(D7,D11,D13,D17,D22,D26,D28,D32)","v":4},{"$f":"COUNTIF($F$3:$F$33,J6)","v":3},0,{"$f":"COUNTIF($G$3:$G$33,J6)","v":1},{"$f":"SUM(E7,D11,E13,D17,D22,E26,D28,E32)","v":80},{"$f":"SUM(D7,E11,D13,E17,E22,D26,E28,D32)","v":31},49,10,10498040]
[46,{"$f":"'Calendrier BG'!S17","v":"FEN 2"},{"$f":"'Calendrier BG'!T17","v":"NDF"},0,30,"NDF","FEN 2",null,{"$f":"RANK(T7,$T$4:$T$8)","v":2},"SJG","Saint Jean Gabriel",{"$f":"COUNT(D10,D8,D13,D16,D23,D25,D28,D31)","v":3},{"$f":"COUNTIF($F$3:$F$33,J7)","v":3},0,{"$f":"COUNTIF($G$3:$G$33,J7)","v":0},{"$f":"SUM(D10,D8,D13,E16,E23,E25,E28,D31)","v":143},{"$f":"SUM(E10,E8,E13,D16,D23,D25,D28,E31)","v":15},128,9,{"$f":"SUM(S7*1000000+R7*10000+P7*100+L7*10)","v":10294330}]
[47,{"$f":"'Calendrier BG'!S18","v":"SJG"},{"$f":"'Calendrier BG'!T18","v":"MASS 2"},42,2,"SJG","MASS 2",null,{"$f":"RANK(T8,$T$4:$T$8)","v":3},"MASS 2","Massillon 2",{"$f":"COUNT(D8,D15,D32,D23,D30,D12,D17,D27)","v":4},2,0,2,{"$f":"SUM(E8,E15,D32,D23,D30,E12,E17,D27)","v":19},{"$f":"SUM(D8,D15,E32,E23,E30,D12,D17,E27)","v":63},-44,8,7561940]
[48,{"$f":"'Calendrier BG'!S19","v":"NDF"},{"$f":"'Calendrier BG'!T19","v":"SMP 2"},null,null,"",""]
[49,{"$f":"'Calendrier BG'!S20","v":"SJG"},{"$f":"'Calendrier BG'!T20","v":"SJFF 2"},null,null,"",""]
[50,{"$f":"'Calendrier BG'!S21","v":"NDF"},{"$f":"'Calendrier BG'!T21","v":"SJFF 2"},16,0,"NDF","SJFF 2"]
[51,{"$f":"'Calendrier BG'!S22","v":"FEN 2"},{"$f":"'Calendrier BG'!T22","v":"MASS 2"},0,7,"MASS 2","FEN 2"]
[52,{"$f":"'Calendrier BG'!S23","v":"SJG"},{"$f":"'Calendrier BG'!T23","v":"NDF"},27,13,"SJG","NDF"]
[53,{"$f":"'Calendrier BG'!S24","v":"MASS 2"},{"$f":"'Calendrier BG'!T24","v":"SMP 2"},null,null,{"$f":"IF(D14<>\"\",IF(D14>E14,B14,IF(D14<E14,C14,\"nul\")),\"\")","v":""},{"$f":"IF(E14<>\"\",IF(E14<D14,C14,IF(E14>D14,B14,\"nul\")),\"\")","v":""},null,"Classement","SIGLE","Etablissement",{"$f":"L3","v":"Matchs joués"},{"$f":"M3","v":"Victoires"},"Nuls ","Défaites","Points Pour","Points Contre","Différence","Points"]
[54,{"$f":"'Calendrier BG'!S25","v":"SJFF 2"},{"$f":"'Calendrier BG'!T25","v":"MASS 2"},0,6,"MASS 2","SJFF 2",null,1,{"$f":"VLOOKUP($I15,$I$3:$S$8,COLUMNS($J14:J14)+1,FALSE)","v":"NDF"},{"$f":"VLOOKUP($I15,$I$3:$S$8,COLUMNS($J14:K14)+1,FALSE)","v":"Notre Dame de France"},{"$f":"VLOOKUP($I15,$I$3:$S$8,COLUMNS($J14:L14)+1,FALSE)","v":4},{"$f":"VLOOKUP($I15,$I$3:$S$8,COLUMNS($J14:M14)+1,FALSE)","v":3},{"$f":"VLOOKUP($I15,$I$3:$S$8,COLUMNS($J14:N14)+1,FALSE)","v":0},{"$f":"VLOOKUP($I15,$I$3:$S$8,COLUMNS($J14:O14)+1,FALSE)","v":1},{"$f":"VLOOKUP($I15,$I$3:$S$8,COLUMNS($J14:P14)+1,FALSE)","v":80},{"$f":"VLOOKUP($I15,$I$3:$S$8,COLUMNS($J14:Q14)+1,FALSE)","v":31},{"$f":"VLOOKUP($I15,$I$3:$S$8,COLUMNS($J14:R14)+1,FALSE)","v":49},{"$f":"VLOOKUP($I15,$I$3:$S$8,COLUMNS($J14:S14)+1,FALSE)","v":10}]
[55,{"$f":"'Calendrier BG'!S26","v":"FEN 2"},{"$f":"'Calendrier BG'!T26","v":"SJG"},0,74,{"$f":"IF(D16<>\"\",IF(D16>E16,B16,IF(D16<E16,C16,\"nul\")),\"\")","v":"SJG"},{"$f":"IF(E16<>\"\",IF(E16<D16,C16,IF(E16>D16,B16,\"nul\")),\"\")","v":"FEN 2"},null,2,{"$f":"VLOOKUP($I16,$I$3:$S$8,COLUMNS($J15:J15)+1,FALSE)","v":"SJG"},{"$f":"VLOOKUP($I16,$I$3:$S$8,COLUMNS($J15:K15)+1,FALSE)","v":"Saint Jean Gabriel"},{"$f":"VLOOKUP($I16,$I$3:$S$8,COLUMNS($J15:L15)+1,FALSE)","v":3},{"$f":"VLOOKUP($I16,$I$3:$S$8,COLUMNS($J15:M15)+1,FALSE)","v":3},{"$f":"VLOOKUP($I16,$I$3:$S$8,COLUMNS($J15:N15)+1,FALSE)","v":0},{"$f":"VLOOKUP($I16,$I$3:$S$8,COLUMNS($J15:O15)+1,FALSE)","v":0},{"$f":"VLOOKUP($I16,$I$3:$S$8,COLUMNS($J15:P15)+1,FALSE)","v":143},{"$f":"VLOOKUP($I16,$I$3:$S$8,COLUMNS($J15:Q15)+1,FALSE)","v":15},{"$f":"VLOOKUP($I16,$I$3:$S$8,COLUMNS($J15:R15)+1,FALSE)","v":128},{"$f":"VLOOKUP($I16,$I$3:$S$8,COLUMNS($J15:S15)+1,FALSE)","v":9}]
[56,{"$f":"'Calendrier BG'!S27","v":"NDF"},{"$f":"'Calendrier BG'!T27","v":"MASS 2"},21,4,"NDF","MASS 2",null,3,{"$f":"VLOOKUP($I17,$I$3:$S$8,COLUMNS($J16:J16)+1,FALSE)","v":"MASS 2"},{"$f":"VLOOKUP($I17,$I$3:$S$8,COLUMNS($J16:K16)+1,FALSE)","v":"Massillon 2"},{"$f":"VLOOKUP($I17,$I$3:$S$8,COLUMNS($J16:L16)+1,FALSE)","v":4},{"$f":"VLOOKUP($I17,$I$3:$S$8,COLUMNS($J16:M16)+1,FALSE)","v":2},{"$f":"VLOOKUP($I17,$I$3:$S$8,COLUMNS($J16:N16)+1,FALSE)","v":0},{"$f":"VLOOKUP($I17,$I$3:$S$8,COLUMNS($J16:O16)+1,FALSE)","v":2},{"$f":"VLOOKUP($I17,$I$3:$S$8,COLUMNS($J16:P16)+1,FALSE)","v":19},{"$f":"VLOOKUP($I17,$I$3:$S$8,COLUMNS($J16:Q16)+1,FALSE)","v":63},{"$f":"VLOOKUP($I17,$I$3:$S$8,COLUMNS($J16:R16)+1,FALSE)","v":-44},{"$f":"VLOOKUP($I17,$I$3:$S$8,COLUMNS($J16:S16)+1,FALSE)","v":8}]
[57,{"$f":"'Calendrier BG'!S28","v":"SMP 2"},{"$f":"'Calendrier BG'!T28","v":"FEN 2"},null,null,"","",null,4,{"$f":"VLOOKUP($I18,$I$3:$S$8,COLUMNS($J17:J17)+1,FALSE)","v":"FEN 2"},{"$f":"VLOOKUP($I18,$I$3:$S$8,COLUMNS($J17:K17)+1,FALSE)","v":"Fénelon 2"},{"$f":"VLOOKUP($I18,$I$3:$S$8,COLUMNS($J17:L17)+1,FALSE)","v":4},{"$f":"VLOOKUP($I18,$I$3:$S$8,COLUMNS($J17:M17)+1,FALSE)","v":1},{"$f":"VLOOKUP($I18,$I$3:$S$8,COLUMNS($J17:N17)+1,FALSE)","v":0},{"$f":"VLOOKUP($I18,$I$3:$S$8,COLUMNS($J17:O17)+1,FALSE)","v":3},{"$f":"VLOOKUP($I18,$I$3:$S$8,COLUMNS($J17:P17)+1,FALSE)","v":6},{"$f":"VLOOKUP($I18,$I$3:$S$8,COLUMNS($J17:Q17)+1,FALSE)","v":115},{"$f":"VLOOKUP($I18,$I$3:$S$8,COLUMNS($J17:R17)+1,FALSE)","v":-109},{"$f":"VLOOKUP($I18,$I$3:$S$8,COLUMNS($J17:S17)+1,FALSE)","v":6}]
[58,{"$f":"'Calendrier BG'!S29","v":"FEN 2"},{"$f":"'Calendrier BG'!T29","v":"SJFF 2"},null,null,"","",null,5,{"$f":"VLOOKUP($I19,$I$3:$S$8,COLUMNS($J18:J18)+1,FALSE)","v":"SJFF 2"},{"$f":"VLOOKUP($I19,$I$3:$S$8,COLUMNS($J18:K18)+1,FALSE)","v":"Saint Joseph 2"},{"$f":"VLOOKUP($I19,$I$3:$S$8,COLUMNS($J18:L18)+1,FALSE)","v":3},{"$f":"VLOOKUP($I19,$I$3:$S$8,COLUMNS($J18:M18)+1,FALSE)","v":0},{"$f":"VLOOKUP($I19,$I$3:$S$8,COLUMNS($J18:N18)+1,FALSE)","v":0},{"$f":"VLOOKUP($I19,$I$3:$S$8,COLUMNS($J18:O18)+1,FALSE)","v":3},{"$f":"VLOOKUP($I19,$I$3:$S$8,COLUMNS($J18:P18)+1,FALSE)","v":4},{"$f":"VLOOKUP($I19,$I$3:$S$8,COLUMNS($J18:Q18)+1,FALSE)","v":28},{"$f":"VLOOKUP($I19,$I$3:$S$8,COLUMNS($J18:R18)+1,FALSE)","v":-24},{"$f":"VLOOKUP($I19,$I$3:$S$8,COLUMNS($J18:S18)+1,FALSE)","v":3}]
[59,{"$f":"'Calendrier BG'!S30","v":"SJG"},{"$f":"'Calendrier BG'!T30","v":"SMP 2"},null,null,"",""]
[60,{"$f":"'Calendrier BG'!S31","v":"SJFF 2"},{"$f":"'Calendrier BG'!T31","v":"SMP 2"},null,null,"",""]
[61,{"$f":"'Calendrier BG'!S32","v":"NDF"},{"$f":"'Calendrier BG'!T32","v":"FEN 2"},null,null,"",""]
[62,{"$f":"'Calendrier BG'!S33","v":"MASS 2"},{"$f":"'Calendrier BG'!T33","v":"SJG"},null,null,"",""]
[63,{"$f":"'Calendrier BG'!S34","v":"SMP 2"},{"$f":"'Calendrier BG'!T34","v":"NDF"},null,null,"",""]
[64,{"$f":"'Calendrier BG'!S35","v":"SJFF 2"},{"$f":"'Calendrier BG'!T35","v":"SJG"},null,null,"",""]
[65,{"$f":"'Calendrier BG'!S36","v":"SJFF 2"},{"$f":"'Calendrier BG'!T36","v":"NDF"},null,null,"",""]
[66,{"$f":"'Calendrier BG'!S37","v":"MASS 2"},{"$f":"'Calendrier BG'!T37","v":"FEN 2"},null,null,"",""]
[67,{"$f":"'Calendrier BG'!S38","v":"NDF"},{"$f":"'Calendrier BG'!T38","v":"SJG"},null,null,"",""]
[68,{"$f":"'Calendrier BG'!S39","v":"SMP 2"},{"$f":"'Calendrier BG'!T39","v":"MASS 2"},null,null,"",""]
[69,{"$f":"'Calendrier BG'!S40","v":"MASS 2"},{"$f":"'Calendrier BG'!T40","v":"SJFF 2"},null,null,"",""]
[70,{"$f":"'Calendrier BG'!S41","v":"SJG"},{"$f":"'Calendrier BG'!T41","v":"FEN 2"},null,null,"",""]
[71,{"$f":"'Calendrier BG'!S42","v":"MASS 2"},{"$f":"'Calendrier BG'!T42","v":"NDF"},null,null,"",""]
[72,{"$f":"'Calendrier BG'!S43","v":"FEN 2"},{"$f":"'Calendrier BG'!T43","v":"SMP 2"},null,null,"",""]

{"sheet":"Cls BMixte","index":4,"n_rows":15,"n_cols":20,"rows_kept":15,"cut":false,"hidden":false,"merged":[[0,0,1,6],[2,1,2,2],[2,3,2,4]]}
["BENJAMINS DIVISION MIXTE"]
[]
["N° Match","Match",null,"Scores",null,"Vainqueur","Perdant",null,null,"SIGLE","Etablissement","Matchs joués","Victoires","Nuls ","Défaites","Points Pour","Points Contre","Différence","Points"]
[{"$f":"'Calendrier BG'!V14","v":72},{"$f":"'Calendrier BG'!Y14","v":"SMP 3 (F)"},{"$f":"'Calendrier BG'!Z14","v":"SJFF 3 (F)"},null,null,{"$f":"IF(D4<>\"\",IF(D4>E4,B4,IF(D4<E4,C4,\"nul\")),\"\")","v":""},{"$f":"IF(E4<>\"\",IF(E4<D4,C4,IF(E4>D4,B4,\"nul\")),\"\")","v":""},null,{"$f":"RANK(T4,$T$4:$T$6)","v":2},"SJFF 3 (F)","Saint Joseph 3",{"$f":"COUNT(D7,D9,D13,D15)","v":1},{"$f":"COUNTIF($F$3:$F$15,J4)","v":1},{"$f":"L4-M4-O4","v":0},{"$f":"COUNTIF(G1:G15,J4)","v":0},{"$f":"SUM(D7,D9,E13,E15)","v":14},{"$f":"SUM(E7,E9,D13,D15)","v":4},{"$f":"P4-Q4","v":10},{"$f":"M4*3+N4*2+O4*1","v":3},{"$f":"SUM(S4*1000000+R4*10000+P4*100+L4*10)","v":3101410}]
[{"$f":"'Calendrier BG'!V15","v":73},{"$f":"'Calendrier BG'!Y15","v":"LR 2 (F)"},{"$f":"'Calendrier BG'!Z15","v":"MASS 3"},16,4,{"$f":"IF(D5<>\"\",IF(D5>E5,B5,IF(D5<E5,C5,\"nul\")),\"\")","v":"LR 2 (F)"},{"$f":"IF(E5<>\"\",IF(E5<D5,C5,IF(E5>D5,B5,\"nul\")),\"\")","v":"MASS 3"},null,{"$f":"RANK(T5,$T$4:$T$6)","v":1},"LR 2 (F)","La Rochefoucauld 2",{"$f":"COUNT(D5,D9,D11,D15)","v":1},{"$f":"COUNTIF($F$3:$F$15,J5)","v":1},{"$f":"L5-M5-O5","v":0},{"$f":"COUNTIF(G2:G15,J5)","v":0},{"$f":"SUM(D5,E9,E11,D15)","v":16},{"$f":"SUM(E5,D9,D11,E15)","v":4},{"$f":"P5-Q5","v":12},{"$f":"M5*3+N5*2+O5*1","v":3},3121610]
[{"$f":"'Calendrier BG'!V16","v":74},{"$f":"'Calendrier BG'!Y16","v":"SMP 3 (F)"},{"$f":"'Calendrier BG'!Z16","v":"LR 2 (F)"},null,null,"","",null,{"$f":"RANK(T6,$T$4:$T$6)","v":3},"MASS 3","Massillon 3",{"$f":"COUNT(D5,D7,D11,D13)","v":2},{"$f":"COUNTIF($F$3:$F$15,J6)","v":0},0,{"$f":"COUNTIF(G3:G15,J6)","v":2},{"$f":"SUM(E5,E7,D11,D13)","v":8},{"$f":"SUM(D5,D7,E11,E13)","v":30},-22,2,1780820]
[{"$f":"'Calendrier BG'!V17","v":75},{"$f":"'Calendrier BG'!Y17","v":"SJFF 3 (F)"},{"$f":"'Calendrier BG'!Z17","v":"MASS 3"},14,4,"SJFF 3 (F)","MASS 3"]
[{"$f":"'Calendrier BG'!V18","v":76},{"$f":"'Calendrier BG'!Y18","v":"SMP 3 (F)"},{"$f":"'Calendrier BG'!Z18","v":"MASS 3"},null,null,"","",null,"Classement","SIGLE",{"$f":"K3","v":"Etablissement"},{"$f":"L3","v":"Matchs joués"},"Victoires","Nuls ","Défaites","Points Pour","Points Contre","Différence","Points"]
[{"$f":"'Calendrier BG'!V19","v":77},{"$f":"'Calendrier BG'!Y19","v":"SJFF 3 (F)"},{"$f":"'Calendrier BG'!Z19","v":"LR 2 (F)"},null,null,"","",null,1,{"$f":"VLOOKUP($I9,$I$3:$S$6,COLUMNS($J8:J8)+1,FALSE)","v":"LR 2 (F)"},{"$f":"VLOOKUP($I9,$I$3:$S$6,COLUMNS($J8:K8)+1,FALSE)","v":"La Rochefoucauld 2"},{"$f":"VLOOKUP($I9,$I$3:$S$6,COLUMNS($J8:L8)+1,FALSE)","v":1},{"$f":"VLOOKUP($I9,$I$3:$S$6,COLUMNS($J8:M8)+1,FALSE)","v":1},{"$f":"VLOOKUP($I9,$I$3:$S$6,COLUMNS($J8:N8)+1,FALSE)","v":0},{"$f":"VLOOKUP($I9,$I$3:$S$6,COLUMNS($J8:O8)+1,FALSE)","v":0},{"$f":"VLOOKUP($I9,$I$3:$S$6,COLUMNS($J8:P8)+1,FALSE)","v":16},{"$f":"VLOOKUP($I9,$I$3:$S$6,COLUMNS($J8:Q8)+1,FALSE)","v":4},{"$f":"VLOOKUP($I9,$I$3:$S$6,COLUMNS($J8:R8)+1,FALSE)","v":12},{"$f":"VLOOKUP($I9,$I$3:$S$6,COLUMNS($J8:S8)+1,FALSE)","v":3}]
[{"$f":"'Calendrier BG'!V20","v":78},{"$f":"'Calendrier BG'!Y20","v":"SJFF 3 (F)"},{"$f":"'Calendrier BG'!Z20","v":"SMP 3 (F)"},null,null,"","",null,2,{"$f":"VLOOKUP($I10,$I$3:$S$6,COLUMNS($J9:J9)+1,FALSE)","v":"SJFF 3 (F)"},{"$f":"VLOOKUP($I10,$I$3:$S$6,COLUMNS($J9:K9)+1,FALSE)","v":"Saint Joseph 3"},{"$f":"VLOOKUP($I10,$I$3:$S$6,COLUMNS($J9:L9)+1,FALSE)","v":1},{"$f":"VLOOKUP($I10,$I$3:$S$6,COLUMNS($J9:M9)+1,FALSE)","v":1},{"$f":"VLOOKUP($I10,$I$3:$S$6,COLUMNS($J9:N9)+1,FALSE)","v":0},{"$f":"VLOOKUP($I10,$I$3:$S$6,COLUMNS($J9:O9)+1,FALSE)","v":0},{"$f":"VLOOKUP($I10,$I$3:$S$6,COLUMNS($J9:P9)+1,FALSE)","v":14},{"$f":"VLOOKUP($I10,$I$3:$S$6,COLUMNS($J9:Q9)+1,FALSE)","v":4},{"$f":"VLOOKUP($I10,$I$3:$S$6,COLUMNS($J9:R9)+1,FALSE)","v":10},{"$f":"VLOOKUP($I10,$I$3:$S$6,COLUMNS($J9:S9)+1,FALSE)","v":3}]
[{"$f":"'Calendrier BG'!V21","v":79},{"$f":"'Calendrier BG'!Y21","v":"MASS 3"},{"$f":"'Calendrier BG'!Z21","v":"LR 2 (F)"},null,null,"","",null,3,{"$f":"VLOOKUP($I11,$I$3:$S$6,COLUMNS($J10:J10)+1,FALSE)","v":"MASS 3"},{"$f":"VLOOKUP($I11,$I$3:$S$6,COLUMNS($J10:K10)+1,FALSE)","v":"Massillon 3"},{"$f":"VLOOKUP($I11,$I$3:$S$6,COLUMNS($J10:L10)+1,FALSE)","v":2},{"$f":"VLOOKUP($I11,$I$3:$S$6,COLUMNS($J10:M10)+1,FALSE)","v":0},{"$f":"VLOOKUP($I11,$I$3:$S$6,COLUMNS($J10:N10)+1,FALSE)","v":0},{"$f":"VLOOKUP($I11,$I$3:$S$6,COLUMNS($J10:O10)+1,FALSE)","v":2},{"$f":"VLOOKUP($I11,$I$3:$S$6,COLUMNS($J10:P10)+1,FALSE)","v":8},{"$f":"VLOOKUP($I11,$I$3:$S$6,COLUMNS($J10:Q10)+1,FALSE)","v":30},{"$f":"VLOOKUP($I11,$I$3:$S$6,COLUMNS($J10:R10)+1,FALSE)","v":-22},{"$f":"VLOOKUP($I11,$I$3:$S$6,COLUMNS($J10:S10)+1,FALSE)","v":2}]
[{"$f":"'Calendrier BG'!V22","v":80},{"$f":"'Calendrier BG'!Y22","v":"LR 2 (F)"},{"$f":"'Calendrier BG'!Z22","v":"SMP 3 (F)"},null,null,"",""]
[{"$f":"'Calendrier BG'!V23","v":81},{"$f":"'Calendrier BG'!Y23","v":"MASS 3"},{"$f":"'Calendrier BG'!Z23","v":"SJFF 3 (F)"},null,null,"",""]
[{"$f":"'Calendrier BG'!V24","v":82},{"$f":"'Calendrier BG'!Y24","v":"MASS 3"},{"$f":"'Calendrier BG'!Z24","v":"SMP 3 (F)"},null,null,"",""]
[{"$f":"'Calendrier BG'!V25","v":83},{"$f":"'Calendrier BG'!Y25","v":"LR 2 (F)"},{"$f":"'Calendrier BG'!Z25","v":"SJFF 3 (F)"},null,null,"",""]

{"sheet":"Calendrier MG","index":5,"n_rows":97,"n_cols":26,"rows_kept":97,"cut":false,"hidden":false,"merged":[[86,0,97,0],[86,1,86,7],[90,1,90,7],[95,1,95,7],[92,4,94,4],[87,4,89,4],[48,7,49,7],[54,7,55,7],[47,0,55,0],[33,0,46,0],[22,0,32,0],[50,1,50,7],[53,1,53,7],[12,0,21,0],[2,0,11,0],[27,4,28,4],[34,4,37,4],[47,1,47,7],[41,4,43,4],[39,4,40,4],[30,1,30,7],[33,1,33,7],[38,1,38,7],[44,1,44,7],[6,4,8,4],[5,1,5,7],[12,1,12,7],[16,1,16,7],[9,1,9,7],[11,12,11,13],[22,1,22,7],[25,1,25,7],[2,21,2,22],[0,1,0,7],[1,9,1,10],[1,15,1,16],[1,21,1,22],[1,5,1,6],[0,9,0,25],[2,1,2,7],[2,9,2,10],[2,15,2,16],[13,18,13,19],[13,24,13,25],[19,1,19,7],[56,0,61,0],[56,1,61,7],[62,1,62,7],[66,1,66,7],[71,1,71,7],[64,4,65,4],[69,4,70,4],[62,0,73,0],[74,0,85,0],[74,1,74,7],[77,1,77,7],[83,1,83,7],[75,4,76,4],[78,4,80,4]]}
[null," CALENDRIER MINIMES",null,null,null,null,null,null,null,"POULES ET MATCHS MINIMES"]
["Date","Match","Equipe A","Equipe B","Lieux","Résultats",null,"Indisponibilités",null,"DIVISION 1",null,null,null,null,null,"DIVISION 2 ",null,null,null,null,null,"MINIMES FILLES"]
["2021-11-17","DIVISION 1",null,null,null,null,null,null,null,"Etablissements",null,null,null,null,null,"Etablissements",null,null,null,null,null,"Etablissements"]
[null,null,null,null,null,null,null,null,null,1,"FEN 1",null,null,null,null,1,"SMSM",null,null,null,null,1,"SBE"]
[null,null,null,null,null,null,null,null,null,2,"SBE 1",null,null,null,null,2,"LR",null,null,null,null,2,"SJFF"]
[null,"DIVISION 2 ",null,null,null,null,null,null,null,3,"SBE 2",null,null,null,null,3,"FEN 2",null,null,null,null,3,"SMP"]
[null,51,{"$f":"VLOOKUP($B7,$P$14:$T$63,4)","v":"LBSI"},{"$f":"VLOOKUP($B7,$P$14:$T$63,5)","v":"MASS 2"},"LBSI à 14h",{"$f":"IFERROR(VLOOKUP($B7,'Cls M2'!$A$1:$G$54,4,FALSE),\"\")","v":18},{"$f":"IFERROR(VLOOKUP($B7,'Cls M2'!$A$1:$G$54,5,FALSE),\"\")","v":4},null,null,4,"SJFF 1",null,null,null,null,4,"SJFF 2",null,null,null,null,4,"SJG"]
[null,54,"FEN 2","LBSI",null,{"$f":"IFERROR(VLOOKUP($B8,'Cls M2'!$A$1:$G$54,4,FALSE),\"\")","v":2},{"$f":"IFERROR(VLOOKUP($B8,'Cls M2'!$A$1:$G$54,5,FALSE),\"\")","v":18},null,null,5,"SMP",null,null,null,null,5,"SJG",null,null,null,null,5]
[null,57,"FEN 2","MASS 2",null,{"$f":"IFERROR(VLOOKUP($B9,'Cls M2'!$A$1:$G$54,4,FALSE),\"\")","v":4},{"$f":"IFERROR(VLOOKUP($B9,'Cls M2'!$A$1:$G$54,5,FALSE),\"\")","v":20},null,null,6,"MASS 1",null,null,null,null,6,"LBSI"]
[null,"DIVISION FILLE",null,null,null,null,null,null,null,null,null,null,null,null,null,7,"MASS 2"]
[null,null,null,null,null,null,null,null,null,null,null,null,null,null,null,8,"MASS 3"]
[null,null,null,null,null,null,null,null,null,"N° Match","Equipe A","Equipe B","Match"]
["2021-11-24","DIVISION 1",null,null,null,null,null,null,null,1,2,3,{"$f":"VLOOKUP(K13,$J$2:$K$9,2)","v":"SBE 1"},{"$f":"VLOOKUP(L13,$J$2:$K$9,2)","v":"SBE 2"}]
[null,1,{"$f":"VLOOKUP($B14,$J$12:$N$42,4)","v":"SBE 1"},{"$f":"VLOOKUP($B14,$J$12:$N$42,5)","v":"SBE 2"},"SMP à 14h",{"$f":"IFERROR(VLOOKUP($B14,'Cls M1'!$A$1:$G$33,4,FALSE),\"\")","v":0},{"$f":"IFERROR(VLOOKUP($B14,'Cls M1'!$A$1:$G$33,5,FALSE),\"\")","v":0},null,null,2,1,5,"FEN 1","SMP",null,"N° Match","Equipe A","Equipe B","Match",null,null,"N° Match","Equipe A","Equipe B","Match"]
[null,null,null,null,null,{"$f":"IFERROR(VLOOKUP($B15,'Cls M1'!$A$1:$G$33,4,FALSE),\"\")","v":""},{"$f":"IFERROR(VLOOKUP($B15,'Cls M1'!$A$1:$G$33,5,FALSE),\"\")","v":""},null,null,3,1,2,"FEN 1","SBE 1",null,43,2,3,{"$f":"VLOOKUP(Q15,$P$2:$Q$11,2)","v":"LR"},{"$f":"VLOOKUP(R15,$P$2:$Q$11,2)","v":"FEN 2"},null,99,1,2,{"$f":"VLOOKUP(W15,$V$2:$W$11,2)","v":"SBE"},{"$f":"VLOOKUP(X15,$V$2:$W$11,2)","v":"SJFF"}]
[null,null,null,null,null,null,null,null,null,4,3,4,"SBE 2","SJFF 1",null,44,1,5,{"$f":"VLOOKUP(Q16,$P$2:$Q$11,2)","v":"SMSM"},{"$f":"VLOOKUP(R16,$P$2:$Q$11,2)","v":"SJG"},null,100,3,4,{"$f":"VLOOKUP(W16,$V$2:$W$11,2)","v":"SMP"},"SJG"]
[null,"DIVISION 2 ",null,null,null,null,null,null,null,5,5,6,"SMP","MASS 1",null,45,7,4,"MASS 2","SJFF 2",null,101,1,3,"SBE","SMP"]
[null,55,{"$f":"VLOOKUP($B18,$P$14:$T$63,4)","v":"SJG"},{"$f":"VLOOKUP($B18,$P$14:$T$63,5)","v":"SJFF 2"},"SJFF à 14h",{"$f":"IFERROR(VLOOKUP($B18,'Cls M2'!$A$1:$G$54,4,FALSE),\"\")","v":30},{"$f":"IFERROR(VLOOKUP($B18,'Cls M2'!$A$1:$G$54,5,FALSE),\"\")","v":4},null,null,6,4,1,"SJFF 1","FEN 1",null,46,1,2,"SMSM","LR",null,102,2,4,"SJFF","SJG"]
[null,null,null,null,null,{"$f":"IFERROR(VLOOKUP($B19,'Cls B2'!$A$1:$G$15,4,FALSE),\"\")","v":""},{"$f":"IFERROR(VLOOKUP($B19,'Cls B2'!$A$1:$G$15,5,FALSE),\"\")","v":""},null,null,7,5,2,"SMP","SBE 1",null,47,3,4,"FEN 2","SJFF 2",null,103,1,4,"SBE","SJG"]
[null,"DIVISION FILLE",null,null,null,null,null,null,null,8,4,2,"SJFF 1","SBE 1",null,48,5,6,"SJG","LBSI",null,104,2,3,"SJFF","SMP"]
[null,null,null,null,null,{"$f":"IFERROR(VLOOKUP($B21,'Cls Mixte'!$A$1:$G$15,4,FALSE),\"\")","v":""},{"$f":"IFERROR(VLOOKUP($B21,'Cls Mixte'!$A$1:$G$15,5,FALSE),\"\")","v":""},null,null,9,3,6,"SBE 2","MASS 1",null,49,4,1,"SJFF 2","SMSM",null,105,2,1,"SJFF","SBE"]
[null,102,{"$f":"VLOOKUP($B22,$V$14:$Z$26,4)","v":"SJFF"},{"$f":"VLOOKUP($B22,$V$14:$Z$26,5)","v":"SJG"},"SJFF à 14h",{"$f":"IFERROR(VLOOKUP($B22,'Cls Mixte'!$A$1:$G$15,4,FALSE),\"\")","v":12},{"$f":"IFERROR(VLOOKUP($B22,'Cls Mixte'!$A$1:$G$15,5,FALSE),\"\")","v":4},null,null,10,5,4,"SMP","SJFF 1",null,50,5,2,"SJG","LR",null,106,4,3,"SJG","SMP"]
["2021-12-01","DIVISION 1",null,null,null,null,null,null,null,11,6,1,"MASS 1","FEN 1",null,51,6,7,"LBSI","MASS 2",null,107,3,1,"SMP","SBE"]
[null,11,{"$f":"VLOOKUP($B24,$J$12:$N$42,4)","v":"MASS 1"},{"$f":"VLOOKUP($B24,$J$12:$N$42,5)","v":"FEN 1"},"Japy à 14h",{"$f":"IFERROR(VLOOKUP($B24,'Cls M1'!$A$1:$G$33,4,FALSE),\"\")","v":21},{"$f":"IFERROR(VLOOKUP($B24,'Cls M1'!$A$1:$G$33,5,FALSE),\"\")","v":7},null,null,12,2,6,"SBE 1","MASS 1",null,52,4,2,"SJFF 2","LR",null,108,4,2,"SJG","SJFF"]
[null,null,null,null,null,null,null,null,null,13,3,5,"SBE 2","SMP",null,53,7,5,"MASS 2","SJG",null,109,4,1,"SJG","SBE"]
[null,"DIVISION 2 ",null,null,null,null,null,null,null,14,4,6,"SJFF 1","MASS 1",null,54,3,6,"FEN 2","LBSI",null,110,3,2,"SMP","SJFF"]
[null,48,{"$f":"VLOOKUP($B27,$P$14:$T$63,4)","v":"SJG"},{"$f":"VLOOKUP($B27,$P$14:$T$63,5)","v":"LBSI"},"LBSI à 14h",{"$f":"IFERROR(VLOOKUP($B27,'Cls M2'!$A$1:$G$54,4,FALSE),\"\")","v":11},{"$f":"IFERROR(VLOOKUP($B27,'Cls M2'!$A$1:$G$54,5,FALSE),\"\")","v":30},null,null,15,1,3,"FEN 1","SBE 2",null,55,5,4,"SJG","SJFF 2"]
[null,45,"MASS 2","SJFF 2","SJFF à 14h",{"$f":"IFERROR(VLOOKUP($B28,'Cls M2'!$A$1:$G$54,4,FALSE),\"\")","v":22},{"$f":"IFERROR(VLOOKUP($B28,'Cls M2'!$A$1:$G$54,5,FALSE),\"\")","v":0},null,null,16,3,2,"SBE 2","SBE 1",null,56,6,1,"LBSI","SMSM"]
[null,67,"SJFF 2","MASS 3",null,{"$f":"IFERROR(VLOOKUP($B29,'Cls M2'!$A$1:$G$54,4,FALSE),\"\")","v":4},{"$f":"IFERROR(VLOOKUP($B29,'Cls M2'!$A$1:$G$54,5,FALSE),\"\")","v":6},null,null,17,5,1,"SMP","FEN 1",null,57,3,7,"FEN 2","MASS 2"]
[null,63,"SMSM","FEN 2","SMSM à 14h",{"$f":"IFERROR(VLOOKUP($B30,'Cls M2'!$A$1:$G$54,4,FALSE),\"\")","v":9},{"$f":"IFERROR(VLOOKUP($B30,'Cls M2'!$A$1:$G$54,5,FALSE),\"\")","v":4},null,null,18,2,1,"SBE 1","FEN 1",null,58,2,6,"LR","LBSI"]
[null,"DIVISION FILLE",null,null,null,null,null,null,null,19,4,3,"SJFF 1","SBE 2",null,59,3,5,"FEN 2","SJG"]
[null,null,null,null,null,null,null,null,null,20,6,5,"MASS 1","SMP",null,60,1,7,"SMSM","MASS 2"]
[null,null,null,null,null,null,null,null,null,21,1,4,"FEN 1","SJFF 1",null,61,4,6,"SJFF 2","LBSI"]
["2021-12-08","DIVISION 1",null,null,null,null,null,null,null,22,2,5,"SBE 1","SMP",null,62,7,2,"MASS 2","LR"]
[null,3,{"$f":"VLOOKUP($B35,$J$12:$N$42,4)","v":"FEN 1"},{"$f":"VLOOKUP($B35,$J$12:$N$42,5)","v":"SBE 1"},"Fragonard à 14h",{"$f":"IFERROR(VLOOKUP($B35,'Cls M1'!$A$1:$G$33,4,FALSE),\"\")","v":14},{"$f":"IFERROR(VLOOKUP($B35,'Cls M1'!$A$1:$G$33,5,FALSE),\"\")","v":9},null,null,23,2,4,"SBE 1","SJFF 1",null,63,1,3,"SMSM","FEN 2"]
[null,9,{"$f":"VLOOKUP($B36,$J$12:$N$42,4)","v":"SBE 2"},{"$f":"VLOOKUP($B36,$J$12:$N$42,5)","v":"MASS 1"},null,{"$f":"IFERROR(VLOOKUP($B36,'Cls M1'!$A$1:$G$33,4,FALSE),\"\")","v":4},{"$f":"IFERROR(VLOOKUP($B36,'Cls M1'!$A$1:$G$33,5,FALSE),\"\")","v":15},null,null,24,6,3,"MASS 1","SBE 2",null,64,1,8,"SMSM","MASS 3"]
[null,12,{"$f":"VLOOKUP($B37,$J$12:$N$42,4)","v":"SBE 1"},{"$f":"VLOOKUP($B37,$J$12:$N$42,5)","v":"MASS 1"},null,{"$f":"IFERROR(VLOOKUP($B37,'Cls M1'!$A$1:$G$33,4,FALSE),\"\")","v":14},{"$f":"IFERROR(VLOOKUP($B37,'Cls M1'!$A$1:$G$33,5,FALSE),\"\")","v":17},null,null,25,4,5,"SJFF 1","SMP",null,65,2,8,{"$f":"VLOOKUP(Q37,$P$2:$Q$11,2)","v":"LR"},{"$f":"VLOOKUP(R37,$P$2:$Q$11,2)","v":"MASS 3"}]
[null,15,{"$f":"VLOOKUP($B38,$J$12:$N$42,4)","v":"FEN 1"},{"$f":"VLOOKUP($B38,$J$12:$N$42,5)","v":"SBE 2"},null,{"$f":"IFERROR(VLOOKUP($B38,'Cls M1'!$A$1:$G$33,4,FALSE),\"\")","v":10},{"$f":"IFERROR(VLOOKUP($B38,'Cls M1'!$A$1:$G$33,5,FALSE),\"\")","v":15},null,null,26,1,6,"FEN 1","MASS 1",null,66,3,8,"FEN 2","MASS 3"]
[null,"DIVISION 2 ",null,null,null,null,null,null,null,27,6,2,"MASS 1","SBE 1",null,67,4,8,"SJFF 2","MASS 3"]
[null,69,{"$f":"VLOOKUP($B40,$P$14:$T$63,4)","v":"LBSI"},{"$f":"VLOOKUP($B40,$P$14:$T$63,5)","v":"MASS 3"},"LBSI à 14h",{"$f":"IFERROR(VLOOKUP($B40,'Cls M2'!$A$1:$G$54,4,FALSE),\"\")","v":41},{"$f":"IFERROR(VLOOKUP($B40,'Cls M2'!$A$1:$G$54,5,FALSE),\"\")","v":8},null,null,28,5,3,"SMP","SBE 2",null,68,5,8,"SJG","MASS 3"]
[null,68,"SJG","MASS 3",null,{"$f":"IFERROR(VLOOKUP($B41,'Cls M2'!$A$1:$G$54,4,FALSE),\"\")","v":39},{"$f":"IFERROR(VLOOKUP($B41,'Cls M2'!$A$1:$G$54,5,FALSE),\"\")","v":2},null,null,29,6,4,"MASS 1","SJFF 1",null,69,6,8,"LBSI","MASS 3"]
[null,52,"SJFF 2","LR","LR à 14h",{"$f":"IFERROR(VLOOKUP($B42,'Cls M2'!$A$1:$G$54,4,FALSE),\"\")","v":6},{"$f":"IFERROR(VLOOKUP($B42,'Cls M2'!$A$1:$G$54,5,FALSE),\"\")","v":16},null,null,30,3,1,"SBE 2","FEN 1",null,70,7,8,"MASS 2","MASS 3"]
[null,47,"FEN 2","SJFF 2",null,{"$f":"IFERROR(VLOOKUP($B43,'Cls M2'!$A$1:$G$54,4,FALSE),\"\")","v":5},{"$f":"IFERROR(VLOOKUP($B43,'Cls M2'!$A$1:$G$54,5,FALSE),\"\")","v":6},null,null,null,null,null,null,null,null,71,3,2,"FEN 2","LR"]
[null,43,"LR","FEN 2",null,{"$f":"IFERROR(VLOOKUP($B44,'Cls M2'!$A$1:$G$54,4,FALSE),\"\")","v":18},{"$f":"IFERROR(VLOOKUP($B44,'Cls M2'!$A$1:$G$54,5,FALSE),\"\")","v":10},null,null,null,null,null,null,null,null,72,5,1,"SJG","SMSM"]
[null,"DIVISION FILLE",null,null,null,null,null,null,null,null,null,null,null,null,null,73,4,7,"SJFF 2","MASS 2"]
[null,null,null,null,null,null,null,null,null,null,null,null,null,null,null,74,2,1,"LR","SMSM"]
[null,null,null,null,null,null,null,null,null,null,null,null,null,null,null,75,4,3,"SJFF 2","FEN 2"]
["2021-12-15","DIVISION 1",null,null,null,null,null,null,null,null,null,null,null,null,null,76,6,5,"LBSI","SJG"]
[null,null,null,null,null,null,null,"SBE / Gym LR / SJFF / LBSI",null,null,null,null,null,null,null,77,1,4,"SMSM","SJFF 2"]
[null,null,null,null,null,null,null,null,null,null,null,null,null,null,null,78,2,5,"LR","SJG"]
[null,"DIVISION 2 ",null,null,null,null,null,null,null,null,null,null,null,null,null,79,7,6,"MASS 2","LBSI"]
[null,46,{"$f":"VLOOKUP($B52,$P$14:$T$63,4)","v":"SMSM"},{"$f":"VLOOKUP($B52,$P$14:$T$63,5)","v":"LR"},"SMSM à 14h",{"$f":"IFERROR(VLOOKUP($B52,'Cls M2'!$A$1:$G$54,4,FALSE),\"\")","v":0},{"$f":"IFERROR(VLOOKUP($B52,'Cls M2'!$A$1:$G$54,5,FALSE),\"\")","v":8},null,null,null,null,null,null,null,null,80,2,4,"LR","SJFF 2"]
[null,59,"FEN 2","SJG","Japy à 14h",{"$f":"IFERROR(VLOOKUP($B53,'Cls M2'!$A$1:$G$54,4,FALSE),\"\")","v":2},{"$f":"IFERROR(VLOOKUP($B53,'Cls M2'!$A$1:$G$54,5,FALSE),\"\")","v":44},null,null,null,null,null,null,null,null,81,5,7,"SJG","MASS 2"]
[null,"DIVISION FILLE",null,null,null,null,null,null,null,null,null,null,null,null,null,82,6,3,"LBSI","FEN 2"]
[null,null,null,null,null,null,null,"SJFF",null,null,null,null,null,null,null,83,4,5,"SJFF 2","SJG"]
[null,null,null,null,null,null,null,null,null,null,null,null,null,null,null,84,1,6,"SMSM","LBSI"]
["2022-03-09","ENTRAINEMENT",null,null,null,null,null,null,null,null,null,null,null,null,null,85,7,3,"MASS 2","FEN 2"]
[null,null,null,null,null,null,null,null,null,null,null,null,null,null,null,86,6,2,"LBSI","LR"]
[null,null,null,null,null,null,null,null,null,null,null,null,null,null,null,87,5,3,"SJG","FEN 2"]
[null,null,null,null,null,null,null,null,null,null,null,null,null,null,null,88,7,1,"MASS 2","SMSM"]
[null,null,null,null,null,null,null,null,null,null,null,null,null,null,null,89,6,4,"LBSI","SJFF 2"]
[null,null,null,null,null,null,null,null,null,null,null,null,null,null,null,90,2,7,"LR","MASS 2"]
["2022-03-16","DIVISION 1",null,null,null,null,null,null,null,null,null,null,null,null,null,91,3,1,"FEN 2","SMSM"]
[null,6,{"$f":"VLOOKUP($B64,$J$12:$N$42,4)","v":"SJFF 1"},{"$f":"VLOOKUP($B64,$J$12:$N$42,5)","v":"FEN 1"},"SJFF à 14h",{"$f":"IFERROR(VLOOKUP($B64,'Cls M1'!$A$1:$G$33,4,FALSE),\"\")","v":0},{"$f":"IFERROR(VLOOKUP($B64,'Cls M1'!$A$1:$G$33,5,FALSE),\"\")","v":0},null,null,null,null,null,null,null,null,92,8,1,{"$f":"VLOOKUP(Q64,$P$2:$Q$11,2)","v":"MASS 3"},{"$f":"VLOOKUP(R64,$P$2:$Q$11,2)","v":"SMSM"}]
[null,24,{"$f":"VLOOKUP($B65,$J$12:$N$42,4)","v":"MASS 1"},{"$f":"VLOOKUP($B65,$J$12:$N$42,5)","v":"SBE 2"},"Japy à 14h",{"$f":"IFERROR(VLOOKUP($B65,'Cls M1'!$A$1:$G$33,4,FALSE),\"\")","v":0},{"$f":"IFERROR(VLOOKUP($B65,'Cls M1'!$A$1:$G$33,5,FALSE),\"\")","v":0},null,null,null,null,null,null,null,null,93,8,2,"MASS 3","LR"]
[null,27,"MASS 1","SBE 1",null,{"$f":"IFERROR(VLOOKUP($B66,'Cls M1'!$A$1:$G$33,4,FALSE),\"\")","v":0},{"$f":"IFERROR(VLOOKUP($B66,'Cls M1'!$A$1:$G$33,5,FALSE),\"\")","v":0},null,null,null,null,null,null,null,null,94,8,3,"MASS 3","FEN 2"]
[null,"DIVISION 2 ",null,null,null,null,null,null,null,null,null,null,null,null,null,95,8,4,"MASS 3","SJFF 2"]
[null,56,{"$f":"VLOOKUP($B68,$P$14:$T$70,4)","v":"LBSI"},{"$f":"VLOOKUP($B68,$P$14:$T$70,5)","v":"SMSM"},"LBSI à 14h",{"$f":"IFERROR(VLOOKUP($B68,'Cls M2'!$A$1:$G$54,4,FALSE),\"\")","v":0},{"$f":"IFERROR(VLOOKUP($B68,'Cls M2'!$A$1:$G$54,5,FALSE),\"\")","v":0},null,null,null,null,null,null,null,null,96,8,5,"MASS 3","SJG"]
[null,50,{"$f":"VLOOKUP($B69,$P$14:$T$70,4)","v":"SJG"},{"$f":"VLOOKUP($B69,$P$14:$T$70,5)","v":"LR"},"Croix de Nivert 14h",{"$f":"IFERROR(VLOOKUP($B69,'Cls M2'!$A$1:$G$54,4,FALSE),\"\")","v":0},{"$f":"IFERROR(VLOOKUP($B69,'Cls M2'!$A$1:$G$54,5,FALSE),\"\")","v":0},null,null,null,null,null,null,null,null,97,8,6,"MASS 3","LBSI"]
[null,94,"MASS 3","FEN 2","Japy à 14h",{"$f":"IFERROR(VLOOKUP($B70,'Cls M2'!$A$1:$G$54,4,FALSE),\"\")","v":""},{"$f":"IFERROR(VLOOKUP($B70,'Cls M2'!$A$1:$G$54,5,FALSE),\"\")","v":""},null,null,null,null,null,null,null,null,98,8,7,"MASS 3","MASS 2"]
[null,85,{"$f":"VLOOKUP($B71,$P$14:$T$70,4)","v":"MASS 2"},{"$f":"VLOOKUP($B71,$P$14:$T$70,5)","v":"FEN 2"},null,{"$f":"IFERROR(VLOOKUP($B71,'Cls M2'!$A$1:$G$54,4,FALSE),\"\")","v":0},{"$f":"IFERROR(VLOOKUP($B71,'Cls M2'!$A$1:$G$54,5,FALSE),\"\")","v":0}]
[null,"DIVISION FILLE"]
[]
[]
["2022-03-23","DIVISION 1"]
[null,4,{"$f":"VLOOKUP($B76,$J$12:$N$42,4)","v":"SBE 2"},{"$f":"VLOOKUP($B76,$J$12:$N$42,5)","v":"SJFF 1"},"SMSM à 14h",{"$f":"IFERROR(VLOOKUP($B76,'Cls M1'!$A$1:$G$33,4,FALSE),\"\")","v":0},{"$f":"IFERROR(VLOOKUP($B76,'Cls M1'!$A$1:$G$33,5,FALSE),\"\")","v":0}]
[null,8,{"$f":"VLOOKUP($B77,$J$12:$N$42,4)","v":"SJFF 1"},{"$f":"VLOOKUP($B77,$J$12:$N$42,5)","v":"SBE 1"},null,{"$f":"IFERROR(VLOOKUP($B77,'Cls M1'!$A$1:$G$33,4,FALSE),\"\")","v":0},{"$f":"IFERROR(VLOOKUP($B77,'Cls M1'!$A$1:$G$33,5,FALSE),\"\")","v":0}]
[null,"DIVISION 2 "]
[null,58,{"$f":"VLOOKUP($B79,$P$14:$T$63,4)","v":"LR"},{"$f":"VLOOKUP($B79,$P$14:$T$63,5)","v":"LBSI"},"LBSI à 13h45",{"$f":"IFERROR(VLOOKUP($B79,'Cls M2'!$A$1:$G$54,4,FALSE),\"\")","v":0},{"$f":"IFERROR(VLOOKUP($B79,'Cls M2'!$A$1:$G$54,5,FALSE),\"\")","v":0}]
[null,62,"MASS 2","LR",null,{"$f":"IFERROR(VLOOKUP($B80,'Cls M2'!$A$1:$G$54,4,FALSE),\"\")","v":0},{"$f":"IFERROR(VLOOKUP($B80,'Cls M2'!$A$1:$G$54,5,FALSE),\"\")","v":0}]
[null,79,"MASS 2","LBSI",null,{"$f":"IFERROR(VLOOKUP($B81,'Cls M2'!$A$1:$G$54,4,FALSE),\"\")","v":0},{"$f":"IFERROR(VLOOKUP($B81,'Cls M2'!$A$1:$G$54,5,FALSE),\"\")","v":0}]
[null,49,"SJFF 2","SMSM","SMSM à 14h"]
[null,66,"FEN 2","MASS 3","Fragonard à 14h"]
[null,"DIVISION FILLE"]
[null,99,{"$f":"VLOOKUP($B85,$V$14:$Z$26,4)","v":"SBE"},{"$f":"VLOOKUP($B85,$V$14:$Z$26,5)","v":"SJFF"},"SMSM à 14h"]
[]
["2022-03-30","DIVISION 1"]
[null,21,{"$f":"VLOOKUP($B88,$J$12:$N$42,4)","v":"FEN 1"},{"$f":"VLOOKUP($B88,$J$12:$N$42,5)","v":"SJFF 1"},"Japy à 14h",{"$f":"IFERROR(VLOOKUP($B88,'Cls M1'!$A$1:$G$33,4,FALSE),\"\")","v":0},{"$f":"IFERROR(VLOOKUP($B88,'Cls M1'!$A$1:$G$33,5,FALSE),\"\")","v":0},"MASS"]
[null,18,{"$f":"VLOOKUP($B89,$J$12:$N$42,4)","v":"SBE 1"},{"$f":"VLOOKUP($B89,$J$12:$N$42,5)","v":"FEN 1"},null,{"$f":"IFERROR(VLOOKUP($B89,'Cls M1'!$A$1:$G$33,4,FALSE),\"\")","v":0},{"$f":"IFERROR(VLOOKUP($B89,'Cls M1'!$A$1:$G$33,5,FALSE),\"\")","v":0}]
[null,19,"SJFF 1","SBE 2",null,{"$f":"IFERROR(VLOOKUP($B90,'Cls M1'!$A$1:$G$33,4,FALSE),\"\")","v":0},{"$f":"IFERROR(VLOOKUP($B90,'Cls M1'!$A$1:$G$33,5,FALSE),\"\")","v":0}]
[null,"DIVISION 2 "]
[null,75,{"$f":"VLOOKUP($B92,$P$14:$T$63,4)","v":"SJFF 2"},{"$f":"VLOOKUP($B92,$P$14:$T$63,5)","v":"FEN 2"},"SJFF à 14h",{"$f":"IFERROR(VLOOKUP($B92,'Cls M2'!$A$1:$G$54,4,FALSE),\"\")","v":0},{"$f":"IFERROR(VLOOKUP($B92,'Cls M2'!$A$1:$G$54,5,FALSE),\"\")","v":0},"MASS"]
[null,86,"LBSI","LR","LR à 14h",{"$f":"IFERROR(VLOOKUP($B93,'Cls M2'!$A$1:$G$54,4,FALSE),\"\")","v":0},{"$f":"IFERROR(VLOOKUP($B93,'Cls M2'!$A$1:$G$54,5,FALSE),\"\")","v":0}]
[null,76,"LBSI","SJG",null,{"$f":"IFERROR(VLOOKUP($B94,'Cls M2'!$A$1:$G$54,4,FALSE),\"\")","v":0},{"$f":"IFERROR(VLOOKUP($B94,'Cls M2'!$A$1:$G$54,5,FALSE),\"\")","v":0}]
[null,78,"LR","SJG",null,{"$f":"IFERROR(VLOOKUP($B95,'Cls M2'!$A$1:$G$54,4,FALSE),\"\")","v":0},{"$f":"IFERROR(VLOOKUP($B95,'Cls M2'!$A$1:$G$54,5,FALSE),\"\")","v":0}]
[null,"DIVISION FILLE"]
[null,105,{"$f":"VLOOKUP($B97,$V$14:$Z$26,4)","v":"SJFF"},{"$f":"VLOOKUP($B97,$V$14:$Z$26,5)","v":"SBE"},"Japy à 14h",null,null,"MASS"]

{"sheet":"Cls M1","index":6,"n_rows":33,"n_cols":20,"rows_kept":33,"cut":false,"hidden":false,"merged":[[0,0,1,6],[2,3,2,4]]}
["MINIMES DIVISION 1 "]
[]
["N° Match","Equipe A","Equipe B","Scores",null,"Vainqueur","Perdant",null,null,"SIGLE","Etablissement","Matchs joués","Victoires","Nuls","Défaites","Points Pour","Points Contre","Différence","Points"]
[1,{"$f":"'Calendrier MG'!M13","v":"SBE 1"},{"$f":"'Calendrier MG'!N13","v":"SBE 2"},null,null,{"$f":"IF(D4<>\"\",IF(D4>E4,B4,IF(D4<E4,C4,\"nul\")),\"\")","v":""},{"$f":"IF(E4<>\"\",IF(E4<D4,C4,IF(E4>D4,B4,\"nul\")),\"\")","v":""},null,{"$f":"RANK(T4,$T$4:$T$8)","v":2},{"$f":"'Calendrier MG'!K4","v":"FEN 1"},"Fénelon 1",{"$f":"COUNT(D6,D9,D14,D18,D21,D24,D29,D33)","v":3},{"$f":"COUNTIF($F$3:$F$33,J4)","v":1},{"$f":"L4-M4-O4","v":0},{"$f":"COUNTIF(G3:G33,J4)","v":2},{"$f":"SUM(D6,E9,E14,D18,E21,D24,D29,E33)","v":31},{"$f":"SUM(E6,D9,D14,E18,D21,E24,E29,D33)","v":45},{"$f":"P4-Q4","v":-14},{"$f":"M4*3+N4*2+O4*1","v":5},{"$f":"SUM(S4*1000000+R4*10000+P4*100+L4*10)","v":4863130}]
[2,{"$f":"'Calendrier MG'!M14","v":"FEN 1"},{"$f":"'Calendrier MG'!N14","v":"SMP"},null,null,{"$f":"IF(D5<>\"\",IF(D5>E5,B5,IF(D5<E5,C5,\"nul\")),\"\")","v":""},{"$f":"IF(E5<>\"\",IF(E5<D5,C5,IF(E5>D5,B5,\"nul\")),\"\")","v":""},null,{"$f":"RANK(T5,$T$4:$T$8)","v":4},{"$f":"'Calendrier MG'!K5","v":"SBE 1"},"Saint Benoist de l'Europe 1",{"$f":"COUNT(D4,D6,D11,D15,D19,D21,D26,D30)","v":2},{"$f":"COUNTIF($F$3:$F$33,J5)","v":0},{"$f":"L5-M5-O5","v":0},{"$f":"COUNTIF(G4:G34,J5)","v":2},{"$f":"SUM(D4,E6,E11,D15,E19,D21,D26,E30)","v":23},{"$f":"SUM(E4,D6,D11,E15,D19,E21,E26,D30)","v":31},{"$f":"P5-Q5","v":-8},{"$f":"M5*3+N5*2+O5*1","v":2},1922320]
[3,{"$f":"'Calendrier MG'!M15","v":"FEN 1"},{"$f":"'Calendrier MG'!N15","v":"SBE 1"},14,9,"FEN 1","SBE 1",null,3,{"$f":"'Calendrier MG'!K6","v":"SBE 2"},"Saint Benoist de l'Europe 2",{"$f":"COUNT(D4,D7,D12,D18,D22,D27,D33,D19)","v":2},1,0,1,{"$f":"SUM(E4,D7,D12,E18,E22,E27,D33,D19)","v":19},{"$f":"SUM(D4,E7,E12,D18,D22,D27,E33,E19)","v":25},-6,4,3941920]
[4,{"$f":"'Calendrier MG'!M16","v":"SBE 2"},{"$f":"'Calendrier MG'!N16","v":"SJFF 1"},null,null,"","",null,5,{"$f":"'Calendrier MG'!K7","v":"SJFF 1"},"Saint Joseph 1",{"$f":"COUNT(D7,D11,D17,D22,D24,D26,D32,D9)","v":0},0,0,0,{"$f":"SUM(E7,D11,D17,D22,E24,E26,E32,D9)","v":0},{"$f":"SUM(D7,E11,E17,E22,D24,D26,D32,E9)","v":0},0,0,0]
[5,{"$f":"'Calendrier MG'!M17","v":"SMP"},{"$f":"'Calendrier MG'!N17","v":"MASS 1"},null,null,"","",null,1,"MASS 1","Massillon 1",{"$f":"COUNT(D12,D15,D14,D17,D27,D29,D32,D30)","v":3},{"$f":"COUNTIF($F$3:$F$33,J8)","v":3},{"$f":"L8-M8-O8","v":0},0,{"$f":"SUM(E12,E15,D14,E17,D27,E29,D32,D30)","v":53},{"$f":"SUM(D12,D15,E14,D17,E27,D29,E32,E30)","v":25},{"$f":"P8-Q8","v":28},{"$f":"M8*3+N8*2+O8*1","v":9},{"$f":"SUM(S8*1000000+R8*10000+P8*100+L8*10)","v":9285330}]
[6,{"$f":"'Calendrier MG'!M18","v":"SJFF 1"},{"$f":"'Calendrier MG'!N18","v":"FEN 1"},null,null,"",""]
[7,{"$f":"'Calendrier MG'!M19","v":"SMP"},{"$f":"'Calendrier MG'!N19","v":"SBE 1"},null,null,"","",null,"Classement","SIGLE","Etablissement","Matchs joués","Victoires","Nuls","Défaites","Points Pour","Points Contre","Différence","Points"]
[8,{"$f":"'Calendrier MG'!M20","v":"SJFF 1"},{"$f":"'Calendrier MG'!N20","v":"SBE 1"},null,null,"","",null,1,{"$f":"VLOOKUP($I11,$I$3:$S$8,COLUMNS($J10:J10)+1,FALSE)","v":"MASS 1"},{"$f":"VLOOKUP($I11,$I$3:$S$8,COLUMNS($J10:K10)+1,FALSE)","v":"Massillon 1"},{"$f":"VLOOKUP($I11,$I$3:$S$8,COLUMNS($J10:L10)+1,FALSE)","v":3},{"$f":"VLOOKUP($I11,$I$3:$S$8,COLUMNS($J10:M10)+1,FALSE)","v":3},{"$f":"VLOOKUP($I11,$I$3:$S$8,COLUMNS($J10:N10)+1,FALSE)","v":0},{"$f":"VLOOKUP($I11,$I$3:$S$8,COLUMNS($J10:O10)+1,FALSE)","v":0},{"$f":"VLOOKUP($I11,$I$3:$S$8,COLUMNS($J10:P10)+1,FALSE)","v":53},{"$f":"VLOOKUP($I11,$I$3:$S$8,COLUMNS($J10:Q10)+1,FALSE)","v":25},{"$f":"VLOOKUP($I11,$I$3:$S$8,COLUMNS($J10:R10)+1,FALSE)","v":28},{"$f":"VLOOKUP($I11,$I$3:$S$8,COLUMNS($J10:S10)+1,FALSE)","v":9}]
[9,{"$f":"'Calendrier MG'!M21","v":"SBE 2"},{"$f":"'Calendrier MG'!N21","v":"MASS 1"},4,15,{"$f":"IF(D12<>\"\",IF(D12>E12,B12,IF(D12<E12,C12,\"nul\")),\"\")","v":"MASS 1"},"SBE 2",null,2,{"$f":"VLOOKUP($I12,$I$3:$S$8,COLUMNS($J11:J11)+1,FALSE)","v":"FEN 1"},{"$f":"VLOOKUP($I12,$I$3:$S$8,COLUMNS($J11:K11)+1,FALSE)","v":"Fénelon 1"},{"$f":"VLOOKUP($I12,$I$3:$S$8,COLUMNS($J11:L11)+1,FALSE)","v":3},{"$f":"VLOOKUP($I12,$I$3:$S$8,COLUMNS($J11:M11)+1,FALSE)","v":1},{"$f":"VLOOKUP($I12,$I$3:$S$8,COLUMNS($J11:N11)+1,FALSE)","v":0},{"$f":"VLOOKUP($I12,$I$3:$S$8,COLUMNS($J11:O11)+1,FALSE)","v":2},{"$f":"VLOOKUP($I12,$I$3:$S$8,COLUMNS($J11:P11)+1,FALSE)","v":31},{"$f":"VLOOKUP($I12,$I$3:$S$8,COLUMNS($J11:Q11)+1,FALSE)","v":45},{"$f":"VLOOKUP($I12,$I$3:$S$8,COLUMNS($J11:R11)+1,FALSE)","v":-14},{"$f":"VLOOKUP($I12,$I$3:$S$8,COLUMNS($J11:S11)+1,FALSE)","v":5}]
[10,{"$f":"'Calendrier MG'!M22","v":"SMP"},{"$f":"'Calendrier MG'!N22","v":"SJFF 1"},null,null,"","",null,3,{"$f":"VLOOKUP($I13,$I$3:$S$8,COLUMNS($J12:J12)+1,FALSE)","v":"SBE 2"},{"$f":"VLOOKUP($I13,$I$3:$S$8,COLUMNS($J12:K12)+1,FALSE)","v":"Saint Benoist de l'Europe 2"},{"$f":"VLOOKUP($I13,$I$3:$S$8,COLUMNS($J12:L12)+1,FALSE)","v":2},{"$f":"VLOOKUP($I13,$I$3:$S$8,COLUMNS($J12:M12)+1,FALSE)","v":1},{"$f":"VLOOKUP($I13,$I$3:$S$8,COLUMNS($J12:N12)+1,FALSE)","v":0},{"$f":"VLOOKUP($I13,$I$3:$S$8,COLUMNS($J12:O12)+1,FALSE)","v":1},{"$f":"VLOOKUP($I13,$I$3:$S$8,COLUMNS($J12:P12)+1,FALSE)","v":19},{"$f":"VLOOKUP($I13,$I$3:$S$8,COLUMNS($J12:Q12)+1,FALSE)","v":25},{"$f":"VLOOKUP($I13,$I$3:$S$8,COLUMNS($J12:R12)+1,FALSE)","v":-6},{"$f":"VLOOKUP($I13,$I$3:$S$8,COLUMNS($J12:S12)+1,FALSE)","v":4}]
[11,{"$f":"'Calendrier MG'!M23","v":"MASS 1"},{"$f":"'Calendrier MG'!N23","v":"FEN 1"},21,7,"MASS 1","FEN 1",null,4,{"$f":"VLOOKUP($I14,$I$3:$S$8,COLUMNS($J13:J13)+1,FALSE)","v":"SBE 1"},{"$f":"VLOOKUP($I14,$I$3:$S$8,COLUMNS($J13:K13)+1,FALSE)","v":"Saint Benoist de l'Europe 1"},{"$f":"VLOOKUP($I14,$I$3:$S$8,COLUMNS($J13:L13)+1,FALSE)","v":2},{"$f":"VLOOKUP($I14,$I$3:$S$8,COLUMNS($J13:M13)+1,FALSE)","v":0},{"$f":"VLOOKUP($I14,$I$3:$S$8,COLUMNS($J13:N13)+1,FALSE)","v":0},{"$f":"VLOOKUP($I14,$I$3:$S$8,COLUMNS($J13:O13)+1,FALSE)","v":2},{"$f":"VLOOKUP($I14,$I$3:$S$8,COLUMNS($J13:P13)+1,FALSE)","v":23},{"$f":"VLOOKUP($I14,$I$3:$S$8,COLUMNS($J13:Q13)+1,FALSE)","v":31},{"$f":"VLOOKUP($I14,$I$3:$S$8,COLUMNS($J13:R13)+1,FALSE)","v":-8},{"$f":"VLOOKUP($I14,$I$3:$S$8,COLUMNS($J13:S13)+1,FALSE)","v":2}]
[12,{"$f":"'Calendrier MG'!M24","v":"SBE 1"},{"$f":"'Calendrier MG'!N24","v":"MASS 1"},14,17,"MASS 1","SBE 1",null,5,{"$f":"VLOOKUP($I15,$I$3:$S$8,COLUMNS($J14:J14)+1,FALSE)","v":"SJFF 1"},{"$f":"VLOOKUP($I15,$I$3:$S$8,COLUMNS($J14:K14)+1,FALSE)","v":"Saint Joseph 1"},{"$f":"VLOOKUP($I15,$I$3:$S$8,COLUMNS($J14:L14)+1,FALSE)","v":0},{"$f":"VLOOKUP($I15,$I$3:$S$8,COLUMNS($J14:M14)+1,FALSE)","v":0},{"$f":"VLOOKUP($I15,$I$3:$S$8,COLUMNS($J14:N14)+1,FALSE)","v":0},{"$f":"VLOOKUP($I15,$I$3:$S$8,COLUMNS($J14:O14)+1,FALSE)","v":0},{"$f":"VLOOKUP($I15,$I$3:$S$8,COLUMNS($J14:P14)+1,FALSE)","v":0},{"$f":"VLOOKUP($I15,$I$3:$S$8,COLUMNS($J14:Q14)+1,FALSE)","v":0},{"$f":"VLOOKUP($I15,$I$3:$S$8,COLUMNS($J14:R14)+1,FALSE)","v":0},{"$f":"VLOOKUP($I15,$I$3:$S$8,COLUMNS($J14:S14)+1,FALSE)","v":0}]
[13,{"$f":"'Calendrier MG'!M25","v":"SBE 2"},{"$f":"'Calendrier MG'!N25","v":"SMP"},null,null,{"$f":"IF(D16<>\"\",IF(D16>E16,B16,IF(D16<E16,C16,\"nul\")),\"\")","v":""},{"$f":"IF(E16<>\"\",IF(E16<D16,C16,IF(E16>D16,B16,\"nul\")),\"\")","v":""}]
[14,{"$f":"'Calendrier MG'!M26","v":"SJFF 1"},{"$f":"'Calendrier MG'!N26","v":"MASS 1"},null,null,"",""]
[15,{"$f":"'Calendrier MG'!M27","v":"FEN 1"},{"$f":"'Calendrier MG'!N27","v":"SBE 2"},10,15,"SBE 2","FEN 1"]
[16,{"$f":"'Calendrier MG'!M28","v":"SBE 2"},{"$f":"'Calendrier MG'!N28","v":"SBE 1"},null,null,"",""]
[17,{"$f":"'Calendrier MG'!M29","v":"SMP"},{"$f":"'Calendrier MG'!N29","v":"FEN 1"},null,null,"",""]
[18,{"$f":"'Calendrier MG'!M30","v":"SBE 1"},{"$f":"'Calendrier MG'!N30","v":"FEN 1"},null,null,"",""]
[19,{"$f":"'Calendrier MG'!M31","v":"SJFF 1"},{"$f":"'Calendrier MG'!N31","v":"SBE 2"},null,null,"",""]
[20,{"$f":"'Calendrier MG'!M32","v":"MASS 1"},{"$f":"'Calendrier MG'!N32","v":"SMP"},null,null,"",""]
[21,{"$f":"'Calendrier MG'!M33","v":"FEN 1"},{"$f":"'Calendrier MG'!N33","v":"SJFF 1"},null,null,"",""]
[22,{"$f":"'Calendrier MG'!M34","v":"SBE 1"},{"$f":"'Calendrier MG'!N34","v":"SMP"},null,null,"",""]
[23,{"$f":"'Calendrier MG'!M35","v":"SBE 1"},{"$f":"'Calendrier MG'!N35","v":"SJFF 1"},null,null,"",""]
[24,{"$f":"'Calendrier MG'!M36","v":"MASS 1"},{"$f":"'Calendrier MG'!N36","v":"SBE 2"},null,null,"",""]
[25,{"$f":"'Calendrier MG'!M37","v":"SJFF 1"},{"$f":"'Calendrier MG'!N37","v":"SMP"},null,null,"",""]
[26,{"$f":"'Calendrier MG'!M38","v":"FEN 1"},{"$f":"'Calendrier MG'!N38","v":"MASS 1"},null,null,"",""]
[27,{"$f":"'Calendrier MG'!M39","v":"MASS 1"},{"$f":"'Calendrier MG'!N39","v":"SBE 1"},null,null,"",""]
[28,{"$f":"'Calendrier MG'!M40","v":"SMP"},{"$f":"'Calendrier MG'!N40","v":"SBE 2"},null,null,"",""]
[29,{"$f":"'Calendrier MG'!M41","v":"MASS 1"},{"$f":"'Calendrier MG'!N41","v":"SJFF 1"},null,null,"",""]
[30,{"$f":"'Calendrier MG'!M42","v":"SBE 2"},{"$f":"'Calendrier MG'!N42","v":"FEN 1"},null,null,"",""]

{"sheet":"Cls M2","index":7,"n_rows":59,"n_cols":20,"rows_kept":59,"cut":false,"hidden":false,"merged":[[0,0,1,6],[2,3,2,4]]}
["MINIMES DIVISION 2"]
[]
["N° Match","Equipe A","Equipe B","Scores",null,"Vainqueur","Perdant",null,null,"SIGLE","Etablissement","Matchs joués","Victoires","Nuls ","Défaites","Points Pour","Points Contre","Différence","Points"]
[43,{"$f":"'Calendrier MG'!S15","v":"LR"},{"$f":"'Calendrier MG'!T15","v":"FEN 2"},18,10,{"$f":"IF(D4<>\"\",IF(D4>E4,B4,IF(D4<E4,C4,\"nul\")),\"\")","v":"LR"},{"$f":"IF(E4<>\"\",IF(E4<D4,C4,IF(E4>D4,B4,\"nul\")),\"\")","v":"FEN 2"},null,{"$f":"RANK(T4,$T$4:$T$11)","v":8},{"$f":"'Calendrier MG'!Q4","v":"SMSM"},"Saint Michel Saint Mandé",{"$f":"COUNT(D5,D7,D10,D17,D21,D24,D25,D33,D53,D52,D35,D38,D45,D49)","v":2},{"$f":"COUNTIF($F$3:$F$54,J4)","v":1},{"$f":"L4-M4-O4","v":0},{"$f":"COUNTIF(G3:G54,J4)","v":1},{"$f":"SUM(D5,D7,E10,E17,D21,D24,D25,E33,E53,E52,E35,D38,D45,E49)","v":9},{"$f":"SUM(E5,E7,D10,D17,E21,E24,E25,D33,D53,D52,D35,E38,E45,D49)","v":12},{"$f":"P4-Q4","v":-3},{"$f":"M4*3+N4*2+O4*1","v":4},{"$f":"SUM(S4*1000000+R4*10000+P4*100+L4*10)","v":3970920}]
[44,{"$f":"'Calendrier MG'!S16","v":"SMSM"},{"$f":"'Calendrier MG'!T16","v":"SJG"},null,null,{"$f":"IF(D5<>\"\",IF(D5>E5,B5,IF(D5<E5,C5,\"nul\")),\"\")","v":""},{"$f":"IF(E5<>\"\",IF(E5<D5,C5,IF(E5>D5,B5,\"nul\")),\"\")","v":""},null,{"$f":"RANK(T5,$T$4:$T$11)","v":3},{"$f":"'Calendrier MG'!Q5","v":"LR"},"La Rochefoucauld",{"$f":"COUNT(D4,D7,D11,D13,D19,D23,D26,D32,D54,D51,D35,D39,D41,D47)","v":3},{"$f":"COUNTIF($F$3:$F$54,J5)","v":3},0,{"$f":"COUNTIF(G4:G55,J5)","v":0},{"$f":"SUM(D4,E7,E11,E13,D19,E23,D26,E32,E54,D51,D35,D39,D41,E47)","v":42},{"$f":"SUM(E4,D7,D11,D13,E19,D23,E26,D32,D54,E51,E35,E39,E41,D47)","v":16},{"$f":"P5-Q5","v":26},{"$f":"M5*3+N5*2+O5*1","v":9},{"$f":"SUM(S5*1000000+R5*10000+P5*100+L5*10)","v":9264230}]
[45,{"$f":"'Calendrier MG'!S17","v":"MASS 2"},{"$f":"'Calendrier MG'!T17","v":"SJFF 2"},22,0,"MASS 2","SJFF 2",null,6,{"$f":"'Calendrier MG'!Q6","v":"FEN 2"},"Fénelon Sainte Marie 2",{"$f":"COUNT(D4,D8,D15,D18,D20,D24,D27,D32,D55,D52,D36,D43,D46,D48)","v":6},0,1,5,{"$f":"SUM(E4,D8,D15,D18,D20,E24,D27,D32,E55,D52,E36,E43,E46,E48)","v":27},{"$f":"SUM(D4,E8,E15,E18,E20,D24,E27,E32,D55,E52,D36,E43,D46,D48)","v":115},{"$f":"P6-Q6","v":-88},7,6122760]
[46,{"$f":"'Calendrier MG'!S18","v":"SMSM"},{"$f":"'Calendrier MG'!T18","v":"LR"},0,8,"LR","SMSM",null,5,{"$f":"'Calendrier MG'!Q7","v":"SJFF 2"},"Saint Joseph 2",{"$f":"COUNT(D8,D10,D13,D16,D22,D6,D28,D34,D56,D36,D38,D41,D44,D50)","v":5},1,0,4,{"$f":"SUM(E8,D10,D13,E16,D22,E6,D28,D34,E56,D36,E38,E41,D44,E50)","v":20},{"$f":"SUM(D8,E10,E13,D16,E22,D6,E28,E34,D56,E36,D38,D41,E44,D50)","v":79},-59,7,6412050]
[47,{"$f":"'Calendrier MG'!S19","v":"FEN 2"},{"$f":"'Calendrier MG'!T19","v":"SJFF 2"},5,6,"SJFF 2","FEN 2",null,2,{"$f":"'Calendrier MG'!Q8","v":"SJG"},"Saint Jean Gabriel",{"$f":"COUNT(D5,D9,D11,D14,D16,D20,D29,D33,D57,D48,D37,D39,D42,D44)","v":4},3,0,1,{"$f":"SUM(E5,D9,D11,E14,D16,E20,D29,D33,E57,D48,E37,E39,D42,E44)","v":124},{"$f":"SUM(D5,E9,E11,D14,E16,D20,E29,E33,D57,E48,D37,D39,E42,D44)","v":38},86,10,10872440]
[48,{"$f":"'Calendrier MG'!S20","v":"SJG"},{"$f":"'Calendrier MG'!T20","v":"LBSI"},11,30,"LBSI","SJG",null,1,{"$f":"'Calendrier MG'!Q9","v":"LBSI"},"La Bruyère Sainte Isabelle",{"$f":"COUNT(D9,D12,D15,D17,D19,D22,D30,D37,D58,D50,D40,D43,D45,D47)","v":4},4,{"$f":"L9-M9-O9","v":0},0,{"$f":"SUM(E9,D12,E15,D17,E19,E22,D30,D37,E58,D50,E40,D43,E45,D47)","v":107},{"$f":"SUM(D9,E12,D15,E17,D19,D22,E30,E37,D58,E50,D40,E43,D45,E47)","v":25},{"$f":"P9-Q9","v":82},{"$f":"M9*3+N9*2+O9*1","v":12},{"$f":"SUM(S9*1000000+R9*10000+P9*100+L9*10)","v":12830740}]
[49,{"$f":"'Calendrier MG'!S21","v":"SJFF 2"},{"$f":"'Calendrier MG'!T21","v":"SMSM"},null,null,"","",null,4,{"$f":"'Calendrier MG'!Q10","v":"MASS 2"},"Massillon 2",{"$f":"COUNT(D6,D12,D14,D18,D21,D23,D31,D34,D59,D51,D40,D42,D46,D49)","v":3},2,{"$f":"L10-M10-O10","v":0},{"$f":"COUNTIF(G9:G59,J10)","v":1},{"$f":"SUM(D6,E12,D14,E18,E21,D23,D31,E34,E59,E51,D40,E42,D46,D49)","v":46},{"$f":"SUM(E6,D12,E14,D18,D21,E23,E31,D34,D59,D51,E40,D42,E46,E49)","v":22},{"$f":"P10-Q10","v":24},{"$f":"M10*3+N10*2+O10*1","v":7},{"$f":"SUM(S10*1000000+R10*10000+P10*100+L10*10)","v":7244630}]
[50,{"$f":"'Calendrier MG'!S22","v":"SJG"},{"$f":"'Calendrier MG'!T22","v":"LR"},null,null,"","",null,7,{"$f":"'Calendrier MG'!Q11","v":"MASS 3"},"Massillon 3",{"$f":"COUNT(D25,D31,D26,D27,D28,D29,D30,D54,D59,D55,D56,D57,D58,D53)","v":3},1,0,{"$f":"COUNTIF(G10:G59,J11)","v":2},{"$f":"SUM(D25,D31,D26,D27,D28,D29,D30,E54,E59,E55,E56,E57,E58,E53)","v":84},{"$f":"SUM(E25,E31,E26,E27,E28,E29,E30,D54,D59,D55,D56,D57,D58,D53)","v":16},68,5,5688430]
[51,{"$f":"'Calendrier MG'!S23","v":"LBSI"},{"$f":"'Calendrier MG'!T23","v":"MASS 2"},18,4,{"$f":"IF(D12<>\"\",IF(D12>E12,B12,IF(D12<E12,C12,\"nul\")),\"\")","v":"LBSI"},"MASS 2"]
[52,{"$f":"'Calendrier MG'!S24","v":"SJFF 2"},{"$f":"'Calendrier MG'!T24","v":"LR"},6,16,"LR","SJFF 2",null,"Classement","SIGLE","Etablissement","Matchs joués","Victoires","Nuls ","Défaites","Points Pour","Points Contre","Différence","Points"]
[53,{"$f":"'Calendrier MG'!S25","v":"MASS 2"},{"$f":"'Calendrier MG'!T25","v":"SJG"},null,null,"","",null,1,{"$f":"VLOOKUP($I14,$I$3:$S$11,COLUMNS($J13:J13)+1,FALSE)","v":"LBSI"},{"$f":"VLOOKUP($I14,$I$3:$S$11,COLUMNS($J13:K13)+1,FALSE)","v":"La Bruyère Sainte Isabelle"},{"$f":"VLOOKUP($I14,$I$3:$S$11,COLUMNS($J13:L13)+1,FALSE)","v":4},{"$f":"VLOOKUP($I14,$I$3:$S$11,COLUMNS($J13:M13)+1,FALSE)","v":4},{"$f":"VLOOKUP($I14,$I$3:$S$11,COLUMNS($J13:N13)+1,FALSE)","v":0},{"$f":"VLOOKUP($I14,$I$3:$S$11,COLUMNS($J13:O13)+1,FALSE)","v":0},{"$f":"VLOOKUP($I14,$I$3:$S$11,COLUMNS($J13:P13)+1,FALSE)","v":107},{"$f":"VLOOKUP($I14,$I$3:$S$11,COLUMNS($J13:Q13)+1,FALSE)","v":25},{"$f":"VLOOKUP($I14,$I$3:$S$11,COLUMNS($J13:R13)+1,FALSE)","v":82},{"$f":"VLOOKUP($I14,$I$3:$S$11,COLUMNS($J13:S13)+1,FALSE)","v":12}]
[54,{"$f":"'Calendrier MG'!S26","v":"FEN 2"},{"$f":"'Calendrier MG'!T26","v":"LBSI"},2,18,"LBSI","FEN 2",null,2,{"$f":"VLOOKUP($I15,$I$3:$S$11,COLUMNS($J14:J14)+1,FALSE)","v":"SJG"},{"$f":"VLOOKUP($I15,$I$3:$S$11,COLUMNS($J14:K14)+1,FALSE)","v":"Saint Jean Gabriel"},{"$f":"VLOOKUP($I15,$I$3:$S$11,COLUMNS($J14:L14)+1,FALSE)","v":4},{"$f":"VLOOKUP($I15,$I$3:$S$11,COLUMNS($J14:M14)+1,FALSE)","v":3},{"$f":"VLOOKUP($I15,$I$3:$S$11,COLUMNS($J14:N14)+1,FALSE)","v":0},{"$f":"VLOOKUP($I15,$I$3:$S$11,COLUMNS($J14:O14)+1,FALSE)","v":1},{"$f":"VLOOKUP($I15,$I$3:$S$11,COLUMNS($J14:P14)+1,FALSE)","v":124},{"$f":"VLOOKUP($I15,$I$3:$S$11,COLUMNS($J14:Q14)+1,FALSE)","v":38},{"$f":"VLOOKUP($I15,$I$3:$S$11,COLUMNS($J14:R14)+1,FALSE)","v":86},{"$f":"VLOOKUP($I15,$I$3:$S$11,COLUMNS($J14:S14)+1,FALSE)","v":10}]
[55,{"$f":"'Calendrier MG'!S27","v":"SJG"},{"$f":"'Calendrier MG'!T27","v":"SJFF 2"},30,4,"SJG","SJFF 2",null,3,{"$f":"VLOOKUP($I16,$I$3:$S$11,COLUMNS($J15:J15)+1,FALSE)","v":"LR"},{"$f":"VLOOKUP($I16,$I$3:$S$11,COLUMNS($J15:K15)+1,FALSE)","v":"La Rochefoucauld"},{"$f":"VLOOKUP($I16,$I$3:$S$11,COLUMNS($J15:L15)+1,FALSE)","v":3},{"$f":"VLOOKUP($I16,$I$3:$S$11,COLUMNS($J15:M15)+1,FALSE)","v":3},{"$f":"VLOOKUP($I16,$I$3:$S$11,COLUMNS($J15:N15)+1,FALSE)","v":0},{"$f":"VLOOKUP($I16,$I$3:$S$11,COLUMNS($J15:O15)+1,FALSE)","v":0},{"$f":"VLOOKUP($I16,$I$3:$S$11,COLUMNS($J15:P15)+1,FALSE)","v":42},{"$f":"VLOOKUP($I16,$I$3:$S$11,COLUMNS($J15:Q15)+1,FALSE)","v":16},{"$f":"VLOOKUP($I16,$I$3:$S$11,COLUMNS($J15:R15)+1,FALSE)","v":26},{"$f":"VLOOKUP($I16,$I$3:$S$11,COLUMNS($J15:S15)+1,FALSE)","v":9}]
[56,{"$f":"'Calendrier MG'!S28","v":"LBSI"},{"$f":"'Calendrier MG'!T28","v":"SMSM"},null,null,"","",null,4,{"$f":"VLOOKUP($I17,$I$3:$S$11,COLUMNS($J16:J16)+1,FALSE)","v":"MASS 2"},{"$f":"VLOOKUP($I17,$I$3:$S$11,COLUMNS($J16:K16)+1,FALSE)","v":"Massillon 2"},{"$f":"VLOOKUP($I17,$I$3:$S$11,COLUMNS($J16:L16)+1,FALSE)","v":3},{"$f":"VLOOKUP($I17,$I$3:$S$11,COLUMNS($J16:M16)+1,FALSE)","v":2},{"$f":"VLOOKUP($I17,$I$3:$S$11,COLUMNS($J16:N16)+1,FALSE)","v":0},{"$f":"VLOOKUP($I17,$I$3:$S$11,COLUMNS($J16:O16)+1,FALSE)","v":1},{"$f":"VLOOKUP($I17,$I$3:$S$11,COLUMNS($J16:P16)+1,FALSE)","v":46},{"$f":"VLOOKUP($I17,$I$3:$S$11,COLUMNS($J16:Q16)+1,FALSE)","v":22},{"$f":"VLOOKUP($I17,$I$3:$S$11,COLUMNS($J16:R16)+1,FALSE)","v":24},{"$f":"VLOOKUP($I17,$I$3:$S$11,COLUMNS($J16:S16)+1,FALSE)","v":7}]
[57,{"$f":"'Calendrier MG'!S29","v":"FEN 2"},{"$f":"'Calendrier MG'!T29","v":"MASS 2"},4,20,"MASS 2","FEN 2",null,5,{"$f":"VLOOKUP($I18,$I$3:$S$11,COLUMNS($J17:J17)+1,FALSE)","v":"SJFF 2"},{"$f":"VLOOKUP($I18,$I$3:$S$11,COLUMNS($J17:K17)+1,FALSE)","v":"Saint Joseph 2"},{"$f":"VLOOKUP($I18,$I$3:$S$11,COLUMNS($J17:L17)+1,FALSE)","v":5},{"$f":"VLOOKUP($I18,$I$3:$S$11,COLUMNS($J17:M17)+1,FALSE)","v":1},{"$f":"VLOOKUP($I18,$I$3:$S$11,COLUMNS($J17:N17)+1,FALSE)","v":0},{"$f":"VLOOKUP($I18,$I$3:$S$11,COLUMNS($J17:O17)+1,FALSE)","v":4},{"$f":"VLOOKUP($I18,$I$3:$S$11,COLUMNS($J17:P17)+1,FALSE)","v":20},{"$f":"VLOOKUP($I18,$I$3:$S$11,COLUMNS($J17:Q17)+1,FALSE)","v":79},{"$f":"VLOOKUP($I18,$I$3:$S$11,COLUMNS($J17:R17)+1,FALSE)","v":-59},{"$f":"VLOOKUP($I18,$I$3:$S$11,COLUMNS($J17:S17)+1,FALSE)","v":7}]
[58,{"$f":"'Calendrier MG'!S30","v":"LR"},{"$f":"'Calendrier MG'!T30","v":"LBSI"},null,null,"","",null,6,{"$f":"VLOOKUP($I19,$I$3:$S$11,COLUMNS($J18:J18)+1,FALSE)","v":"FEN 2"},{"$f":"VLOOKUP($I19,$I$3:$S$11,COLUMNS($J18:K18)+1,FALSE)","v":"Fénelon Sainte Marie 2"},{"$f":"VLOOKUP($I19,$I$3:$S$11,COLUMNS($J18:L18)+1,FALSE)","v":6},{"$f":"VLOOKUP($I19,$I$3:$S$11,COLUMNS($J18:M18)+1,FALSE)","v":0},{"$f":"VLOOKUP($I19,$I$3:$S$11,COLUMNS($J18:N18)+1,FALSE)","v":1},{"$f":"VLOOKUP($I19,$I$3:$S$11,COLUMNS($J18:O18)+1,FALSE)","v":5},{"$f":"VLOOKUP($I19,$I$3:$S$11,COLUMNS($J18:P18)+1,FALSE)","v":27},{"$f":"VLOOKUP($I19,$I$3:$S$11,COLUMNS($J18:Q18)+1,FALSE)","v":115},{"$f":"VLOOKUP($I19,$I$3:$S$11,COLUMNS($J18:R18)+1,FALSE)","v":-88},{"$f":"VLOOKUP($I19,$I$3:$S$11,COLUMNS($J18:S18)+1,FALSE)","v":7}]
[59,{"$f":"'Calendrier MG'!S31","v":"FEN 2"},{"$f":"'Calendrier MG'!T31","v":"SJG"},2,44,"SJG","FEN 2",null,7,{"$f":"VLOOKUP($I20,$I$3:$S$11,COLUMNS($J19:J19)+1,FALSE)","v":"MASS 3"},{"$f":"VLOOKUP($I20,$I$3:$S$11,COLUMNS($J19:K19)+1,FALSE)","v":"Massillon 3"},{"$f":"VLOOKUP($I20,$I$3:$S$11,COLUMNS($J19:L19)+1,FALSE)","v":3},{"$f":"VLOOKUP($I20,$I$3:$S$11,COLUMNS($J19:M19)+1,FALSE)","v":1},{"$f":"VLOOKUP($I20,$I$3:$S$11,COLUMNS($J19:N19)+1,FALSE)","v":0},{"$f":"VLOOKUP($I20,$I$3:$S$11,COLUMNS($J19:O19)+1,FALSE)","v":2},{"$f":"VLOOKUP($I20,$I$3:$S$11,COLUMNS($J19:P19)+1,FALSE)","v":84},{"$f":"VLOOKUP($I20,$I$3:$S$11,COLUMNS($J19:Q19)+1,FALSE)","v":16},{"$f":"VLOOKUP($I20,$I$3:$S$11,COLUMNS($J19:R19)+1,FALSE)","v":68},{"$f":"VLOOKUP($I20,$I$3:$S$11,COLUMNS($J19:S19)+1,FALSE)","v":5}]
[60,{"$f":"'Calendrier MG'!S32","v":"SMSM"},{"$f":"'Calendrier MG'!T32","v":"MASS 2"},null,null,"","",null,8,{"$f":"VLOOKUP($I21,$I$3:$S$11,COLUMNS($J20:J20)+1,FALSE)","v":"SMSM"},{"$f":"VLOOKUP($I21,$I$3:$S$11,COLUMNS($J20:K20)+1,FALSE)","v":"Saint Michel Saint Mandé"},{"$f":"VLOOKUP($I21,$I$3:$S$11,COLUMNS($J20:L20)+1,FALSE)","v":2},{"$f":"VLOOKUP($I21,$I$3:$S$11,COLUMNS($J20:M20)+1,FALSE)","v":1},{"$f":"VLOOKUP($I21,$I$3:$S$11,COLUMNS($J20:N20)+1,FALSE)","v":0},{"$f":"VLOOKUP($I21,$I$3:$S$11,COLUMNS($J20:O20)+1,FALSE)","v":1},{"$f":"VLOOKUP($I21,$I$3:$S$11,COLUMNS($J20:P20)+1,FALSE)","v":9},{"$f":"VLOOKUP($I21,$I$3:$S$11,COLUMNS($J20:Q20)+1,FALSE)","v":12},{"$f":"VLOOKUP($I21,$I$3:$S$11,COLUMNS($J20:R20)+1,FALSE)","v":-3},{"$f":"VLOOKUP($I21,$I$3:$S$11,COLUMNS($J20:S20)+1,FALSE)","v":4}]
[61,{"$f":"'Calendrier MG'!S33","v":"SJFF 2"},{"$f":"'Calendrier MG'!T33","v":"LBSI"},null,null,"",""]
[62,{"$f":"'Calendrier MG'!S34","v":"MASS 2"},{"$f":"'Calendrier MG'!T34","v":"LR"},null,null,"",""]
[63,{"$f":"'Calendrier MG'!S35","v":"SMSM"},{"$f":"'Calendrier MG'!T35","v":"FEN 2"},9,4,{"$f":"IF(D24<>\"\",IF(D24>E24,B24,IF(D24<E24,C24,\"nul\")),\"\")","v":"SMSM"},{"$f":"IF(E24<>\"\",IF(E24<D24,C24,IF(E24>D24,B24,\"nul\")),\"\")","v":"FEN 2"}]
[64,{"$f":"'Calendrier MG'!S36","v":"SMSM"},{"$f":"'Calendrier MG'!T36","v":"MASS 3"},null,null,"",""]
[65,{"$f":"'Calendrier MG'!S37","v":"LR"},{"$f":"'Calendrier MG'!T37","v":"MASS 3"},null,null,"",""]
[66,{"$f":"'Calendrier MG'!S38","v":"FEN 2"},{"$f":"'Calendrier MG'!T38","v":"MASS 3"},null,null,"",""]
[67,{"$f":"'Calendrier MG'!S39","v":"SJFF 2"},{"$f":"'Calendrier MG'!T39","v":"MASS 3"},4,6,"MASS 3","SJFF 2"]
[68,{"$f":"'Calendrier MG'!S40","v":"SJG"},{"$f":"'Calendrier MG'!T40","v":"MASS 3"},39,2,"SJG","MASS 3"]
[69,{"$f":"'Calendrier MG'!S41","v":"LBSI"},{"$f":"'Calendrier MG'!T41","v":"MASS 3"},41,8,"LBSI","MASS 3"]
[70,{"$f":"'Calendrier MG'!S42","v":"MASS 2"},{"$f":"'Calendrier MG'!T42","v":"MASS 3"},null,null,"",""]
[71,{"$f":"'Calendrier MG'!S43","v":"FEN 2"},{"$f":"'Calendrier MG'!T43","v":"LR"},null,null,"",""]
[72,{"$f":"'Calendrier MG'!S44","v":"SJG"},{"$f":"'Calendrier MG'!T44","v":"SMSM"},null,null,"",""]
[73,{"$f":"'Calendrier MG'!S45","v":"SJFF 2"},{"$f":"'Calendrier MG'!T45","v":"MASS 2"}]
[74,{"$f":"'Calendrier MG'!S46","v":"LR"},{"$f":"'Calendrier MG'!T46","v":"SMSM"}]
[75,{"$f":"'Calendrier MG'!S47","v":"SJFF 2"},{"$f":"'Calendrier MG'!T47","v":"FEN 2"}]
[76,{"$f":"'Calendrier MG'!S48","v":"LBSI"},{"$f":"'Calendrier MG'!T48","v":"SJG"}]
[77,{"$f":"'Calendrier MG'!S49","v":"SMSM"},{"$f":"'Calendrier MG'!T49","v":"SJFF 2"}]
[78,{"$f":"'Calendrier MG'!S50","v":"LR"},{"$f":"'Calendrier MG'!T50","v":"SJG"}]
[79,{"$f":"'Calendrier MG'!S51","v":"MASS 2"},{"$f":"'Calendrier MG'!T51","v":"LBSI"}]
[80,{"$f":"'Calendrier MG'!S52","v":"LR"},{"$f":"'Calendrier MG'!T52","v":"SJFF 2"}]
[81,{"$f":"'Calendrier MG'!S53","v":"SJG"},{"$f":"'Calendrier MG'!T53","v":"MASS 2"}]
[82,{"$f":"'Calendrier MG'!S54","v":"LBSI"},{"$f":"'Calendrier MG'!T54","v":"FEN 2"}]
[83,{"$f":"'Calendrier MG'!S55","v":"SJFF 2"},{"$f":"'Calendrier MG'!T55","v":"SJG"}]
[84,{"$f":"'Calendrier MG'!S56","v":"SMSM"},{"$f":"'Calendrier MG'!T56","v":"LBSI"}]
[85,{"$f":"'Calendrier MG'!S57","v":"MASS 2"},{"$f":"'Calendrier MG'!T57","v":"FEN 2"}]
[86,{"$f":"'Calendrier MG'!S58","v":"LBSI"},{"$f":"'Calendrier MG'!T58","v":"LR"}]
[87,{"$f":"'Calendrier MG'!S59","v":"SJG"},{"$f":"'Calendrier MG'!T59","v":"FEN 2"}]
[88,{"$f":"'Calendrier MG'!S60","v":"MASS 2"},{"$f":"'Calendrier MG'!T60","v":"SMSM"}]
[89,{"$f":"'Calendrier MG'!S61","v":"LBSI"},{"$f":"'Calendrier MG'!T61","v":"SJFF 2"}]
[90,{"$f":"'Calendrier MG'!S62","v":"LR"},{"$f":"'Calendrier MG'!T62","v":"MASS 2"}]
[91,{"$f":"'Calendrier MG'!S63","v":"FEN 2"},{"$f":"'Calendrier MG'!T63","v":"SMSM"}]
[92,{"$f":"'Calendrier MG'!S64","v":"MASS 3"},{"$f":"'Calendrier MG'!T64","v":"SMSM"}]
[93,{"$f":"'Calendrier MG'!S65","v":"MASS 3"},{"$f":"'Calendrier MG'!T65","v":"LR"}]
[94,{"$f":"'Calendrier MG'!S66","v":"MASS 3"},{"$f":"'Calendrier MG'!T66","v":"FEN 2"}]
[95,{"$f":"'Calendrier MG'!S67","v":"MASS 3"},{"$f":"'Calendrier MG'!T67","v":"SJFF 2"}]
[96,{"$f":"'Calendrier MG'!S68","v":"MASS 3"},{"$f":"'Calendrier MG'!T68","v":"SJG"}]
[97,{"$f":"'Calendrier MG'!S69","v":"MASS 3"},{"$f":"'Calendrier MG'!T69","v":"LBSI"}]
[98,{"$f":"'Calendrier MG'!S70","v":"MASS 3"},{"$f":"'Calendrier MG'!T70","v":"MASS 2"}]

{"sheet":"Cls Mixte","index":8,"n_rows":15,"n_cols":20,"rows_kept":15,"cut":false,"hidden":false,"merged":[[0,0,1,6],[2,3,2,4]]}
["MINIMES DIVISION Mixte"]
[]
["N° Match","Equipe A","Equipe B","Scores",null,"Vainqueur","Perdant",null,null,"SIGLE","Etablissement","Matchs joués","Victoires","Nuls ","Défaites","Points Pour","Points Contre","Différence","Points"]
[99,{"$f":"'Calendrier MG'!Y15","v":"SBE"},{"$f":"'Calendrier MG'!Z15","v":"SJFF"},null,null,{"$f":"IF(D4<>\"\",IF(D4>E4,B4,IF(D4<E4,C4,\"nul\")),\"\")","v":""},{"$f":"IF(E4<>\"\",IF(E4<D4,C4,IF(E4>D4,B4,\"nul\")),\"\")","v":""},null,{"$f":"RANK(T4,$T$4:$T$6)","v":3},{"$f":"'Calendrier MG'!W4","v":"SBE"},"Saint Benoist de l'Europe ",{"$f":"COUNT(D4,D8,D10,D14)","v":0},{"$f":"COUNTIF($F$3:$F$15,J4)","v":0},{"$f":"L4-M4-O4","v":0},{"$f":"COUNTIF(G3:G15,J4)","v":0},{"$f":"SUM(D4,D8,E10,E14)","v":0},{"$f":"SUM(E4,E8,D10,D14)","v":0},{"$f":"P4-Q4","v":0},{"$f":"M4*3+N4*2+O4*1","v":0},{"$f":"SUM(S4*1000000+R4*10000+P4*100+L4*10)","v":0}]
[100,{"$f":"'Calendrier MG'!Y16","v":"SMP"},{"$f":"'Calendrier MG'!Z16","v":"SJG"},null,null,{"$f":"IF(D5<>\"\",IF(D5>E5,B5,IF(D5<E5,C5,\"nul\")),\"\")","v":""},{"$f":"IF(E5<>\"\",IF(E5<D5,C5,IF(E5>D5,B5,\"nul\")),\"\")","v":""},null,{"$f":"RANK(T5,$T$4:$T$6)","v":1},{"$f":"'Calendrier MG'!W5","v":"SJFF"},"Saint Joseph 2",{"$f":"COUNT(D4,D7,D10,D13)","v":1},{"$f":"COUNTIF($F$3:$F$15,J5)","v":1},0,{"$f":"COUNTIF(G4:G15,J5)","v":0},{"$f":"SUM(E4,D7,D10,E13)","v":12},{"$f":"SUM(D4,E7,E10,D13)","v":4},{"$f":"P5-Q5","v":8},{"$f":"M5*3+N5*2+O5*1","v":3},{"$f":"SUM(S5*1000000+R5*10000+P5*100+L5*10)","v":3081210}]
[101,{"$f":"'Calendrier MG'!Y17","v":"SBE"},{"$f":"'Calendrier MG'!Z17","v":"SMP"},null,null,"","",null,{"$f":"RANK(T6,$T$4:$T$6)","v":2},{"$f":"'Calendrier MG'!W7","v":"SJG"},"Saint Jean Gabriel",{"$f":"COUNT(D7,D8,D13,D14)","v":1},{"$f":"COUNTIF($F$3:$F$15,J6)","v":0},0,{"$f":"COUNTIF(G6:G15,J6)","v":1},{"$f":"SUM(E7,E8,D13,D14)","v":4},{"$f":"SUM(D7,D8,E13,E14)","v":12},-8,1,920410]
[102,{"$f":"'Calendrier MG'!Y18","v":"SJFF"},{"$f":"'Calendrier MG'!Z18","v":"SJG"},12,4,"SJFF","SJG"]
[103,{"$f":"'Calendrier MG'!Y19","v":"SBE"},{"$f":"'Calendrier MG'!Z19","v":"SJG"},null,null,"",""]
[104,{"$f":"'Calendrier MG'!Y20","v":"SJFF"},{"$f":"'Calendrier MG'!Z20","v":"SMP"},null,null,"","",null,"Classement","SIGLE","Etablissement","Matchs joués","Victoires","Nuls ","Défaites","Points Pour","Points Contre","Différence","Points"]
[105,{"$f":"'Calendrier MG'!Y21","v":"SJFF"},{"$f":"'Calendrier MG'!Z21","v":"SBE"},null,null,"","",null,1,{"$f":"VLOOKUP($I10,$I$3:$S$6,COLUMNS($J9:J9)+1,FALSE)","v":"SJFF"},{"$f":"VLOOKUP($I10,$I$3:$S$6,COLUMNS($J9:K9)+1,FALSE)","v":"Saint Joseph 2"},{"$f":"VLOOKUP($I10,$I$3:$S$6,COLUMNS($J9:L9)+1,FALSE)","v":1},{"$f":"VLOOKUP($I10,$I$3:$S$6,COLUMNS($J9:M9)+1,FALSE)","v":1},{"$f":"VLOOKUP($I10,$I$3:$S$6,COLUMNS($J9:N9)+1,FALSE)","v":0},{"$f":"VLOOKUP($I10,$I$3:$S$6,COLUMNS($J9:O9)+1,FALSE)","v":0},{"$f":"VLOOKUP($I10,$I$3:$S$6,COLUMNS($J9:P9)+1,FALSE)","v":12},{"$f":"VLOOKUP($I10,$I$3:$S$6,COLUMNS($J9:Q9)+1,FALSE)","v":4},{"$f":"VLOOKUP($I10,$I$3:$S$6,COLUMNS($J9:R9)+1,FALSE)","v":8},{"$f":"VLOOKUP($I10,$I$3:$S$6,COLUMNS($J9:S9)+1,FALSE)","v":3}]
[106,{"$f":"'Calendrier MG'!Y22","v":"SJG"},{"$f":"'Calendrier MG'!Z22","v":"SMP"},null,null,"","",null,2,{"$f":"VLOOKUP($I11,$I$3:$S$6,COLUMNS($J10:J10)+1,FALSE)","v":"SJG"},{"$f":"VLOOKUP($I11,$I$3:$S$6,COLUMNS($J10:K10)+1,FALSE)","v":"Saint Jean Gabriel"},{"$f":"VLOOKUP($I11,$I$3:$S$6,COLUMNS($J10:L10)+1,FALSE)","v":1},{"$f":"VLOOKUP($I11,$I$3:$S$6,COLUMNS($J10:M10)+1,FALSE)","v":0},{"$f":"VLOOKUP($I11,$I$3:$S$6,COLUMNS($J10:N10)+1,FALSE)","v":0},{"$f":"VLOOKUP($I11,$I$3:$S$6,COLUMNS($J10:O10)+1,FALSE)","v":1},{"$f":"VLOOKUP($I11,$I$3:$S$6,COLUMNS($J10:P10)+1,FALSE)","v":4},{"$f":"VLOOKUP($I11,$I$3:$S$6,COLUMNS($J10:Q10)+1,FALSE)","v":12},{"$f":"VLOOKUP($I11,$I$3:$S$6,COLUMNS($J10:R10)+1,FALSE)","v":-8},{"$f":"VLOOKUP($I11,$I$3:$S$6,COLUMNS($J10:S10)+1,FALSE)","v":1}]
[107,{"$f":"'Calendrier MG'!Y23","v":"SMP"},{"$f":"'Calendrier MG'!Z23","v":"SBE"},null,null,{"$f":"IF(D12<>\"\",IF(D12>E12,B12,IF(D12<E12,C12,\"nul\")),\"\")","v":""},"",null,3,{"$f":"VLOOKUP($I12,$I$3:$S$6,COLUMNS($J11:J11)+1,FALSE)","v":"SBE"},{"$f":"VLOOKUP($I12,$I$3:$S$6,COLUMNS($J11:K11)+1,FALSE)","v":"Saint Benoist de l'Europe "},{"$f":"VLOOKUP($I12,$I$3:$S$6,COLUMNS($J11:L11)+1,FALSE)","v":0},{"$f":"VLOOKUP($I12,$I$3:$S$6,COLUMNS($J11:M11)+1,FALSE)","v":0},{"$f":"VLOOKUP($I12,$I$3:$S$6,COLUMNS($J11:N11)+1,FALSE)","v":0},{"$f":"VLOOKUP($I12,$I$3:$S$6,COLUMNS($J11:O11)+1,FALSE)","v":0},{"$f":"VLOOKUP($I12,$I$3:$S$6,COLUMNS($J11:P11)+1,FALSE)","v":0},{"$f":"VLOOKUP($I12,$I$3:$S$6,COLUMNS($J11:Q11)+1,FALSE)","v":0},{"$f":"VLOOKUP($I12,$I$3:$S$6,COLUMNS($J11:R11)+1,FALSE)","v":0},{"$f":"VLOOKUP($I12,$I$3:$S$6,COLUMNS($J11:S11)+1,FALSE)","v":0}]
[108,{"$f":"'Calendrier MG'!Y24","v":"SJG"},{"$f":"'Calendrier MG'!Z24","v":"SJFF"},null,null,"",""]
[109,{"$f":"'Calendrier MG'!Y25","v":"SJG"},{"$f":"'Calendrier MG'!Z25","v":"SBE"},null,null,"",""]
[110,{"$f":"'Calendrier MG'!Y26","v":"SMP"},{"$f":"'Calendrier MG'!Z26","v":"SJFF"},null,null,"",""]

{"sheet":"Calendriers CG","index":9,"n_rows":39,"n_cols":14,"rows_kept":39,"cut":false,"hidden":false,"merged":[[34,0,38,0],[34,1,34,7],[35,4,38,4],[35,7,38,7],[9,12,9,13],[29,0,33,0],[29,1,29,7],[30,4,33,4],[30,7,33,7],[24,0,28,0],[24,1,24,7],[25,4,28,4],[25,7,28,7],[0,1,0,7],[0,9,0,20],[1,9,1,10],[1,12,1,13],[2,9,2,10],[2,12,2,13],[1,5,1,6],[3,4,5,4],[19,1,19,7],[20,7,23,7],[13,0,18,0],[7,0,12,0],[2,0,6,0],[19,0,23,0],[20,4,23,4],[13,4,16,4],[2,1,2,7]]}
[null," CALENDRIER LYCEE",null,null,null,null,null,null,null,"POULES ET MATCHS CADETS ET CADETTES/JUNIORS FILLES"]
["Date","Match","Equipe A","Equipe B","Lieux","Résultats",null,"Indisponibilités",null,"CADETS",null,null,"JUNIORS"]
["2021-11-17","CADETS",null,null,null,null,null,null,null,"Etablissements",null,null,"Etablissements"]
[null,1,{"$f":"VLOOKUP($B4,$J$10:$N$28,4)","v":"SBE"},{"$f":"VLOOKUP($B4,$J$10:$N$28,5)","v":"SMP"},"LR à 14h",30,26,null,null,1,"SBE",null,1,"SMP (JG)"]
[null,2,{"$f":"VLOOKUP($B5,$J$10:$N$28,4)","v":"SBE"},{"$f":"VLOOKUP($B5,$J$10:$N$28,5)","v":"LR"},null,53,10,null,null,2,"SMP"]
[null,3,{"$f":"VLOOKUP($B6,$J$10:$N$28,4)","v":"SMP"},{"$f":"VLOOKUP($B6,$J$10:$N$28,5)","v":"LR"},null,57,27,null,null,3,"LR"]
[null,18,{"$f":"VLOOKUP($B7,$J$10:$N$28,4)","v":"SMP (JG)"},{"$f":"VLOOKUP($B7,$J$10:$N$28,5)","v":"SMSM"},"SMP à 14h",{"$f":"IFERROR(VLOOKUP($B7,'Cls B2'!$A$1:$G$15,4,FALSE),\"\")","v":""},{"$f":"IFERROR(VLOOKUP($B7,'Cls B2'!$A$1:$G$15,5,FALSE),\"\")","v":""},null,null,4,"SMSM"]
["2021-11-24",null,null,null,null,null,null,null,null,5,"SMP (JG)"]
[]
[null,null,null,null,null,null,null,null,null,"N° Match","Equipe A","Equipe B","Match"]
[null,null,null,null,null,null,null,null,null,1,1,2,{"$f":"VLOOKUP(K11,$J$2:$K$9,2)","v":"SBE"},{"$f":"VLOOKUP(L11,$J$2:$K$9,2)","v":"SMP"}]
[null,null,null,null,null,null,null,null,null,2,1,3,"SBE","LR"]
[null,null,null,null,null,null,null,null,null,3,2,3,"SMP","LR"]
["2021-12-01",7,{"$f":"VLOOKUP($B14,$J$10:$N$28,4)","v":"SBE"},{"$f":"VLOOKUP($B14,$J$10:$N$28,5)","v":"SMSM"},"SMSM à 14h",36,29,null,null,4,2,1,"SMP","SBE"]
[null,null,{"$f":"VLOOKUP($B15,$J$10:$N$28,4)","v":{"$error":"#N/A"}},{"$f":"VLOOKUP($B15,$J$10:$N$28,5)","v":{"$error":"#N/A"}},null,null,null,null,null,5,3,1,"LR","SBE"]
[null,null,{"$f":"VLOOKUP($B16,$J$10:$N$28,4)","v":{"$error":"#N/A"}},{"$f":"VLOOKUP($B16,$J$10:$N$28,5)","v":{"$error":"#N/A"}},null,null,null,null,null,6,3,2,"LR","SMP"]
[null,null,{"$f":"VLOOKUP($B17,$J$10:$N$28,4)","v":{"$error":"#N/A"}},{"$f":"VLOOKUP($B17,$J$10:$N$28,5)","v":{"$error":"#N/A"}},null,null,null,null,null,7,1,4,"SBE","SMSM"]
[null,null,null,null,null,null,null,null,null,8,2,4,"SMP","SMSM"]
[null,null,null,null,null,null,null,null,null,9,3,4,"LR","SMSM"]
["2021-12-08","CADETS",null,null,null,null,null,null,null,10,4,1,"SMSM","SBE"]
[null,null,{"$f":"VLOOKUP($B21,$J$10:$N$28,4)","v":{"$error":"#N/A"}},{"$f":"VLOOKUP($B21,$J$10:$N$28,5)","v":{"$error":"#N/A"}},null,null,null,"LR",null,11,4,2,"SMSM","SMP"]
[null,null,{"$f":"VLOOKUP($B22,$J$10:$N$28,4)","v":{"$error":"#N/A"}},{"$f":"VLOOKUP($B22,$J$10:$N$28,5)","v":{"$error":"#N/A"}},null,null,null,null,null,12,4,3,"SMSM","LR"]
[null,null,{"$f":"VLOOKUP($B23,$J$10:$N$28,4)","v":{"$error":"#N/A"}},{"$f":"VLOOKUP($B23,$J$10:$N$28,5)","v":{"$error":"#N/A"}},null,null,null,null,null,13,1,5,"SBE","SMP (JG)"]
[null,null,{"$f":"VLOOKUP($B24,$J$10:$N$28,4)","v":{"$error":"#N/A"}},{"$f":"VLOOKUP($B24,$J$10:$N$28,5)","v":{"$error":"#N/A"}},null,{"$f":"IFERROR(VLOOKUP($B24,'Cls B2'!$A$1:$G$15,4,FALSE),\"\")","v":""},{"$f":"IFERROR(VLOOKUP($B24,'Cls B2'!$A$1:$G$15,5,FALSE),\"\")","v":""},null,null,14,3,5,"LR","SMP (JG)"]
["2021-12-15","CADETS",null,null,null,null,null,null,null,15,4,5,"SMSM","SMP (JG)"]
[null,null,{"$f":"VLOOKUP($B26,$J$10:$N$28,4)","v":{"$error":"#N/A"}},{"$f":"VLOOKUP($B26,$J$10:$N$28,5)","v":{"$error":"#N/A"}},null,null,null,"SBE",null,16,5,1,"SMP (JG)","SBE"]
[null,null,{"$f":"VLOOKUP($B27,$J$10:$N$28,4)","v":{"$error":"#N/A"}},{"$f":"VLOOKUP($B27,$J$10:$N$28,5)","v":{"$error":"#N/A"}},null,null,null,null,null,17,5,3,"SMP (JG)","LR"]
[null,null,{"$f":"VLOOKUP($B28,$J$10:$N$28,4)","v":{"$error":"#N/A"}},{"$f":"VLOOKUP($B28,$J$10:$N$28,5)","v":{"$error":"#N/A"}},null,null,null,null,null,18,5,4,"SMP (JG)","SMSM"]
[null,null,{"$f":"VLOOKUP($B29,$J$10:$N$28,4)","v":{"$error":"#N/A"}},{"$f":"VLOOKUP($B29,$J$10:$N$28,5)","v":{"$error":"#N/A"}},null,{"$f":"IFERROR(VLOOKUP($B29,'Cls B2'!$A$1:$G$15,4,FALSE),\"\")","v":""},{"$f":"IFERROR(VLOOKUP($B29,'Cls B2'!$A$1:$G$15,5,FALSE),\"\")","v":""}]
["2021-01-05","CADETS"]
[null,null,{"$f":"VLOOKUP($B31,$J$10:$N$28,4)","v":{"$error":"#N/A"}},{"$f":"VLOOKUP($B31,$J$10:$N$28,5)","v":{"$error":"#N/A"}}]
[null,null,{"$f":"VLOOKUP($B32,$J$10:$N$28,4)","v":{"$error":"#N/A"}},{"$f":"VLOOKUP($B32,$J$10:$N$28,5)","v":{"$error":"#N/A"}}]
[null,null,{"$f":"VLOOKUP($B33,$J$10:$N$28,4)","v":{"$error":"#N/A"}},{"$f":"VLOOKUP($B33,$J$10:$N$28,5)","v":{"$error":"#N/A"}}]
[null,null,{"$f":"VLOOKUP($B34,$J$10:$N$28,4)","v":{"$error":"#N/A"}},{"$f":"VLOOKUP($B34,$J$10:$N$28,5)","v":{"$error":"#N/A"}},null,{"$f":"IFERROR(VLOOKUP($B34,'Cls B2'!$A$1:$G$15,4,FALSE),\"\")","v":""},{"$f":"IFERROR(VLOOKUP($B34,'Cls B2'!$A$1:$G$15,5,FALSE),\"\")","v":""}]
["2022-01-26","CADETS"]
[null,5,{"$f":"VLOOKUP($B36,$J$10:$N$28,4)","v":"LR"},{"$f":"VLOOKUP($B36,$J$10:$N$28,5)","v":"SBE"},"SMSM ou Fragonard 14h ?"]
[null,9,{"$f":"VLOOKUP($B37,$J$10:$N$28,4)","v":"LR"},{"$f":"VLOOKUP($B37,$J$10:$N$28,5)","v":"SMSM"}]
[null,10,{"$f":"VLOOKUP($B38,$J$10:$N$28,4)","v":"SMSM"},{"$f":"VLOOKUP($B38,$J$10:$N$28,5)","v":"SBE"}]
[null,null,{"$f":"VLOOKUP($B39,$J$10:$N$28,4)","v":{"$error":"#N/A"}},{"$f":"VLOOKUP($B39,$J$10:$N$28,5)","v":{"$error":"#N/A"}},null,{"$f":"IFERROR(VLOOKUP($B39,'Cls B2'!$A$1:$G$15,4,FALSE),\"\")","v":""},{"$f":"IFERROR(VLOOKUP($B39,'Cls B2'!$A$1:$G$15,5,FALSE),\"\")","v":""}]

{"sheet":"Cls CG","index":10,"n_rows":21,"n_cols":20,"rows_kept":21,"cut":false,"hidden":false,"merged":[[0,0,1,6],[2,3,2,4]]}
["CADETS GARCONS"]
[null,null,null,null,null,null,null,null,null,"SIGLE","Etablissement","Matchs joués","Victoires","Nuls ","Défaites","Points Pour","Points Contre","Différence","Points"]
["N° Match","Equipe A","Equipe B","Scores",null,"Vainqueur","Perdant",null,{"$f":"RANK(T3,$T$3:$T$5)","v":1},{"$f":"'Calendriers CG'!K4","v":"SBE"},"Saint Benoist de l'Europe",{"$f":"COUNT(D5,D8,D10,D13)","v":2},{"$f":"COUNTIF($F$3:$F$21,J3)","v":2},{"$f":"L3-M3-O3","v":0},{"$f":"COUNTIF(G3:G21,J3)","v":0},{"$f":"SUM(D5,E8,D10,E13)","v":89},{"$f":"SUM(E5,D8,E10,D13)","v":39},{"$f":"P3-Q3","v":50},{"$f":"M3*3+N3*2+O3*1","v":6},{"$f":"SUM(S3*1000000+R3*10000+P3*100+L3*10)","v":6508920}]
[1,{"$f":"'Calendriers CG'!M11","v":"SBE"},{"$f":"'Calendriers CG'!N11","v":"SMP"},null,null,{"$f":"IF(D4<>\"\",IF(D4>E4,B4,IF(D4<E4,C4,\"nul\")),\"\")","v":""},{"$f":"IF(E4<>\"\",IF(E4<D4,C4,IF(E4>D4,B4,\"nul\")),\"\")","v":""},null,{"$f":"RANK(T4,$T$3:$T$5)","v":3},{"$f":"'Calendriers CG'!K6","v":"LR"},"La Rochefoucauld",{"$f":"COUNT(D5,D8,D12,D15)","v":1},{"$f":"COUNTIF($F$3:$F$21,J4)","v":0},{"$f":"L4-M4-O4","v":0},{"$f":"COUNTIF(G4:G22,J4)","v":1},{"$f":"SUM(E5,D8,D12,E15)","v":10},{"$f":"SUM(D5,E8,E12,D15)","v":53},{"$f":"P4-Q4","v":-43},{"$f":"M4*3+N4*2+O4*1","v":1},{"$f":"SUM(S4*1000000+R4*10000+P4*100+L4*10)","v":571010}]
[2,{"$f":"'Calendriers CG'!M12","v":"SBE"},{"$f":"'Calendriers CG'!N12","v":"LR"},53,10,{"$f":"IF(D5<>\"\",IF(D5>E5,B5,IF(D5<E5,C5,\"nul\")),\"\")","v":"SBE"},{"$f":"IF(E5<>\"\",IF(E5<D5,C5,IF(E5>D5,B5,\"nul\")),\"\")","v":"LR"},null,{"$f":"RANK(T5,$T$3:$T$5)","v":2},{"$f":"'Calendriers CG'!K7","v":"SMSM"},"Saint Michel Saint Mandé",{"$f":"COUNT(D13,D10,D12,D15)","v":1},0,0,1,{"$f":"SUM(D13,E10,E12,D15)","v":29},{"$f":"SUM(E13,D10,D12,E15)","v":36},-7,1,932910]
[3,{"$f":"'Calendriers CG'!M13","v":"SMP"},{"$f":"'Calendriers CG'!N13","v":"LR"},null,null,{"$f":"IF(D6<>\"\",IF(D6>E6,B6,IF(D6<E6,C6,\"nul\")),\"\")","v":""},{"$f":"IF(E6<>\"\",IF(E6<D6,C6,IF(E6>D6,B6,\"nul\")),\"\")","v":""}]
[4,{"$f":"'Calendriers CG'!M14","v":"SMP"},{"$f":"'Calendriers CG'!N14","v":"SBE"},null,null,"","",null,"Classement","SIGLE","Etablissement","Matchs joués","Victoires","Nuls ","Défaites","Points Pour","Points Contre","Différence","Points"]
[5,{"$f":"'Calendriers CG'!M15","v":"LR"},{"$f":"'Calendriers CG'!N15","v":"SBE"},null,null,"","",null,1,{"$f":"VLOOKUP($I8,$I$2:$S$5,COLUMNS($J7:J7)+1,FALSE)","v":"SBE"},{"$f":"VLOOKUP($I8,$I$2:$S$5,COLUMNS($J7:K7)+1,FALSE)","v":"Saint Benoist de l'Europe"},{"$f":"VLOOKUP($I8,$I$2:$S$5,COLUMNS($J7:L7)+1,FALSE)","v":2},{"$f":"VLOOKUP($I8,$I$2:$S$5,COLUMNS($J7:M7)+1,FALSE)","v":2},{"$f":"VLOOKUP($I8,$I$2:$S$5,COLUMNS($J7:N7)+1,FALSE)","v":0},{"$f":"VLOOKUP($I8,$I$2:$S$5,COLUMNS($J7:O7)+1,FALSE)","v":0},{"$f":"VLOOKUP($I8,$I$2:$S$5,COLUMNS($J7:P7)+1,FALSE)","v":89},{"$f":"VLOOKUP($I8,$I$2:$S$5,COLUMNS($J7:Q7)+1,FALSE)","v":39},{"$f":"VLOOKUP($I8,$I$2:$S$5,COLUMNS($J7:R7)+1,FALSE)","v":50},{"$f":"VLOOKUP($I8,$I$2:$S$5,COLUMNS($J7:S7)+1,FALSE)","v":6}]
[6,{"$f":"'Calendriers CG'!M16","v":"LR"},{"$f":"'Calendriers CG'!N16","v":"SMP"},null,null,"","",null,2,{"$f":"VLOOKUP($I9,$I$2:$S$5,COLUMNS($J8:J8)+1,FALSE)","v":"SMSM"},{"$f":"VLOOKUP($I9,$I$2:$S$5,COLUMNS($J8:K8)+1,FALSE)","v":"Saint Michel Saint Mandé"},{"$f":"VLOOKUP($I9,$I$2:$S$5,COLUMNS($J8:L8)+1,FALSE)","v":1},{"$f":"VLOOKUP($I9,$I$2:$S$5,COLUMNS($J8:M8)+1,FALSE)","v":0},{"$f":"VLOOKUP($I9,$I$2:$S$5,COLUMNS($J8:N8)+1,FALSE)","v":0},{"$f":"VLOOKUP($I9,$I$2:$S$5,COLUMNS($J8:O8)+1,FALSE)","v":1},{"$f":"VLOOKUP($I9,$I$2:$S$5,COLUMNS($J8:P8)+1,FALSE)","v":29},{"$f":"VLOOKUP($I9,$I$2:$S$5,COLUMNS($J8:Q8)+1,FALSE)","v":36},{"$f":"VLOOKUP($I9,$I$2:$S$5,COLUMNS($J8:R8)+1,FALSE)","v":-7},{"$f":"VLOOKUP($I9,$I$2:$S$5,COLUMNS($J8:S8)+1,FALSE)","v":1}]
[7,{"$f":"'Calendriers CG'!M17","v":"SBE"},{"$f":"'Calendriers CG'!N17","v":"SMSM"},36,29,"SBE","SMSM",null,3,{"$f":"VLOOKUP($I10,$I$2:$S$5,COLUMNS($J9:J9)+1,FALSE)","v":"LR"},{"$f":"VLOOKUP($I10,$I$2:$S$5,COLUMNS($J9:K9)+1,FALSE)","v":"La Rochefoucauld"},{"$f":"VLOOKUP($I10,$I$2:$S$5,COLUMNS($J9:L9)+1,FALSE)","v":1},{"$f":"VLOOKUP($I10,$I$2:$S$5,COLUMNS($J9:M9)+1,FALSE)","v":0},{"$f":"VLOOKUP($I10,$I$2:$S$5,COLUMNS($J9:N9)+1,FALSE)","v":0},{"$f":"VLOOKUP($I10,$I$2:$S$5,COLUMNS($J9:O9)+1,FALSE)","v":1},{"$f":"VLOOKUP($I10,$I$2:$S$5,COLUMNS($J9:P9)+1,FALSE)","v":10},{"$f":"VLOOKUP($I10,$I$2:$S$5,COLUMNS($J9:Q9)+1,FALSE)","v":53},{"$f":"VLOOKUP($I10,$I$2:$S$5,COLUMNS($J9:R9)+1,FALSE)","v":-43},{"$f":"VLOOKUP($I10,$I$2:$S$5,COLUMNS($J9:S9)+1,FALSE)","v":1}]
[8,{"$f":"'Calendriers CG'!M18","v":"SMP"},{"$f":"'Calendriers CG'!N18","v":"SMSM"},null,null,"",""]
[9,{"$f":"'Calendriers CG'!M19","v":"LR"},{"$f":"'Calendriers CG'!N19","v":"SMSM"},null,null,"",""]
[10,{"$f":"'Calendriers CG'!M20","v":"SMSM"},{"$f":"'Calendriers CG'!N20","v":"SBE"},null,null,"",""]
[11,{"$f":"'Calendriers CG'!M21","v":"SMSM"},{"$f":"'Calendriers CG'!N21","v":"SMP"},null,null,"",""]
[12,{"$f":"'Calendriers CG'!M22","v":"SMSM"},{"$f":"'Calendriers CG'!N22","v":"LR"},null,null,"",""]
[13,{"$f":"'Calendriers CG'!M23","v":"SBE"},{"$f":"'Calendriers CG'!N23","v":"SMP (JG)"},null,null,"",""]
[14,{"$f":"'Calendriers CG'!M24","v":"LR"},{"$f":"'Calendriers CG'!N24","v":"SMP (JG)"},null,null,"",""]
[15,{"$f":"'Calendriers CG'!M25","v":"SMSM"},{"$f":"'Calendriers CG'!N25","v":"SMP (JG)"},null,null,"",""]
[16,{"$f":"'Calendriers CG'!M26","v":"SMP (JG)"},{"$f":"'Calendriers CG'!N26","v":"SBE"},null,null,"",""]
[17,{"$f":"'Calendriers CG'!M27","v":"SMP (JG)"},{"$f":"'Calendriers CG'!N27","v":"LR"},null,null,"",""]
[18,{"$f":"'Calendriers CG'!M28","v":"SMP (JG)"},{"$f":"'Calendriers CG'!N28","v":"SMSM"},null,null,"",""]

{"sheet":"Classements","index":11,"n_rows":29,"n_cols":23,"rows_kept":29,"cut":false,"hidden":false,"merged":[[19,12,20,22],[23,0,24,10],[0,0,1,10],[0,12,1,22],[9,0,10,10],[8,12,9,22],[17,0,18,10]]}
["CLASSEMENT ELITE BENJAMINS DIVISION 1 2021-2022",null,null,null,null,null,null,null,null,null,null,null,"CLASSEMENT ELITE MINIMES DIVISION 1 2021-2022"]
[]
["Classement","SIGLE",{"$f":"'Cls B1'!K11","v":"Etablissement"},{"$f":"'Cls B1'!L11","v":"Matchs joués"},{"$f":"'Cls B1'!M11","v":"Victoires"},{"$f":"'Cls B1'!N11","v":"Nuls "},{"$f":"'Cls B1'!O11","v":"Défaites"},{"$f":"'Cls B1'!P11","v":"Points Pour"},{"$f":"'Cls B1'!Q11","v":"Points Contre"},{"$f":"'Cls B1'!R11","v":"Différence"},{"$f":"'Cls B1'!S11","v":"Points"},null,"Classement","SIGLE","Etablissement","Matchs joués","Victoires","Nuls","Défaites","Points Pour","Points Contre","Différence","Points"]
[1,{"$f":"'Cls B1'!J12","v":"FEN 1"},{"$f":"'Cls B1'!K12","v":"Fénelon Ste Marie 1"},{"$f":"'Cls B1'!L12","v":5},{"$f":"'Cls B1'!M12","v":2},{"$f":"'Cls B1'!N12","v":0},{"$f":"'Cls B1'!O12","v":3},{"$f":"'Cls B1'!P12","v":48},{"$f":"'Cls B1'!Q12","v":62},{"$f":"'Cls B1'!R12","v":-14},{"$f":"'Cls B1'!S12","v":9},null,1,{"$f":"'Cls M1'!J11","v":"MASS 1"},{"$f":"'Cls M1'!K11","v":"Massillon 1"},{"$f":"'Cls M1'!L11","v":3},{"$f":"'Cls M1'!M11","v":3},{"$f":"'Cls M1'!N11","v":0},{"$f":"'Cls M1'!O11","v":0},{"$f":"'Cls M1'!P11","v":53},{"$f":"'Cls M1'!Q11","v":25},{"$f":"'Cls M1'!R11","v":28},{"$f":"'Cls M1'!S11","v":9}]
[2,{"$f":"'Cls B1'!J13","v":"LR"},{"$f":"'Cls B1'!K13","v":"La Rochefoucauld"},{"$f":"'Cls B1'!L13","v":3},{"$f":"'Cls B1'!M13","v":2},{"$f":"'Cls B1'!N13","v":0},{"$f":"'Cls B1'!O13","v":1},{"$f":"'Cls B1'!P13","v":32},{"$f":"'Cls B1'!Q13","v":20},{"$f":"'Cls B1'!R13","v":12},{"$f":"'Cls B1'!S13","v":7},null,2,{"$f":"'Cls M1'!J12","v":"FEN 1"},{"$f":"'Cls M1'!K12","v":"Fénelon 1"},{"$f":"'Cls M1'!L12","v":3},{"$f":"'Cls M1'!M12","v":1},{"$f":"'Cls M1'!N12","v":0},{"$f":"'Cls M1'!O12","v":2},{"$f":"'Cls M1'!P12","v":31},{"$f":"'Cls M1'!Q12","v":45},{"$f":"'Cls M1'!R12","v":-14},{"$f":"'Cls M1'!S12","v":5}]
[3,{"$f":"'Cls B1'!J14","v":"MASS 1"},{"$f":"'Cls B1'!K14","v":"Massillon 1"},{"$f":"'Cls B1'!L14","v":5},{"$f":"'Cls B1'!M14","v":1},{"$f":"'Cls B1'!N14","v":0},{"$f":"'Cls B1'!O14","v":4},{"$f":"'Cls B1'!P14","v":27},{"$f":"'Cls B1'!Q14","v":55},{"$f":"'Cls B1'!R14","v":-28},{"$f":"'Cls B1'!S14","v":7},null,3,{"$f":"'Cls M1'!J13","v":"SBE 2"},{"$f":"'Cls M1'!K13","v":"Saint Benoist de l'Europe 2"},{"$f":"'Cls M1'!L13","v":2},{"$f":"'Cls M1'!M13","v":1},{"$f":"'Cls M1'!N13","v":0},{"$f":"'Cls M1'!O13","v":1},{"$f":"'Cls M1'!P13","v":19},{"$f":"'Cls M1'!Q13","v":25},{"$f":"'Cls M1'!R13","v":-6},{"$f":"'Cls M1'!S13","v":4}]
[4,{"$f":"'Cls B1'!J15","v":"LBSI"},{"$f":"'Cls B1'!K15","v":"La Bruyère Sainte Isabelle"},{"$f":"'Cls B1'!L15","v":2},{"$f":"'Cls B1'!M15","v":2},{"$f":"'Cls B1'!N15","v":0},{"$f":"'Cls B1'!O15","v":0},{"$f":"'Cls B1'!P15","v":35},{"$f":"'Cls B1'!Q15","v":8},{"$f":"'Cls B1'!R15","v":27},{"$f":"'Cls B1'!S15","v":6},null,4,{"$f":"'Cls M1'!J14","v":"SBE 1"},{"$f":"'Cls M1'!K14","v":"Saint Benoist de l'Europe 1"},{"$f":"'Cls M1'!L14","v":2},{"$f":"'Cls M1'!M14","v":0},{"$f":"'Cls M1'!N14","v":0},{"$f":"'Cls M1'!O14","v":2},{"$f":"'Cls M1'!P14","v":23},{"$f":"'Cls M1'!Q14","v":31},{"$f":"'Cls M1'!R14","v":-8},{"$f":"'Cls M1'!S14","v":2}]
[5,{"$f":"'Cls B1'!J16","v":"SJFF 1"},{"$f":"'Cls B1'!K16","v":"Saint Joseph 1"},{"$f":"'Cls B1'!L16","v":2},{"$f":"'Cls B1'!M16","v":2},{"$f":"'Cls B1'!N16","v":0},{"$f":"'Cls B1'!O16","v":0},{"$f":"'Cls B1'!P16","v":30},{"$f":"'Cls B1'!Q16","v":21},{"$f":"'Cls B1'!R16","v":9},{"$f":"'Cls B1'!S16","v":6},null,5,{"$f":"'Cls M1'!J15","v":"SJFF 1"},{"$f":"'Cls M1'!K15","v":"Saint Joseph 1"},{"$f":"'Cls M1'!L15","v":0},{"$f":"'Cls M1'!M15","v":0},{"$f":"'Cls M1'!N15","v":0},{"$f":"'Cls M1'!O15","v":0},{"$f":"'Cls M1'!P15","v":0},{"$f":"'Cls M1'!Q15","v":0},{"$f":"'Cls M1'!R15","v":0},{"$f":"'Cls M1'!S15","v":0}]
[6,{"$f":"'Cls B1'!J17","v":"SMSM"},{"$f":"'Cls B1'!K17","v":"Saint Michel Saint Mandé"},{"$f":"'Cls B1'!L17","v":3},{"$f":"'Cls B1'!M17","v":1},{"$f":"'Cls B1'!N17","v":0},{"$f":"'Cls B1'!O17","v":2},{"$f":"'Cls B1'!P17","v":16},{"$f":"'Cls B1'!Q17","v":22},{"$f":"'Cls B1'!R17","v":-6},{"$f":"'Cls B1'!S17","v":5},null,"CLASSEMENT ELITE MINIMES DIVISION 2 2021-2022"]
["CLASSEMENT ELITE BENJAMINS DIVISION 2 2021-2022"]
[null,null,null,null,null,null,null,null,null,null,null,null,"Classement","SIGLE","Etablissement","Matchs joués","Victoires","Nuls ","Défaites","Points Pour","Points Contre","Différence","Points"]
["Classement","SIGLE",{"$f":"'Cls B2'!K14","v":"Etablissement"},{"$f":"'Cls B2'!L14","v":"Matchs joués"},{"$f":"'Cls B2'!M14","v":"Victoires"},{"$f":"'Cls B2'!N14","v":"Nuls "},{"$f":"'Cls B2'!O14","v":"Défaites"},{"$f":"'Cls B2'!P14","v":"Points Pour"},{"$f":"'Cls B2'!Q14","v":"Points Contre"},{"$f":"'Cls B2'!R14","v":"Différence"},{"$f":"'Cls B2'!S14","v":"Points"},null,1,{"$f":"'Cls M2'!J14","v":"LBSI"},{"$f":"'Cls M2'!K14","v":"La Bruyère Sainte Isabelle"},{"$f":"'Cls M2'!L14","v":4},{"$f":"'Cls M2'!M14","v":4},{"$f":"'Cls M2'!N14","v":0},{"$f":"'Cls M2'!O14","v":0},{"$f":"'Cls M2'!P14","v":107},{"$f":"'Cls M2'!Q14","v":25},{"$f":"'Cls M2'!R14","v":82},{"$f":"'Cls M2'!S14","v":12}]
[1,{"$f":"'Cls B2'!J15","v":"NDF"},{"$f":"'Cls B2'!K15","v":"Notre Dame de France"},{"$f":"'Cls B2'!L15","v":4},{"$f":"'Cls B2'!M15","v":3},{"$f":"'Cls B2'!N15","v":0},{"$f":"'Cls B2'!O15","v":1},{"$f":"'Cls B2'!P15","v":80},{"$f":"'Cls B2'!Q15","v":31},{"$f":"'Cls B2'!R15","v":49},{"$f":"'Cls B2'!S15","v":10},null,2,{"$f":"'Cls M2'!J15","v":"SJG"},{"$f":"'Cls M2'!K15","v":"Saint Jean Gabriel"},{"$f":"'Cls M2'!L15","v":4},{"$f":"'Cls M2'!M15","v":3},{"$f":"'Cls M2'!N15","v":0},{"$f":"'Cls M2'!O15","v":1},{"$f":"'Cls M2'!P15","v":124},{"$f":"'Cls M2'!Q15","v":38},{"$f":"'Cls M2'!R15","v":86},{"$f":"'Cls M2'!S15","v":10}]
[2,{"$f":"'Cls B2'!J16","v":"SJG"},{"$f":"'Cls B2'!K16","v":"Saint Jean Gabriel"},{"$f":"'Cls B2'!L16","v":3},{"$f":"'Cls B2'!M16","v":3},{"$f":"'Cls B2'!N16","v":0},{"$f":"'Cls B2'!O16","v":0},{"$f":"'Cls B2'!P16","v":143},{"$f":"'Cls B2'!Q16","v":15},{"$f":"'Cls B2'!R16","v":128},{"$f":"'Cls B2'!S16","v":9},null,3,{"$f":"'Cls M2'!J16","v":"LR"},{"$f":"'Cls M2'!K16","v":"La Rochefoucauld"},{"$f":"'Cls M2'!L16","v":3},{"$f":"'Cls M2'!M16","v":3},{"$f":"'Cls M2'!N16","v":0},{"$f":"'Cls M2'!O16","v":0},{"$f":"'Cls M2'!P16","v":42},{"$f":"'Cls M2'!Q16","v":16},{"$f":"'Cls M2'!R16","v":26},{"$f":"'Cls M2'!S16","v":9}]
[3,{"$f":"'Cls B2'!J17","v":"MASS 2"},{"$f":"'Cls B2'!K17","v":"Massillon 2"},{"$f":"'Cls B2'!L17","v":4},{"$f":"'Cls B2'!M17","v":2},{"$f":"'Cls B2'!N17","v":0},{"$f":"'Cls B2'!O17","v":2},{"$f":"'Cls B2'!P17","v":19},{"$f":"'Cls B2'!Q17","v":63},{"$f":"'Cls B2'!R17","v":-44},{"$f":"'Cls B2'!S17","v":8},null,4,{"$f":"'Cls M2'!J17","v":"MASS 2"},{"$f":"'Cls M2'!K17","v":"Massillon 2"},{"$f":"'Cls M2'!L17","v":3},{"$f":"'Cls M2'!M17","v":2},{"$f":"'Cls M2'!N17","v":0},{"$f":"'Cls M2'!O17","v":1},{"$f":"'Cls M2'!P17","v":46},{"$f":"'Cls M2'!Q17","v":22},{"$f":"'Cls M2'!R17","v":24},{"$f":"'Cls M2'!S17","v":7}]
[4,{"$f":"'Cls B2'!J18","v":"FEN 2"},{"$f":"'Cls B2'!K18","v":"Fénelon 2"},{"$f":"'Cls B2'!L18","v":4},{"$f":"'Cls B2'!M18","v":1},{"$f":"'Cls B2'!N18","v":0},{"$f":"'Cls B2'!O18","v":3},{"$f":"'Cls B2'!P18","v":6},{"$f":"'Cls B2'!Q18","v":115},{"$f":"'Cls B2'!R18","v":-109},{"$f":"'Cls B2'!S18","v":6},null,5,{"$f":"'Cls M2'!J18","v":"SJFF 2"},{"$f":"'Cls M2'!K18","v":"Saint Joseph 2"},{"$f":"'Cls M2'!L18","v":5},{"$f":"'Cls M2'!M18","v":1},{"$f":"'Cls M2'!N18","v":0},{"$f":"'Cls M2'!O18","v":4},{"$f":"'Cls M2'!P18","v":20},{"$f":"'Cls M2'!Q18","v":79},{"$f":"'Cls M2'!R18","v":-59},{"$f":"'Cls M2'!S18","v":7}]
[5,{"$f":"'Cls B2'!J19","v":"SJFF 2"},{"$f":"'Cls B2'!K19","v":"Saint Joseph 2"},{"$f":"'Cls B2'!L19","v":3},{"$f":"'Cls B2'!M19","v":0},{"$f":"'Cls B2'!N19","v":0},{"$f":"'Cls B2'!O19","v":3},{"$f":"'Cls B2'!P19","v":4},{"$f":"'Cls B2'!Q19","v":28},{"$f":"'Cls B2'!R19","v":-24},{"$f":"'Cls B2'!S19","v":3},null,6,{"$f":"'Cls M2'!J19","v":"FEN 2"},{"$f":"'Cls M2'!K19","v":"Fénelon Sainte Marie 2"},{"$f":"'Cls M2'!L19","v":6},{"$f":"'Cls M2'!M19","v":0},{"$f":"'Cls M2'!N19","v":1},{"$f":"'Cls M2'!O19","v":5},{"$f":"'Cls M2'!P19","v":27},{"$f":"'Cls M2'!Q19","v":115},{"$f":"'Cls M2'!R19","v":-88},{"$f":"'Cls M2'!S19","v":7}]
["CLASSEMENT PROMO ELITE MIXTE 2021-2022",null,null,null,null,null,null,null,null,null,null,null,7,{"$f":"'Cls M2'!J20","v":"MASS 3"},{"$f":"'Cls M2'!K20","v":"Massillon 3"},{"$f":"'Cls M2'!L20","v":3},{"$f":"'Cls M2'!M20","v":1},{"$f":"'Cls M2'!N20","v":0},{"$f":"'Cls M2'!O20","v":2},{"$f":"'Cls M2'!P20","v":84},{"$f":"'Cls M2'!Q20","v":16},{"$f":"'Cls M2'!R20","v":68},{"$f":"'Cls M2'!S20","v":5}]
[null,null,null,null,null,null,null,null,null,null,null,null,8,{"$f":"'Cls M2'!J21","v":"SMSM"},{"$f":"'Cls M2'!K21","v":"Saint Michel Saint Mandé"},{"$f":"'Cls M2'!L21","v":2},{"$f":"'Cls M2'!M21","v":1},{"$f":"'Cls M2'!N21","v":0},{"$f":"'Cls M2'!O21","v":1},{"$f":"'Cls M2'!P21","v":9},{"$f":"'Cls M2'!Q21","v":12},{"$f":"'Cls M2'!R21","v":-3},{"$f":"'Cls M2'!S21","v":4}]
["Classement","SIGLE",{"$f":"'Cls BMixte'!K8","v":"Etablissement"},{"$f":"'Cls BMixte'!L8","v":"Matchs joués"},{"$f":"'Cls BMixte'!M8","v":"Victoires"},{"$f":"'Cls BMixte'!N8","v":"Nuls "},{"$f":"'Cls BMixte'!O8","v":"Défaites"},{"$f":"'Cls BMixte'!P8","v":"Points Pour"},{"$f":"'Cls BMixte'!Q8","v":"Points Contre"},{"$f":"'Cls BMixte'!R8","v":"Différence"},{"$f":"'Cls BMixte'!S8","v":"Points"},null,"CLASSEMENT ELITE MINIMES DIVISION 2 2021-2022"]
[1,{"$f":"'Cls BMixte'!J9","v":"LR 2 (F)"},{"$f":"'Cls BMixte'!K9","v":"La Rochefoucauld 2"},{"$f":"'Cls BMixte'!L9","v":1},{"$f":"'Cls BMixte'!M9","v":1},{"$f":"'Cls BMixte'!N9","v":0},{"$f":"'Cls BMixte'!O9","v":0},{"$f":"'Cls BMixte'!P9","v":16},{"$f":"'Cls BMixte'!Q9","v":4},{"$f":"'Cls BMixte'!R9","v":12},{"$f":"'Cls BMixte'!S9","v":3}]
[2,{"$f":"'Cls BMixte'!J10","v":"SJFF 3 (F)"},{"$f":"'Cls BMixte'!K10","v":"Saint Joseph 3"},{"$f":"'Cls BMixte'!L10","v":1},{"$f":"'Cls BMixte'!M10","v":1},{"$f":"'Cls BMixte'!N10","v":0},{"$f":"'Cls BMixte'!O10","v":0},{"$f":"'Cls BMixte'!P10","v":14},{"$f":"'Cls BMixte'!Q10","v":4},{"$f":"'Cls BMixte'!R10","v":10},{"$f":"'Cls BMixte'!S10","v":3},null,"Classement","SIGLE","Etablissement","Matchs joués","Victoires","Nuls ","Défaites","Points Pour","Points Contre","Différence","Points"]
[3,{"$f":"'Cls BMixte'!J11","v":"MASS 3"},{"$f":"'Cls BMixte'!K11","v":"Massillon 3"},{"$f":"'Cls BMixte'!L11","v":2},{"$f":"'Cls BMixte'!M11","v":0},{"$f":"'Cls BMixte'!N11","v":0},{"$f":"'Cls BMixte'!O11","v":2},{"$f":"'Cls BMixte'!P11","v":8},{"$f":"'Cls BMixte'!Q11","v":30},{"$f":"'Cls BMixte'!R11","v":-22},{"$f":"'Cls BMixte'!S11","v":2},null,1,{"$f":"'Cls Mixte'!J10","v":"SJFF"},{"$f":"'Cls Mixte'!K10","v":"Saint Joseph 2"},{"$f":"'Cls Mixte'!L10","v":1},{"$f":"'Cls Mixte'!M10","v":1},{"$f":"'Cls Mixte'!N10","v":0},{"$f":"'Cls Mixte'!O10","v":0},{"$f":"'Cls Mixte'!P10","v":12},{"$f":"'Cls Mixte'!Q10","v":4},{"$f":"'Cls Mixte'!R10","v":8},{"$f":"'Cls Mixte'!S10","v":3}]
["CLASSEMENT ELITE CADETS 2021-2022",null,null,null,null,null,null,null,null,null,null,null,2,{"$f":"'Cls Mixte'!J11","v":"SJG"},{"$f":"'Cls Mixte'!K11","v":"Saint Jean Gabriel"},{"$f":"'Cls Mixte'!L11","v":1},{"$f":"'Cls Mixte'!M11","v":0},{"$f":"'Cls Mixte'!N11","v":0},{"$f":"'Cls Mixte'!O11","v":1},{"$f":"'Cls Mixte'!P11","v":4},{"$f":"'Cls Mixte'!Q11","v":12},{"$f":"'Cls Mixte'!R11","v":-8},{"$f":"'Cls Mixte'!S11","v":1}]
[null,null,null,null,null,null,null,null,null,null,null,null,3,{"$f":"'Cls Mixte'!J12","v":"SBE"},{"$f":"'Cls Mixte'!K12","v":"Saint Benoist de l'Europe "},{"$f":"'Cls Mixte'!L12","v":0},{"$f":"'Cls Mixte'!M12","v":0},{"$f":"'Cls Mixte'!N12","v":0},{"$f":"'Cls Mixte'!O12","v":0},{"$f":"'Cls Mixte'!P12","v":0},{"$f":"'Cls Mixte'!Q12","v":0},{"$f":"'Cls Mixte'!R12","v":0},{"$f":"'Cls Mixte'!S12","v":0}]
["Classement","SIGLE","Etablissement","Matchs joués","Victoires","Nuls ","Défaites","Points Pour","Points Contre","Différence","Points"]
[1,{"$f":"'Cls CG'!J8","v":"SBE"},{"$f":"'Cls CG'!K8","v":"Saint Benoist de l'Europe"},{"$f":"'Cls CG'!L8","v":2},{"$f":"'Cls CG'!M8","v":2},{"$f":"'Cls CG'!N8","v":0},{"$f":"'Cls CG'!O8","v":0},{"$f":"'Cls CG'!P8","v":89},{"$f":"'Cls CG'!Q8","v":39},{"$f":"'Cls CG'!R8","v":50},{"$f":"'Cls CG'!S8","v":6}]
[2,{"$f":"'Cls CG'!J9","v":"SMSM"},{"$f":"'Cls CG'!K9","v":"Saint Michel Saint Mandé"},{"$f":"'Cls CG'!L9","v":1},{"$f":"'Cls CG'!M9","v":0},{"$f":"'Cls CG'!N9","v":0},{"$f":"'Cls CG'!O9","v":1},{"$f":"'Cls CG'!P9","v":29},{"$f":"'Cls CG'!Q9","v":36},{"$f":"'Cls CG'!R9","v":-7},{"$f":"'Cls CG'!S9","v":1}]
[3,{"$f":"'Cls CG'!J10","v":"LR"},{"$f":"'Cls CG'!K10","v":"La Rochefoucauld"},{"$f":"'Cls CG'!L10","v":1},{"$f":"'Cls CG'!M10","v":0},{"$f":"'Cls CG'!N10","v":0},{"$f":"'Cls CG'!O10","v":1},{"$f":"'Cls CG'!P10","v":10},{"$f":"'Cls CG'!Q10","v":53},{"$f":"'Cls CG'!R10","v":-43},{"$f":"'Cls CG'!S10","v":1}]

{"sheet":"Indispos profs","index":12,"n_rows":35,"n_cols":15,"rows_kept":35,"cut":false,"hidden":false,"merged":[[0,0,0,15],[1,1,1,5],[1,6,1,10],[1,11,1,15]]}
["DATES D'INDISPONIBILITES DES ETABLISSEMENTS"]
["SIGLES","Benjamins",null,null,null,null,"Minimes",null,null,null,null,"Lycée"]
["ASVP"]
["FEN",null,null,null,null,null,"2021-01-12"]
["SMSM"]
["MASS","2021-01-12","2022-03-30",null,null,null,"2021-01-12","2022-03-30",null,null,null,"2022-03-30"]
["SJFF"]
["SLM"]
["NDF"]
["SGC"]
["SBE",null,null,null,null,null,"15 dec","2021-01-12",null,null,null,"15 dec","2021-01-05","2021-01-12"]
["SMP","9 fev","2021-04-20","2021-05-11","2021-05-25",null,"9 fev","16 fev","2021-03-23","2021-05-11","2021-05-25","15 dec","2021-03-09","2021-05-11","2021-05-25"]
["LR",null,null,null,null,null,null,null,null,null,null,"8 dec"]
["LBSI","15 dec",null,null,null,null,"15 dec"]
[]
[]
[]
[]
[]
[]
[]
[]
[]
[]
[]
[]
[]
[]
[]
["Disponibilités Gymnase SMP",null,null,null,null,null,"15 dec","2021-01-05"]
["Occupation LR BAD",null,null,"1 dec","15 dec","2021-01-19","2021-01-26","9 fev"]
["Camou",null,null,"15 dec"]
["Fédération",null,null,"2021-01-12"]
["Alain Mimoun",null,null,"2021-01-26"]
["Carpentier",null,null,"9 fev"]

{"sheet":"Listing profs","index":13,"n_rows":17,"n_cols":5,"rows_kept":17,"cut":false,"hidden":false,"merged":[[13,0,15,0],[13,1,15,1],[6,0,8,0],[6,1,8,1],[0,0,0,4],[2,0,3,0],[2,1,3,1]]}
["LISTING PROFESSEURS BASKET-BALL 2021-2022"]
["NOM D'ETABLISSEMENT","SIGLE","NOM et PRENOM","N° MOBILE","MAIL "]
["FENELON SAINTE-MARIE","75-FENP","LEROY Jeanne","06 34 17 84 05","jleroy@groupefenelon.org"]
[null,null,"HEBERT Thomas","07 87 35 57 63","thebert@groupefenelon.org"]
["LA BRUYERE ST ISABELLE","75-CLBIP","HETAULT Valentin","06 31 28 48 28 ","vhetault@lbsi14.fr"]
["LA ROCHEFOUCAULD","75-LRPA","HENRY Romuald","06 82 87 26 85","rhenry@laroche.org"]
["MASSILLON","75-MASSP","OGOREK Nicolas","06 51 97 18 47","ogorek.eps@gmail.com"]
[null,null,"CHARLES Amandine","06 89 13 38 86","amandinecharles10@gmail.com"]
[null,null,"CAVALADE Clément","06 49 23 52 35","c.cavalade@outlook.fr"]
["NOTRE DAME DE France","75-NDFP","MARCELINE Laurent","06 88 81 13 19","laurentand1@hotmail.com "]
["ST BENOIST DE L'EUROPE","93-SBEB","ONDEE Derick ","06 12 58 81 36","ondee.prof@sfr.fr"]
["ST JOSEPH","75-CSJP","SECRETANT Eric","06 11 03 14 27","tractoeric@gmail.com"]
["ST JEAN GABRIEL","75-CSJGP","BARRACHIN Philippe","06 72 15 66 29","barrachinp@gmail.com"]
["ST MICHEL DE PICPUS","75-SMPP","ISKER Lamine","06 33 59 32 65","lams115@hotmail.com"]
[null,null,"TAVARES Raphaël","06 14 58 01 84","rtavares@ffbb.com"]
[null,null,"CAMILUS Jude","06 31 83 64 75","judepommes@hotmail.com"]
["ST MICHEL SAINT MANDE","94-SMSM","DIALLO Zacharie","06 85 97 50 39","zachdiallo@yahoo.fr"]

{"sheet":"Installations","index":14,"n_rows":15,"n_cols":6,"rows_kept":15,"cut":false,"hidden":false,"merged":[[0,0,0,4],[8,2,9,2]]}
["INSTALLATIONS BASKET-BALL 2021-2022"]
["NOM DU TERRAIN","COORDONNEES","MOYENS D'ACCES","HORAIRES","TERRAINS"]
[]
["GYMNASE FRAGONARD","10 rue Fragonard 75017 Paris","Métro 13 Porte de Clichy","13h30-17h","1 terrain couvert"]
["GYMNASE JAPY","2 rue Japy 75011 Paris","Métro 9 Voltaire","13h30-17h30","1 terrain couvert"]
["GYMNASE CAMOU","35 Avenue de la Bourdonnais 75007 Paris","Métro 8 Ecole Militaire / RER C Pont de l'Alma / Métro 6 Bir Hakeim","13h30 à 16h30","1 terrain couvert"]
["St BENOIST DE L'EUROPE Gymnase Cifarielo FANARA","72 rue Jeanne Hornet ","Métro Gallieni Ligne 3 puis Bus 318 direction Romainville Chantaloups, arrêt Cimetière de Bagnolet, Métro Porte des Lilas ligne 11 puis Bus 115 direction Chateau de Vincennes, arret Rue de Pantin/Rue Girardot","13h30 à 16h30","1 terrain couvert","En travaux"]
["GYMNASE LA ROCHEFOUCAULD","22 rue Malar 75 007 Paris","Métro tour maubourg ou RER C pont de l'Alma","13h30 à 16h30","1 terrain couvert"]
["COLLEGE SAINT JOSEPH  ","13 place Etiennes Pernet 75015 Paris    ","Métro felix faure","13h30 au collège SJFF","1 terrain découvert"]
["CROIX DE NIVERT TEP","107 rue de la Croix de Nivert 75015 Paris",null,"14h","2 terrains découvert pour les BGF"]
["ST MICHEL DE PICPUS","53 rue de la Gare de Reuilly 75012 Paris","Métro Daumesnil ou Bel Air","14h à 16h30","1 terrain couvert"]
["SAINT JEAN GABRIEL","Square St Paul rue des jardins St Paul 75004 Paris","Métro St Paul","13h30 à 15h30","1 terrain extérieur"]
["LA BRUYERE STE ISABELLE","66 rue l'abbé carton 75014 Paris","Métro Plaisance ou Alésia","13h30 à 16h30","1 terrain couvert"]
["SAINT MICHEL SAINT MANDE","10Ter Rue Jeanne d'Arc, 94160 Saint-Mandé","Métro Saint Mandé","14h à 16h30","1 terrain couvert"]
["NOTRE DAME DE France","63 Rue de la Santé, 75013 Paris","Métro Glacière ou Saint Jacques","13h30 à 16h30","1 terrain extérieur"]

{"sheet":"Répart Japy-Frag","index":15,"n_rows":36,"n_cols":3,"rows_kept":36,"cut":false,"hidden":false,"merged":[[4,0,4,2],[11,0,11,2],[19,0,19,2],[0,0,0,2],[27,0,27,2]]}
["REPARTITION FRAGONARD/JAPY "]
["    UNSS/UGSEL                                       Année Scolaire 2021-2022"]
[]
["DATES","JAPY","FRAGONARD"]
["Du Samedi 23 Octobre au Lundi 8 Novembre matin – vacances de Toussaint"]
["2021-11-10","UNSS","UGSEL"]
["2021-11-17","UGSEL","UNSS"]
["2021-11-24","UNSS","UGSEL"]
["01 DECEMBRE 2021","UGSEL","UNSS"]
["08 DECEMBRE 2021","UNSS","UGSEL"]
["15 DECEMBRE 2021","UGSEL","UNSS"]
["Du Samedi 18 Décembre au Lundi 3 Janvier matin – vacances de Noël"]
["2022-01-05","UGSEL","UNSS"]
["2022-01-12","UNSS","UGSEL"]
["2022-01-19","UGSEL","UNSS"]
["2022-01-26","UNSS","UGSEL"]
["02 FEVRIER 2022","UGSEL","UNSS"]
["09 FEVRIER 2022","UNSS","UGSEL"]
["16 FEVRIER 2022","UGSEL","UNSS"]
["Du Samedi 19 Février au Lundi 07 Mars matin – Vacances d’Hiver"]
["2022-03-09","UNSS","UGSEL"]
["2022-03-16","UGSEL","UNSS"]
["2022-03-23","UNSS","UGSEL"]
["2022-03-30","UGSEL","UNSS"]
["2022-04-06","UNSS","UGSEL"]
["2022-04-13","UGSEL","UNSS"]
["2022-04-20","UNSS","UGSEL"]
["Du Samedi 23 Avril au Lundi 09 Mai matin – Vacances de printemps"]
["2022-05-11","UGSEL","UNSS"]
["2022-05-18","UNSS","UGSEL"]
["2022-05-25","UGSEL","UNSS"]
["2022-06-01","UNSS","UGSEL"]
["2022-06-08","UGSEL","UNSS"]
["2022-06-15","UNSS","UGSEL"]
["2022-06-22","UGSEL","UNSS"]
["2022-06-29","UNSS","UGSEL"]