{"text_format":"1","workbook":"xlsx","n_sheets":7,"sheets":["Engagés","Poule 1","Poule 2","Poule 3","Poule 4","Résultats de poule","Tableau"],"not_rendered":{"charts":0,"images":37,"macros":1,"external_links":0,"defined_names":2,"comments":0,"pivot_tables":0},"unopened":[],"bounds":{"document_bytes":16777216,"sheet_cells":100000,"rows_first":2000,"rows_last":500,"rows_between":2000,"halvings":0,"cell_chars":16384,"cell_head_chars":4096},"cells_cut":0,"cells_raw":0,"read":"whole","date_system":"1900"}

{"sheet":"Engagés","index":0,"n_rows":21,"n_cols":15,"rows_kept":21,"cut":false,"hidden":false,"merged":[[5,11,5,14],[12,7,12,10],[12,11,12,14],[0,0,2,2],[0,4,0,5],[1,4,1,5],[2,4,2,5],[5,7,5,10]]}
["Rencontre Mixte Equipe TT",null,null,"DATE :","2021-11-17"]
[null,null,null,"LIEU :","Stanislas"]
[null,null,null,"CATEGORIE :","Mixte"]
["Tête de série","ETABLISSEMENT","NOM","PRENOM","SIGLE"]
[]
[1,"STANISLAS","STAN 1","STAN 1","STAN 1",null,null,"Poule 1",null,null,null,"Poule 2"]
[2,"STANISLAS","STAN 2","STAN 2","STAN 2",null,null,1,{"$f":"VLOOKUP($H7,$A$1:$F$21,3,FALSE)","v":"STAN 1"},{"$f":"VLOOKUP($H7,$A$1:$F$21,4,FALSE)","v":"STAN 1"},{"$f":"VLOOKUP($H7,$A$1:$F$21,5,FALSE)","v":"STAN 1"},2,{"$f":"VLOOKUP($L7,$A$1:$F$21,3,FALSE)","v":"STAN 2"},{"$f":"VLOOKUP($L7,$A$1:$F$21,4,FALSE)","v":"STAN 2"},{"$f":"VLOOKUP($L7,$A$1:$F$21,5,FALSE)","v":"STAN 2"}]
[3,"ALMA","ALMA 1","ALMA 1","ALMA 1",null,null,8,{"$f":"VLOOKUP($H8,$A$1:$F$21,3,FALSE)","v":"SPF 1"},{"$f":"VLOOKUP($H8,$A$1:$F$21,4,FALSE)","v":"SPF 1"},{"$f":"VLOOKUP($H8,$A$1:$F$21,5,FALSE)","v":"SPF 1"},7,{"$f":"VLOOKUP($L8,$A$1:$F$21,3,FALSE)","v":"STAN 4"},{"$f":"VLOOKUP($L8,$A$1:$F$21,4,FALSE)","v":"STAN 4"},{"$f":"VLOOKUP($L8,$A$1:$F$21,5,FALSE)","v":"STAN 4"}]
[4,"STANISLAS","STAN 3","STAN 3","STAN 3",null,null,9,"STAN 5","STAN 5","STAN 5",10,"ALMA 4","ALMA 4","ALMA 4"]
[5,"ALMA","ALMA 2","ALMA 2","ALMA 2",null,null,16,"ALMA 6","ALMA 6","ALMA 6",15,"SPF 2","SPF 2","SPF 2"]
[6,"ALMA","ALMA 3","ALMA 3","ALMA 3"]
[7,"STANISLAS","STAN 4","STAN 4","STAN 4"]
[8,"SAINT PIERRE FOURIER","SPF 1","SPF 1","SPF 1",null,null,"Poule 3",null,null,null,"Poule 4"]
[9,"STANISLAS","STAN 5","STAN 5","STAN 5",null,null,3,{"$f":"VLOOKUP($H14,$A$1:$F$21,3,FALSE)","v":"ALMA 1"},{"$f":"VLOOKUP($H14,$A$1:$F$21,4,FALSE)","v":"ALMA 1"},{"$f":"VLOOKUP($H14,$A$1:$F$21,5,FALSE)","v":"ALMA 1"},4,{"$f":"VLOOKUP($L14,$A$1:$F$21,3,FALSE)","v":"STAN 3"},{"$f":"VLOOKUP($L14,$A$1:$F$21,4,FALSE)","v":"STAN 3"},{"$f":"VLOOKUP($L14,$A$1:$F$21,5,FALSE)","v":"STAN 3"}]
[10,"ALMA","ALMA 4","ALMA 4","ALMA 4",null,null,6,{"$f":"VLOOKUP($H15,$A$1:$F$21,3,FALSE)","v":"ALMA 3"},{"$f":"VLOOKUP($H15,$A$1:$F$21,4,FALSE)","v":"ALMA 3"},{"$f":"VLOOKUP($H15,$A$1:$F$21,5,FALSE)","v":"ALMA 3"},5,{"$f":"VLOOKUP($L15,$A$1:$F$21,3,FALSE)","v":"ALMA 2"},{"$f":"VLOOKUP($L15,$A$1:$F$21,4,FALSE)","v":"ALMA 2"},{"$f":"VLOOKUP($L15,$A$1:$F$21,5,FALSE)","v":"ALMA 2"}]
[11,"STANISLAS","STAN 6","STAN 6","STAN 6",null,null,11,"STAN 6","STAN 6","STAN 6",12,"STAN 7","STAN 7","STAN 7"]
[12,"STANISLAS","STAN 7","STAN 7","STAN 7",null,null,14,"STAN 8","STAN 8","STAN 8",13,"ALMA 5","ALMA 5","ALMA 5"]
[13,"ALMA","ALMA 5","ALMA 5","ALMA 5"]
[15,"SAINT PIERRE FOURIER","SPF 2","SPF 2","SPF 2"]
[14,"STANISLAS","STAN 8","STAN 8","STAN 8"]
[16,"ALMA","ALMA 6","ALMA 6","ALMA 6"]

{"sheet":"Poule 1","index":1,"n_rows":24,"n_cols":7,"rows_kept":24,"cut":false,"hidden":false,"merged":[[0,0,0,6],[1,0,1,2],[1,3,1,6],[7,0,7,6],[8,0,8,2],[8,3,8,4],[9,0,9,2],[10,0,10,2],[11,0,11,2],[12,0,12,2],[13,0,13,6],[14,0,14,2],[14,3,14,4],[21,4,21,5],[22,0,22,1],[15,0,15,2],[16,0,16,2],[17,0,17,2],[18,0,18,3],[18,4,18,6],[19,0,19,1],[19,2,19,3],[19,4,19,5],[22,2,22,3],[22,4,22,5],[20,0,20,1],[20,2,20,3],[20,4,20,5],[23,0,23,1],[23,2,23,3],[23,4,23,5],[21,0,21,1],[21,2,21,3]]}
["               BADMINTON "]
["POULE 1",null,null,"TERRAIN N°"]
[null,"NOM","Prénom","Sigle","Vict","Def","Classement"]
[1,{"$f":"VLOOKUP($A4,Engagés!$A$1:$F$360,3,FALSE)","v":"STAN 1"},{"$f":"VLOOKUP($A4,Engagés!$A$1:$F$360,4,FALSE)","v":"STAN 1"},{"$f":"VLOOKUP($A4,Engagés!$A$1:$F$360,5,FALSE)","v":"STAN 1"},null,null,"1er"]
[8,{"$f":"VLOOKUP($A5,Engagés!$A$1:$F$360,3,FALSE)","v":"SPF 1"},{"$f":"VLOOKUP($A5,Engagés!$A$1:$F$360,4,FALSE)","v":"SPF 1"},{"$f":"VLOOKUP($A5,Engagés!$A$1:$F$360,5,FALSE)","v":"SPF 1"},null,null,"2ème"]
[9,{"$f":"VLOOKUP($A6,Engagés!$A$1:$F$360,3,FALSE)","v":"STAN 5"},{"$f":"VLOOKUP($A6,Engagés!$A$1:$F$360,4,FALSE)","v":"STAN 5"},{"$f":"VLOOKUP($A6,Engagés!$A$1:$F$360,5,FALSE)","v":"STAN 5"},null,null,"3ème"]
[16,{"$f":"VLOOKUP($A7,Engagés!$A$1:$F$360,3,FALSE)","v":"ALMA 6"},{"$f":"VLOOKUP($A7,Engagés!$A$1:$F$360,4,FALSE)","v":"ALMA 6"},{"$f":"VLOOKUP($A7,Engagés!$A$1:$F$360,5,FALSE)","v":"ALMA 6"},null,null,"4ème"]
["Si poule de 4 joueurs alors…"]
["Déroulement",null,null,"Joueurs A contre Joueur B",null,"Vainqueur","Score"]
["Match 1",null,null,{"$f":"B4","v":"STAN 1"},{"$f":"B7","v":"ALMA 6"},"STAN 1"]
["Match 2",null,null,{"$f":"B5","v":"SPF 1"},{"$f":"B6","v":"STAN 5"},"SPF 1"]
["Finale vainqueur Match 1 contre vainqueur Match 2",null,null,{"$f":"IF(F10=\"\",\"\",F10)","v":"STAN 1"},{"$f":"IF(F11=\"\",\"\",F11)","v":"SPF 1"},"STAN 1"]
["Petite finale entre les deux perdants des matchs 1 et 2",null,null,{"$f":"IF(D12=\"\",\"\",IF(D12=D10,E10,D10))","v":"ALMA 6"},{"$f":"IF(E12=\"\",\"\",IF(E12=D11,E11,D11))","v":"STAN 5"},"STAN 5"]
["Si poule de 3 joueurs alors…"]
["Déroulement",null,null,"Joueurs A contre Joueur B",null,"Vainqueur","Score"]
["Match 1",null,null,{"$f":"B4","v":"STAN 1"},{"$f":"B6","v":"STAN 5"}]
["Match 2",null,null,{"$f":"B5","v":"SPF 1"},{"$f":"B6","v":"STAN 5"}]
["Match 3",null,null,{"$f":"B4","v":"STAN 1"},{"$f":"B5","v":"SPF 1"}]
["CLASSEMENT",null,null,null,{"$f":"A2","v":"POULE 1"}]
[null,null,"NOM",null,"PRENOM",null,"SIGLE"]
["1er",null,{"$f":"IF($G$4=\"1er\", $B$4,IF($G$5=\"1er\",$B$5,IF($G$6=\"1er\",$B$6,IF($G$7=\"1er\",$B$7,\"\"))))","v":"STAN 1"},null,{"$f":"IF($G$4=\"1er\", $C$4,IF($G$5=\"1er\",$C$5,IF($G$6=\"1er\",$C$6,IF($G$7=\"1er\",$C$7,\"\"))))","v":"STAN 1"},null,{"$f":"IF($G$4=\"1er\", $D$4,IF($G$5=\"1er\",$D$5,IF($G$6=\"1er\",$D$6,IF($G$7=\"1er\",$D$7,\"\"))))","v":"STAN 1"}]
["2ème",null,{"$f":"IF($G$4=\"2ème\", $B$4,IF($G$5=\"2ème\",$B$5,IF($G$6=\"2ème\",$B$6,IF($G$7=\"2ème\",$B$7,\"\"))))","v":"SPF 1"},null,{"$f":"IF($G$4=\"2ème\", $C$4,IF($G$5=\"2ème\",$C$5,IF($G$6=\"2ème\",$C$6,IF($G$7=\"2ème\",$C$7,\"\"))))","v":"SPF 1"},null,{"$f":"IF($G$4=\"2ème\", $D$4,IF($G$5=\"2ème\",$D$5,IF($G$6=\"2ème\",$D$6,IF($G$7=\"2ème\",$D$7,\"\"))))","v":"SPF 1"}]
["3ème",null,{"$f":"IF($G$4=\"3ème\", $B$4,IF($G$5=\"3ème\",$B$5,IF($G$6=\"3ème\",$B$6,IF($G$7=\"3ème\",$B$7,\"\"))))","v":"STAN 5"},null,{"$f":"IF($G$4=\"3ème\", $C$4,IF($G$5=\"3ème\",$C$5,IF($G$6=\"3ème\",$C$6,IF($G$7=\"3ème\",$C$7,\"\"))))","v":"STAN 5"},null,{"$f":"IF($G$4=\"3ème\", $D$4,IF($G$5=\"3ème\",$D$5,IF($G$6=\"3ème\",$D$6,IF($G$7=\"3ème\",$D$7,\"\"))))","v":"STAN 5"}]
["4ème",null,{"$f":"IF($G$4=\"4ème\", $B$4,IF($G$5=\"4ème\",$B$5,IF($G$6=\"4ème\",$B$6,IF($G$7=\"4ème\",$B$7,\"\"))))","v":"ALMA 6"},null,{"$f":"IF($G$4=\"4ème\", $C$4,IF($G$5=\"4ème\",$C$5,IF($G$6=\"4ème\",$C$6,IF($G$7=\"4ème\",$C$7,\"\"))))","v":"ALMA 6"},null,{"$f":"IF($G$4=\"4ème\", $D$4,IF($G$5=\"4ème\",$D$5,IF($G$6=\"4ème\",$D$6,IF($G$7=\"4ème\",$D$7,\"\"))))","v":"ALMA 6"}]

{"sheet":"Poule 2","index":2,"n_rows":24,"n_cols":7,"rows_kept":24,"cut":false,"hidden":false,"merged":[[0,0,0,6],[1,0,1,2],[1,3,1,6],[7,0,7,6],[8,0,8,2],[8,3,8,4],[9,0,9,2],[10,0,10,2],[11,0,11,2],[12,0,12,2],[13,0,13,6],[14,0,14,2],[14,3,14,4],[21,4,21,5],[22,0,22,1],[15,0,15,2],[16,0,16,2],[17,0,17,2],[18,0,18,3],[18,4,18,6],[19,0,19,1],[19,2,19,3],[19,4,19,5],[22,2,22,3],[22,4,22,5],[20,0,20,1],[20,2,20,3],[20,4,20,5],[23,0,23,1],[23,2,23,3],[23,4,23,5],[21,0,21,1],[21,2,21,3]]}
["               BADMINTON "]
["POULE 2",null,null,"TERRAIN N°"]
[null,"NOM","Prénom","Sigle","Vict","Def","Classement"]
[2,{"$f":"VLOOKUP($A4,Engagés!$A$1:$F$360,3,FALSE)","v":"STAN 2"},{"$f":"VLOOKUP($A4,Engagés!$A$1:$F$360,4,FALSE)","v":"STAN 2"},{"$f":"VLOOKUP($A4,Engagés!$A$1:$F$360,5,FALSE)","v":"STAN 2"},null,null,"2ème"]
[7,{"$f":"VLOOKUP($A5,Engagés!$A$1:$F$360,3,FALSE)","v":"STAN 4"},{"$f":"VLOOKUP($A5,Engagés!$A$1:$F$360,4,FALSE)","v":"STAN 4"},{"$f":"VLOOKUP($A5,Engagés!$A$1:$F$360,5,FALSE)","v":"STAN 4"},null,null,"1er"]
[10,{"$f":"VLOOKUP($A6,Engagés!$A$1:$F$360,3,FALSE)","v":"ALMA 4"},{"$f":"VLOOKUP($A6,Engagés!$A$1:$F$360,4,FALSE)","v":"ALMA 4"},{"$f":"VLOOKUP($A6,Engagés!$A$1:$F$360,5,FALSE)","v":"ALMA 4"},null,null,"3ème"]
[15,{"$f":"VLOOKUP($A7,Engagés!$A$1:$F$360,3,FALSE)","v":"SPF 2"},{"$f":"VLOOKUP($A7,Engagés!$A$1:$F$360,4,FALSE)","v":"SPF 2"},{"$f":"VLOOKUP($A7,Engagés!$A$1:$F$360,5,FALSE)","v":"SPF 2"},null,null,"4ème"]
["Si poule de 4 joueurs alors…"]
["Déroulement",null,null,"Joueurs A contre Joueur B",null,"Vainqueur","Score"]
["Match 1",null,null,{"$f":"B4","v":"STAN 2"},{"$f":"B7","v":"SPF 2"},"STAN 2"]
["Match 2",null,null,{"$f":"B5","v":"STAN 4"},{"$f":"B6","v":"ALMA 4"},"STAN 4"]
["Finale vainqueur Match 1 contre vainqueur Match 2",null,null,{"$f":"IF(F10=\"\",\"\",F10)","v":"STAN 2"},{"$f":"IF(F11=\"\",\"\",F11)","v":"STAN 4"},"STAN 2"]
["Petite finale entre les deux perdants des matchs 1 et 2",null,null,{"$f":"IF(D12=\"\",\"\",IF(D12=D10,E10,D10))","v":"SPF 2"},{"$f":"IF(E12=\"\",\"\",IF(E12=D11,E11,D11))","v":"ALMA 4"},"ALMA 4"]
["Si poule de 3 joueurs alors…"]
["Déroulement",null,null,"Joueurs A contre Joueur B",null,"Vainqueur","Score"]
["Match 1",null,null,{"$f":"B4","v":"STAN 2"},{"$f":"B6","v":"ALMA 4"}]
["Match 2",null,null,{"$f":"B5","v":"STAN 4"},{"$f":"B6","v":"ALMA 4"}]
["Match 3",null,null,{"$f":"B4","v":"STAN 2"},{"$f":"B5","v":"STAN 4"}]
["CLASSEMENT",null,null,null,{"$f":"A2","v":"POULE 2"}]
[null,null,"NOM",null,"PRENOM",null,"SIGLE"]
["1er",null,{"$f":"IF($G$4=\"1er\", $B$4,IF($G$5=\"1er\",$B$5,IF($G$6=\"1er\",$B$6,IF($G$7=\"1er\",$B$7,\"\"))))","v":"STAN 4"},null,{"$f":"IF($G$4=\"1er\", $C$4,IF($G$5=\"1er\",$C$5,IF($G$6=\"1er\",$C$6,IF($G$7=\"1er\",$C$7,\"\"))))","v":"STAN 4"},null,{"$f":"IF($G$4=\"1er\", $D$4,IF($G$5=\"1er\",$D$5,IF($G$6=\"1er\",$D$6,IF($G$7=\"1er\",$D$7,\"\"))))","v":"STAN 4"}]
["2ème",null,{"$f":"IF($G$4=\"2ème\", $B$4,IF($G$5=\"2ème\",$B$5,IF($G$6=\"2ème\",$B$6,IF($G$7=\"2ème\",$B$7,\"\"))))","v":"STAN 2"},null,{"$f":"IF($G$4=\"2ème\", $C$4,IF($G$5=\"2ème\",$C$5,IF($G$6=\"2ème\",$C$6,IF($G$7=\"2ème\",$C$7,\"\"))))","v":"STAN 2"},null,{"$f":"IF($G$4=\"2ème\", $D$4,IF($G$5=\"2ème\",$D$5,IF($G$6=\"2ème\",$D$6,IF($G$7=\"2ème\",$D$7,\"\"))))","v":"STAN 2"}]
["3ème",null,{"$f":"IF($G$4=\"3ème\", $B$4,IF($G$5=\"3ème\",$B$5,IF($G$6=\"3ème\",$B$6,IF($G$7=\"3ème\",$B$7,\"\"))))","v":"ALMA 4"},null,{"$f":"IF($G$4=\"3ème\", $C$4,IF($G$5=\"3ème\",$C$5,IF($G$6=\"3ème\",$C$6,IF($G$7=\"3ème\",$C$7,\"\"))))","v":"ALMA 4"},null,{"$f":"IF($G$4=\"3ème\", $D$4,IF($G$5=\"3ème\",$D$5,IF($G$6=\"3ème\",$D$6,IF($G$7=\"3ème\",$D$7,\"\"))))","v":"ALMA 4"}]
["4ème",null,{"$f":"IF($G$4=\"4ème\", $B$4,IF($G$5=\"4ème\",$B$5,IF($G$6=\"4ème\",$B$6,IF($G$7=\"4ème\",$B$7,\"\"))))","v":"SPF 2"},null,{"$f":"IF($G$4=\"4ème\", $C$4,IF($G$5=\"4ème\",$C$5,IF($G$6=\"4ème\",$C$6,IF($G$7=\"4ème\",$C$7,\"\"))))","v":"SPF 2"},null,{"$f":"IF($G$4=\"4ème\", $D$4,IF($G$5=\"4ème\",$D$5,IF($G$6=\"4ème\",$D$6,IF($G$7=\"4ème\",$D$7,\"\"))))","v":"SPF 2"}]

{"sheet":"Poule 3","index":3,"n_rows":24,"n_cols":7,"rows_kept":24,"cut":false,"hidden":false,"merged":[[0,0,0,6],[1,0,1,2],[1,3,1,6],[7,0,7,6],[8,0,8,2],[8,3,8,4],[9,0,9,2],[10,0,10,2],[11,0,11,2],[12,0,12,2],[13,0,13,6],[14,0,14,2],[14,3,14,4],[21,4,21,5],[22,0,22,1],[15,0,15,2],[16,0,16,2],[17,0,17,2],[18,0,18,3],[18,4,18,6],[19,0,19,1],[19,2,19,3],[19,4,19,5],[22,2,22,3],[22,4,22,5],[20,0,20,1],[20,2,20,3],[20,4,20,5],[23,0,23,1],[23,2,23,3],[23,4,23,5],[21,0,21,1],[21,2,21,3]]}
["               BADMINTON "]
["POULE 3",null,null,"TERRAIN N°"]
[null,"NOM","Prénom","Sigle","Vict","Def","Classement"]
[3,{"$f":"VLOOKUP($A4,Engagés!$A$1:$F$360,3,FALSE)","v":"ALMA 1"},{"$f":"VLOOKUP($A4,Engagés!$A$1:$F$360,4,FALSE)","v":"ALMA 1"},{"$f":"VLOOKUP($A4,Engagés!$A$1:$F$360,5,FALSE)","v":"ALMA 1"},null,null,"1er"]
[6,{"$f":"VLOOKUP($A5,Engagés!$A$1:$F$360,3,FALSE)","v":"ALMA 3"},{"$f":"VLOOKUP($A5,Engagés!$A$1:$F$360,4,FALSE)","v":"ALMA 3"},{"$f":"VLOOKUP($A5,Engagés!$A$1:$F$360,5,FALSE)","v":"ALMA 3"},null,null,"2ème"]
[11,{"$f":"VLOOKUP($A6,Engagés!$A$1:$F$360,3,FALSE)","v":"STAN 6"},{"$f":"VLOOKUP($A6,Engagés!$A$1:$F$360,4,FALSE)","v":"STAN 6"},{"$f":"VLOOKUP($A6,Engagés!$A$1:$F$360,5,FALSE)","v":"STAN 6"},null,null,"4ème"]
[14,{"$f":"VLOOKUP($A7,Engagés!$A$1:$F$360,3,FALSE)","v":"STAN 8"},{"$f":"VLOOKUP($A7,Engagés!$A$1:$F$360,4,FALSE)","v":"STAN 8"},{"$f":"VLOOKUP($A7,Engagés!$A$1:$F$360,5,FALSE)","v":"STAN 8"},null,null,"3ème"]
["Si poule de 4 joueurs alors…"]
["Déroulement",null,null,"Joueurs A contre Joueur B",null,"Vainqueur","Score"]
["Match 1",null,null,{"$f":"B4","v":"ALMA 1"},{"$f":"B7","v":"STAN 8"},"ALMA 1"]
["Match 2",null,null,{"$f":"B5","v":"ALMA 3"},{"$f":"B6","v":"STAN 6"},"ALMA 3"]
["Finale vainqueur Match 1 contre vainqueur Match 2",null,null,{"$f":"IF(F10=\"\",\"\",F10)","v":"ALMA 1"},{"$f":"IF(F11=\"\",\"\",F11)","v":"ALMA 3"},"ALMA 1"]
["Petite finale entre les deux perdants des matchs 1 et 2",null,null,{"$f":"IF(D12=\"\",\"\",IF(D12=D10,E10,D10))","v":"STAN 8"},{"$f":"IF(E12=\"\",\"\",IF(E12=D11,E11,D11))","v":"STAN 6"},"STAN 8"]
["Si poule de 3 joueurs alors…"]
["Déroulement",null,null,"Joueurs A contre Joueur B",null,"Vainqueur","Score"]
["Match 1",null,null,{"$f":"B4","v":"ALMA 1"},{"$f":"B6","v":"STAN 6"}]
["Match 2",null,null,{"$f":"B5","v":"ALMA 3"},{"$f":"B6","v":"STAN 6"}]
["Match 3",null,null,{"$f":"B4","v":"ALMA 1"},{"$f":"B5","v":"ALMA 3"}]
["CLASSEMENT",null,null,null,{"$f":"A2","v":"POULE 3"}]
[null,null,"NOM",null,"PRENOM",null,"SIGLE"]
["1er",null,{"$f":"IF($G$4=\"1er\", $B$4,IF($G$5=\"1er\",$B$5,IF($G$6=\"1er\",$B$6,IF($G$7=\"1er\",$B$7,\"\"))))","v":"ALMA 1"},null,{"$f":"IF($G$4=\"1er\", $C$4,IF($G$5=\"1er\",$C$5,IF($G$6=\"1er\",$C$6,IF($G$7=\"1er\",$C$7,\"\"))))","v":"ALMA 1"},null,{"$f":"IF($G$4=\"1er\", $D$4,IF($G$5=\"1er\",$D$5,IF($G$6=\"1er\",$D$6,IF($G$7=\"1er\",$D$7,\"\"))))","v":"ALMA 1"}]
["2ème",null,{"$f":"IF($G$4=\"2ème\", $B$4,IF($G$5=\"2ème\",$B$5,IF($G$6=\"2ème\",$B$6,IF($G$7=\"2ème\",$B$7,\"\"))))","v":"ALMA 3"},null,{"$f":"IF($G$4=\"2ème\", $C$4,IF($G$5=\"2ème\",$C$5,IF($G$6=\"2ème\",$C$6,IF($G$7=\"2ème\",$C$7,\"\"))))","v":"ALMA 3"},null,{"$f":"IF($G$4=\"2ème\", $D$4,IF($G$5=\"2ème\",$D$5,IF($G$6=\"2ème\",$D$6,IF($G$7=\"2ème\",$D$7,\"\"))))","v":"ALMA 3"}]
["3ème",null,{"$f":"IF($G$4=\"3ème\", $B$4,IF($G$5=\"3ème\",$B$5,IF($G$6=\"3ème\",$B$6,IF($G$7=\"3ème\",$B$7,\"\"))))","v":"STAN 8"},null,{"$f":"IF($G$4=\"3ème\", $C$4,IF($G$5=\"3ème\",$C$5,IF($G$6=\"3ème\",$C$6,IF($G$7=\"3ème\",$C$7,\"\"))))","v":"STAN 8"},null,{"$f":"IF($G$4=\"3ème\", $D$4,IF($G$5=\"3ème\",$D$5,IF($G$6=\"3ème\",$D$6,IF($G$7=\"3ème\",$D$7,\"\"))))","v":"STAN 8"}]
["4ème",null,{"$f":"IF($G$4=\"4ème\", $B$4,IF($G$5=\"4ème\",$B$5,IF($G$6=\"4ème\",$B$6,IF($G$7=\"4ème\",$B$7,\"\"))))","v":"STAN 6"},null,{"$f":"IF($G$4=\"4ème\", $C$4,IF($G$5=\"4ème\",$C$5,IF($G$6=\"4ème\",$C$6,IF($G$7=\"4ème\",$C$7,\"\"))))","v":"STAN 6"},null,{"$f":"IF($G$4=\"4ème\", $D$4,IF($G$5=\"4ème\",$D$5,IF($G$6=\"4ème\",$D$6,IF($G$7=\"4ème\",$D$7,\"\"))))","v":"STAN 6"}]

{"sheet":"Poule 4","index":4,"n_rows":24,"n_cols":7,"rows_kept":24,"cut":false,"hidden":false,"merged":[[0,0,0,6],[1,0,1,2],[1,3,1,6],[7,0,7,6],[8,0,8,2],[8,3,8,4],[9,0,9,2],[10,0,10,2],[11,0,11,2],[12,0,12,2],[13,0,13,6],[14,0,14,2],[14,3,14,4],[21,4,21,5],[22,0,22,1],[15,0,15,2],[16,0,16,2],[17,0,17,2],[18,0,18,3],[18,4,18,6],[19,0,19,1],[19,2,19,3],[19,4,19,5],[22,2,22,3],[22,4,22,5],[20,0,20,1],[20,2,20,3],[20,4,20,5],[23,0,23,1],[23,2,23,3],[23,4,23,5],[21,0,21,1],[21,2,21,3]]}
["               BADMINTON "]
["POULE 4",null,null,"TERRAIN N°"]
[null,"NOM","Prénom","Sigle","Vict","Def","Classement"]
[4,{"$f":"VLOOKUP($A4,Engagés!$A$1:$F$360,3,FALSE)","v":"STAN 3"},{"$f":"VLOOKUP($A4,Engagés!$A$1:$F$360,4,FALSE)","v":"STAN 3"},{"$f":"VLOOKUP($A4,Engagés!$A$1:$F$360,5,FALSE)","v":"STAN 3"},null,null,"1er"]
[5,{"$f":"VLOOKUP($A5,Engagés!$A$1:$F$360,3,FALSE)","v":"ALMA 2"},{"$f":"VLOOKUP($A5,Engagés!$A$1:$F$360,4,FALSE)","v":"ALMA 2"},{"$f":"VLOOKUP($A5,Engagés!$A$1:$F$360,5,FALSE)","v":"ALMA 2"},null,null,"3ème"]
[12,{"$f":"VLOOKUP($A6,Engagés!$A$1:$F$360,3,FALSE)","v":"STAN 7"},{"$f":"VLOOKUP($A6,Engagés!$A$1:$F$360,4,FALSE)","v":"STAN 7"},{"$f":"VLOOKUP($A6,Engagés!$A$1:$F$360,5,FALSE)","v":"STAN 7"},null,null,"2ème"]
[13,{"$f":"VLOOKUP($A7,Engagés!$A$1:$F$360,3,FALSE)","v":"ALMA 5"},{"$f":"VLOOKUP($A7,Engagés!$A$1:$F$360,4,FALSE)","v":"ALMA 5"},{"$f":"VLOOKUP($A7,Engagés!$A$1:$F$360,5,FALSE)","v":"ALMA 5"},null,null,"4ème"]
["Si poule de 4 joueurs alors…"]
["Déroulement",null,null,"Joueurs A contre Joueur B",null,"Vainqueur","Score"]
["Match 1",null,null,{"$f":"B4","v":"STAN 3"},{"$f":"B7","v":"ALMA 5"},"STAN 3"]
["Match 2",null,null,{"$f":"B5","v":"ALMA 2"},{"$f":"B6","v":"STAN 7"},"STAN 7"]
["Finale vainqueur Match 1 contre vainqueur Match 2",null,null,{"$f":"IF(F10=\"\",\"\",F10)","v":"STAN 3"},{"$f":"IF(F11=\"\",\"\",F11)","v":"STAN 7"},"STAN 3"]
["Petite finale entre les deux perdants des matchs 1 et 2",null,null,{"$f":"IF(D12=\"\",\"\",IF(D12=D10,E10,D10))","v":"ALMA 5"},{"$f":"IF(E12=\"\",\"\",IF(E12=D11,E11,D11))","v":"ALMA 2"},"ALMA 2"]
["Si poule de 3 joueurs alors…"]
["Déroulement",null,null,"Joueurs A contre Joueur B",null,"Vainqueur","Score"]
["Match 1",null,null,{"$f":"B4","v":"STAN 3"},{"$f":"B6","v":"STAN 7"}]
["Match 2",null,null,{"$f":"B5","v":"ALMA 2"},{"$f":"B6","v":"STAN 7"}]
["Match 3",null,null,{"$f":"B4","v":"STAN 3"},{"$f":"B5","v":"ALMA 2"}]
["CLASSEMENT",null,null,null,{"$f":"A2","v":"POULE 4"}]
[null,null,"NOM",null,"PRENOM",null,"SIGLE"]
["1er",null,{"$f":"IF($G$4=\"1er\", $B$4,IF($G$5=\"1er\",$B$5,IF($G$6=\"1er\",$B$6,IF($G$7=\"1er\",$B$7,\"\"))))","v":"STAN 3"},null,{"$f":"IF($G$4=\"1er\", $C$4,IF($G$5=\"1er\",$C$5,IF($G$6=\"1er\",$C$6,IF($G$7=\"1er\",$C$7,\"\"))))","v":"STAN 3"},null,{"$f":"IF($G$4=\"1er\", $D$4,IF($G$5=\"1er\",$D$5,IF($G$6=\"1er\",$D$6,IF($G$7=\"1er\",$D$7,\"\"))))","v":"STAN 3"}]
["2ème",null,{"$f":"IF($G$4=\"2ème\", $B$4,IF($G$5=\"2ème\",$B$5,IF($G$6=\"2ème\",$B$6,IF($G$7=\"2ème\",$B$7,\"\"))))","v":"STAN 7"},null,{"$f":"IF($G$4=\"2ème\", $C$4,IF($G$5=\"2ème\",$C$5,IF($G$6=\"2ème\",$C$6,IF($G$7=\"2ème\",$C$7,\"\"))))","v":"STAN 7"},null,{"$f":"IF($G$4=\"2ème\", $D$4,IF($G$5=\"2ème\",$D$5,IF($G$6=\"2ème\",$D$6,IF($G$7=\"2ème\",$D$7,\"\"))))","v":"STAN 7"}]
["3ème",null,{"$f":"IF($G$4=\"3ème\", $B$4,IF($G$5=\"3ème\",$B$5,IF($G$6=\"3ème\",$B$6,IF($G$7=\"3ème\",$B$7,\"\"))))","v":"ALMA 2"},null,{"$f":"IF($G$4=\"3ème\", $C$4,IF($G$5=\"3ème\",$C$5,IF($G$6=\"3ème\",$C$6,IF($G$7=\"3ème\",$C$7,\"\"))))","v":"ALMA 2"},null,{"$f":"IF($G$4=\"3ème\", $D$4,IF($G$5=\"3ème\",$D$5,IF($G$6=\"3ème\",$D$6,IF($G$7=\"3ème\",$D$7,\"\"))))","v":"ALMA 2"}]
["4ème",null,{"$f":"IF($G$4=\"4ème\", $B$4,IF($G$5=\"4ème\",$B$5,IF($G$6=\"4ème\",$B$6,IF($G$7=\"4ème\",$B$7,\"\"))))","v":"ALMA 5"},null,{"$f":"IF($G$4=\"4ème\", $C$4,IF($G$5=\"4ème\",$C$5,IF($G$6=\"4ème\",$C$6,IF($G$7=\"4ème\",$C$7,\"\"))))","v":"ALMA 5"},null,{"$f":"IF($G$4=\"4ème\", $D$4,IF($G$5=\"4ème\",$D$5,IF($G$6=\"4ème\",$D$6,IF($G$7=\"4ème\",$D$7,\"\"))))","v":"ALMA 5"}]

{"sheet":"Résultats de poule","index":5,"n_rows":5,"n_cols":16,"rows_kept":5,"cut":false,"hidden":false,"merged":[[0,0,0,3],[0,4,0,7],[0,8,0,11],[0,12,0,15]]}
["Poule 1",null,null,null,"Poule 2",null,null,null,"Poule 3",null,null,null,"Poule 4"]
["1er",{"$f":"'Poule 1'!$C21","v":"STAN 1"},{"$f":"'Poule 1'!$E21","v":"STAN 1"},{"$f":"'Poule 1'!$G21","v":"STAN 1"},"1er",{"$f":"'Poule 2'!$C21","v":"STAN 4"},{"$f":"'Poule 2'!$E21","v":"STAN 4"},{"$f":"'Poule 2'!$G21","v":"STAN 4"},"1er",{"$f":"'Poule 3'!$C21","v":"ALMA 1"},{"$f":"'Poule 3'!$E21","v":"ALMA 1"},{"$f":"'Poule 3'!$G21","v":"ALMA 1"},"1er",{"$f":"'Poule 4'!$C21","v":"STAN 3"},{"$f":"'Poule 4'!$E21","v":"STAN 3"},{"$f":"'Poule 4'!$G21","v":"STAN 3"}]
["2ème",{"$f":"'Poule 1'!$C22","v":"SPF 1"},{"$f":"'Poule 1'!$E22","v":"SPF 1"},{"$f":"'Poule 1'!$G22","v":"SPF 1"},"2ème",{"$f":"'Poule 2'!$C22","v":"STAN 2"},{"$f":"'Poule 2'!$E22","v":"STAN 2"},{"$f":"'Poule 2'!$G22","v":"STAN 2"},"2ème",{"$f":"'Poule 3'!$C22","v":"ALMA 3"},{"$f":"'Poule 3'!$E22","v":"ALMA 3"},{"$f":"'Poule 3'!$G22","v":"ALMA 3"},"2ème",{"$f":"'Poule 4'!$C22","v":"STAN 7"},{"$f":"'Poule 4'!$E22","v":"STAN 7"},{"$f":"'Poule 4'!$G22","v":"STAN 7"}]
["3ème",{"$f":"'Poule 1'!$C23","v":"STAN 5"},{"$f":"'Poule 1'!$E23","v":"STAN 5"},{"$f":"'Poule 1'!$G23","v":"STAN 5"},"3ème",{"$f":"'Poule 2'!$C23","v":"ALMA 4"},{"$f":"'Poule 2'!$E23","v":"ALMA 4"},{"$f":"'Poule 2'!$G23","v":"ALMA 4"},"3ème",{"$f":"'Poule 3'!$C23","v":"STAN 8"},{"$f":"'Poule 3'!$E23","v":"STAN 8"},{"$f":"'Poule 3'!$G23","v":"STAN 8"},"3ème",{"$f":"'Poule 4'!$C23","v":"ALMA 2"},{"$f":"'Poule 4'!$E23","v":"ALMA 2"},{"$f":"'Poule 4'!$G23","v":"ALMA 2"}]
["4ème",{"$f":"'Poule 1'!$C24","v":"ALMA 6"},{"$f":"'Poule 1'!$E24","v":"ALMA 6"},{"$f":"'Poule 1'!$G24","v":"ALMA 6"},"4ème",{"$f":"'Poule 2'!$C24","v":"SPF 2"},{"$f":"'Poule 2'!$E24","v":"SPF 2"},{"$f":"'Poule 2'!$G24","v":"SPF 2"},"4ème",{"$f":"'Poule 3'!$C24","v":"STAN 6"},{"$f":"'Poule 3'!$E24","v":"STAN 6"},{"$f":"'Poule 3'!$G24","v":"STAN 6"},"4ème",{"$f":"'Poule 4'!$C24","v":"ALMA 5"},{"$f":"'Poule 4'!$E24","v":"ALMA 5"},{"$f":"'Poule 4'!$G24","v":"ALMA 5"}]

{"sheet":"Tableau","index":6,"n_rows":63,"n_cols":27,"rows_kept":63,"cut":false,"hidden":false,"merged":[[50,2,50,3],[30,4,31,9],[45,2,45,3],[46,2,46,3],[47,2,47,3],[48,2,48,3],[49,2,49,3],[40,2,40,3],[41,2,41,3],[42,2,42,3],[43,2,43,3],[44,2,44,3],[35,2,35,3],[36,2,36,3],[37,2,37,3],[38,2,38,3],[39,2,39,3],[23,6,23,7],[3,16,3,17],[18,16,18,17],[33,0,34,7],[33,8,33,10],[34,8,34,10],[1,0,1,1],[25,16,25,17],[29,19,29,20],[0,12,0,15],[0,16,0,26],[15,25,15,26],[0,0,0,10],[9,19,9,20],[8,6,8,7],[1,6,1,7],[10,16,10,17],[23,19,23,20],[16,22,16,23],[16,6,16,7]]}
["REPECHAGES",null,null,null,null,null,null,null,null,null,null,null,"1er tour de tableau",null,null,null,"Tableau principal"]
[null,null,null,null,null,null,"Perdant 1/4 de finale 2"]
[null,null,null,null,null,"V",{"$f":"IF(S12=\"\",\"\",IF(S12=\"p\",R12,R14))","v":"STAN 3"},{"$f":"IF(S12=\"\",\"\",IF(S12=\"p\",Q12,Q14))","v":"STAN 3"}]
[null,null,null,null,null,null,null,null,null,null,null,null,"1er poule 1",{"$f":"'Résultats de poule'!B2","v":"STAN 1"},{"$f":"'Résultats de poule'!D2","v":"STAN 1"},"V","1/4 de finale 1"]
[null,null,"V",{"$f":"IF(F3=\"\",\"\",IF(F3=\"v\",G3,G6))","v":"STAN 3"},{"$f":"IF(F3=\"\",\"\",IF(F3=\"v\",H3,H6))","v":"STAN 3"},null,null,null,"P",{"$f":"IF(P4=\"\",\"\",IF(P4=\"p\",O4,O5))","v":"ALMA 5"},{"$f":"IF(P4=\"\",\"\",IF(P4=\"p\",N4,N5))","v":"ALMA 5"},null,"4ème poule 4",{"$f":"'Résultats de poule'!N5","v":"ALMA 5"},{"$f":"'Résultats de poule'!P5","v":"ALMA 5"},"P",{"$f":"IF(P4=\"\",\"\",IF(P4=\"v\",N4,N5))","v":"STAN 1"},{"$f":"IF(P4=\"\",\"\",IF(P4=\"v\",O4,O5))","v":"STAN 1"},"V"]
[null,null,null,null,null,"P",{"$f":"IF(I5=\"\",\"\",IF(I5=\"v\",J5,J7))","v":"ALMA 4"},{"$f":"IF(I5=\"\",\"\",IF(I5=\"v\",K5,K7))","v":"ALMA 4"},null,null,null,null,null,null,null,null,null,null,null,{"$f":"IF(S5=\"\",\"\",IF(S5=\"v\",Q5,Q7))","v":"STAN 1"},{"$f":"IF(S5=\"\",\"\",IF(S5=\"v\",R5,R7))","v":"STAN 1"},"P"]
[null,null,null,null,null,null,null,null,"V",{"$f":"IF(P7=\"\",\"\",IF(P7=\"p\",O7,O8))","v":"ALMA 4"},{"$f":"IF(P7=\"\",\"\",IF(P7=\"p\",N7,N8))","v":"ALMA 4"},null,"3ème poule 2",{"$f":"'Résultats de poule'!F4","v":"ALMA 4"},{"$f":"'Résultats de poule'!H4","v":"ALMA 4"},"P",{"$f":"IF(P7=\"\",\"\",IF(P7=\"v\",N7,N8))","v":"ALMA 3"},{"$f":"IF(P7=\"\",\"\",IF(P7=\"v\",O7,O8))","v":"ALMA 3"},"P"]
[{"$f":"IF(C5=\"\",\"\",IF(C5=\"v\",D5,D12))","v":"STAN 3"},{"$f":"IF(C5=\"\",\"\",IF(C5=\"v\",E5,E12))","v":"STAN 3"},null,null,null,null,null,null,null,null,null,null,"2ème poule 3",{"$f":"'Résultats de poule'!J3","v":"ALMA 3"},{"$f":"'Résultats de poule'!L3","v":"ALMA 3"},"V"]
[null,null,null,null,null,null,"Perdant 1/4 de finale 1"]
[null,null,null,null,null,"V",{"$f":"IF(S5=\"\",\"\",IF(S5=\"p\",R5,R7))","v":"ALMA 3"},{"$f":"IF(S5=\"\",\"\",IF(S5=\"p\",Q5,Q7))","v":"ALMA 3"},null,null,null,null,null,null,null,null,null,null,null,"1/2 finale A",null,null,{"$f":"IF(V6=\"\",\"\",IF(V6=\"v\",T6,T13))","v":"STAN 2"},{"$f":"IF(V6=\"\",\"\",IF(V6=\"v\",U6,U13))","v":"STAN 2"},"V"]
[null,null,null,null,null,null,null,null,null,null,null,null,"2ème poule 2",{"$f":"'Résultats de poule'!F3","v":"STAN 2"},{"$f":"'Résultats de poule'!H3","v":"STAN 2"},"V","1/4 de finale 2"]
[null,null,"P",{"$f":"IF(F10=\"\",\"\",IF(F10=\"v\",G10,G13))","v":"ALMA 3"},{"$f":"IF(F10=\"\",\"\",IF(F10=\"v\",H10,H13))","v":"ALMA 3"},null,null,null,"V",{"$f":"IF(P11=\"\",\"\",IF(P11=\"p\",O11,O12))","v":"STAN 8"},{"$f":"IF(P11=\"\",\"\",IF(P11=\"p\",N11,N12))","v":"STAN 8"},null,"3ème poule 3",{"$f":"'Résultats de poule'!J4","v":"STAN 8"},{"$f":"'Résultats de poule'!L4","v":"STAN 8"},"P",{"$f":"IF(P11=\"\",\"\",IF(P11=\"v\",N11,N12))","v":"STAN 2"},{"$f":"IF(P11=\"\",\"\",IF(P11=\"v\",O11,O12))","v":"STAN 2"},"V"]
[null,null,null,null,null,"P",{"$f":"IF(I12=\"\",\"\",IF(I12=\"v\",J12,J14))","v":"STAN 8"},{"$f":"IF(I12=\"\",\"\",IF(I12=\"v\",K12,K14))","v":"STAN 8"},null,null,null,null,null,null,null,null,null,null,null,{"$f":"IF(S12=\"\",\"\",IF(S12=\"v\",Q12,Q14))","v":"STAN 2"},{"$f":"IF(S12=\"\",\"\",IF(S12=\"v\",R12,R14))","v":"STAN 2"},"V"]
[null,null,null,null,null,null,null,null,"P",{"$f":"IF(P14=\"\",\"\",IF(P14=\"p\",O14,O15))","v":"ALMA 6"},{"$f":"IF(P14=\"\",\"\",IF(P14=\"p\",N14,N15))","v":"ALMA 6"},null,"4ème poule 1",{"$f":"'Résultats de poule'!B5","v":"ALMA 6"},{"$f":"'Résultats de poule'!D5","v":"ALMA 6"},"P",{"$f":"IF(P14=\"\",\"\",IF(P14=\"v\",N14,N15))","v":"STAN 3"},{"$f":"IF(P14=\"\",\"\",IF(P14=\"v\",O14,O15))","v":"STAN 3"},"P"]
[null,null,null,null,null,null,null,null,null,null,null,null,"1er poule 4",{"$f":"'Résultats de poule'!N2","v":"STAN 3"},{"$f":"'Résultats de poule'!P2","v":"STAN 3"},"V"]
[null,null,null,null,null,null,null,null,null,null,null,null,null,null,null,null,null,null,null,null,null,null,null,null,null,"Vainqueur"]
[null,null,null,null,null,null,"Perdant 1/4 de finale 4",null,null,null,null,null,null,null,null,null,null,null,null,null,null,null,"FINALE",null,null,{"$f":"IF(Y10=\"\",\"\",IF(Y10=\"v\",W10,W24))","v":"STAN 2"},{"$f":"IF(Y10=\"\",\"\",IF(Y10=\"v\",X10,X24))","v":"STAN 2"}]
[null,null,null,null,null,"V",{"$f":"IF(S27=\"\",\"\",IF(S27=\"p\",R27,R29))","v":"STAN 4"},{"$f":"IF(S27=\"\",\"\",IF(S27=\"p\",Q27,Q29))","v":"STAN 4"}]
[null,null,null,null,null,null,null,null,null,null,null,null,"1er poule 3",{"$f":"'Résultats de poule'!J2","v":"ALMA 1"},{"$f":"'Résultats de poule'!L2","v":"ALMA 1"},"V","1/4 de finale 3"]
[null,null,"V",{"$f":"IF(F18=\"\",\"\",IF(F18=\"v\",G18,G21))","v":"STAN 4"},{"$f":"IF(F18=\"\",\"\",IF(F18=\"v\",H18,H21))","v":"STAN 4"},null,null,null,"P",{"$f":"IF(P19=\"\",\"\",IF(P19=\"p\",O19,O20))","v":"SPF 2"},{"$f":"IF(P19=\"\",\"\",IF(P19=\"p\",N19,N20))","v":"SPF 2"},null,"4ème poule 2",{"$f":"'Résultats de poule'!F5","v":"SPF 2"},{"$f":"'Résultats de poule'!H5","v":"SPF 2"},"P",{"$f":"IF(P19=\"\",\"\",IF(P19=\"v\",N19,N20))","v":"ALMA 1"},{"$f":"IF(P19=\"\",\"\",IF(P19=\"v\",O19,O20))","v":"ALMA 1"},"V"]
[null,null,null,null,null,"P",{"$f":"IF(I20=\"\",\"\",IF(I20=\"v\",J20,J22))","v":"SPF 1"},{"$f":"IF(I20=\"\",\"\",IF(I20=\"v\",K20,K22))","v":"SPF 1"},null,null,null,null,null,null,null,null,null,null,null,{"$f":"IF(S20=\"\",\"\",IF(S20=\"v\",Q20,Q22))","v":"ALMA 1"},{"$f":"IF(S20=\"\",\"\",IF(S20=\"v\",R20,R22))","v":"ALMA 1"},"V"]
[null,null,null,null,null,null,null,null,"V",{"$f":"IF(P22=\"\",\"\",IF(P22=\"p\",O22,O23))","v":"SPF 1"},{"$f":"IF(P22=\"\",\"\",IF(P22=\"p\",N22,N23))","v":"SPF 1"},null,"3ème poule 4",{"$f":"'Résultats de poule'!N4","v":"ALMA 2"},{"$f":"'Résultats de poule'!P4","v":"ALMA 2"},"V",{"$f":"IF(P22=\"\",\"\",IF(P22=\"v\",N22,N23))","v":"ALMA 2"},{"$f":"IF(P22=\"\",\"\",IF(P22=\"v\",O22,O23))","v":"ALMA 2"},"P"]
[null,null,null,null,null,null,null,null,null,null,null,null,"2ème poule 1",{"$f":"'Résultats de poule'!B3","v":"SPF 1"},{"$f":"'Résultats de poule'!D3","v":"SPF 1"},"P"]
[{"$f":"IF(C20=\"\",\"\",IF(C20=\"v\",D20,D27))","v":"STAN 4"},{"$f":"IF(C20=\"\",\"\",IF(C20=\"v\",E20,E27))","v":"STAN 4"},null,null,null,null,"Perdant 1/4 de finale 3",null,null,null,null,null,null,null,null,null,null,null,null,"1/2 finale B",null,null,{"$f":"IF(V21=\"\",\"\",IF(V21=\"v\",T21,T28))","v":"ALMA 1"},{"$f":"IF(V21=\"\",\"\",IF(V21=\"v\",U21,U28))","v":"ALMA 1"},"P"]
[null,null,null,null,null,"V",{"$f":"IF(S20=\"\",\"\",IF(S20=\"p\",R20,R22))","v":"ALMA 2"},{"$f":"IF(S20=\"\",\"\",IF(S20=\"p\",Q20,Q22))","v":"ALMA 2"}]
[null,null,null,null,null,null,null,null,null,null,null,null,"2ème poule 4",{"$f":"'Résultats de poule'!N3","v":"STAN 7"},{"$f":"'Résultats de poule'!P3","v":"STAN 7"},"P","1/4 de finale 4"]
[null,null,"P",{"$f":"IF(F25=\"\",\"\",IF(F25=\"v\",G25,G28))","v":"ALMA 2"},{"$f":"IF(F25=\"\",\"\",IF(F25=\"v\",H25,H28))","v":"ALMA 2"},null,null,null,"P",{"$f":"IF(P26=\"\",\"\",IF(P26=\"p\",O26,O27))","v":"STAN 7"},{"$f":"IF(P26=\"\",\"\",IF(P26=\"p\",N26,N27))","v":"STAN 7"},null,"3ème poule 1",{"$f":"'Résultats de poule'!B4","v":"STAN 5"},{"$f":"'Résultats de poule'!D4","v":"STAN 5"},"V",{"$f":"IF(P26=\"\",\"\",IF(P26=\"v\",N26,N27))","v":"STAN 5"},{"$f":"IF(P26=\"\",\"\",IF(P26=\"v\",O26,O27))","v":"STAN 5"},"V"]
[null,null,null,null,null,"P",{"$f":"IF(I27=\"\",\"\",IF(I27=\"v\",J27,J29))","v":"STAN 6"},{"$f":"IF(I27=\"\",\"\",IF(I27=\"v\",K27,K29))","v":"STAN 6"},null,null,null,null,null,null,null,null,null,null,null,{"$f":"IF(S27=\"\",\"\",IF(S27=\"v\",Q27,Q29))","v":"STAN 5"},{"$f":"IF(S27=\"\",\"\",IF(S27=\"v\",R27,R29))","v":"STAN 5"},"P"]
[null,null,null,null,null,null,null,null,"V",{"$f":"IF(P29=\"\",\"\",IF(P29=\"p\",O29,O30))","v":"STAN 6"},{"$f":"IF(P29=\"\",\"\",IF(P29=\"p\",N29,N30))","v":"STAN 6"},null,"4ème poule 3",{"$f":"'Résultats de poule'!J5","v":"STAN 6"},{"$f":"'Résultats de poule'!L5","v":"STAN 6"},"P",{"$f":"IF(P29=\"\",\"\",IF(P29=\"v\",N29,N30))","v":"STAN 4"},{"$f":"IF(P29=\"\",\"\",IF(P29=\"v\",O29,O30))","v":"STAN 4"},"P"]
[null,null,null,null,null,null,null,null,null,null,null,null,"1er poule 2",{"$f":"'Résultats de poule'!F2","v":"STAN 4"},{"$f":"'Résultats de poule'!H2","v":"STAN 4"},"V",null,null,null,"Place de 3ème/4ème"]
[null,null,null,null,"MATCHS DE CLASSEMENT",null,null,null,null,null,null,null,null,null,null,null,null,null,null,{"$f":"IF(V21=\"\",\"\",IF(V21=\"p\",T21,T28))","v":"STAN 5"},{"$f":"IF(V21=\"\",\"\",IF(V21=\"p\",U21,U28))","v":"STAN 5"},"P"]
[null,null,null,null,null,null,null,null,null,null,null,null,null,null,null,null,null,null,null,null,null,null,{"$f":"IF(V31=\"\",\"\",IF(V31=\"v\",T31,T33))","v":"STAN 1"},{"$f":"IF(V31=\"\",\"\",IF(V31=\"v\",U31,U33))","v":"STAN 1"},"3ème"]
[null,null,null,null,null,null,null,null,null,null,null,null,null,null,null,null,null,null,null,{"$f":"IF(V6=\"\",\"\",IF(V6=\"p\",T6,T13))","v":"STAN 1"},{"$f":"IF(V6=\"\",\"\",IF(V6=\"p\",U6,U13))","v":"STAN 1"},"V"]
[{"$f":"Engagés!A1","v":"Rencontre Mixte Equipe TT"},null,null,null,null,null,null,null,"CATEGORIE",null,null,null,null,"Place de 5-6",null,null,null,null,null,null,null,null,"Place de 7-8"]
[null,null,null,null,null,null,null,null,{"$f":"IF(Engagés!E3=\"\",\"\",Engagés!E3)","v":"Mixte"},null,null,null,null,{"$f":"B8","v":"STAN 3"},{"$f":"A8","v":"STAN 3"},"P",null,null,null,null,null,null,{"$f":"IF(C5=\"\",\"\",IF(C5=\"p\",E5,E12))","v":"ALMA 3"},{"$f":"IF(C5=\"\",\"\",IF(C5=\"p\",D5,D12))","v":"ALMA 3"},"P",null,"7ème"]
["1er",{"$f":"IF(Z17=\"\",\"\",Z17)","v":"STAN 2"},{"$f":"IF(AA17=\"\",\"\",AA17)","v":"STAN 2"},null,null,null,null,null,null,null,null,null,null,null,null,null,{"$f":"IF(P35=\"\",\"\",IF(P35=\"v\",N35,N37))","v":"STAN 4"},{"$f":"IF(P35=\"\",\"\",IF(P35=\"v\",O35,O37))","v":"STAN 4"},"5ème",null,null,null,null,null,null,{"$f":"IF(Y35=\"\",\"\",IF(Y35=\"v\",W35,W37))","v":"ALMA 2"},{"$f":"IF(Y35=\"\",\"\",IF(Y35=\"v\",X35,X37))","v":"ALMA 2"}]
["2ème",{"$f":"IF(Y10=\"\",\"\",IF(Y10=\"p\",W10,W24))","v":"ALMA 1"},{"$f":"IF(Y10=\"\",\"\",IF(Y10=\"p\",X10,X24))","v":"ALMA 1"},null,null,null,null,null,null,null,null,null,null,{"$f":"B24","v":"STAN 4"},{"$f":"A24","v":"STAN 4"},"V",null,null,null,null,null,null,{"$f":"IF(C20=\"\",\"\",IF(C20=\"p\",E20,E27))","v":"ALMA 2"},{"$f":"IF(C20=\"\",\"\",IF(C20=\"p\",D20,D27))","v":"ALMA 2"},"V"]
["3ème",{"$f":"IF(W32=\"\",\"\",W32)","v":"STAN 1"},{"$f":"IF(X32=\"\",\"\",X32)","v":"STAN 1"}]
["4ème",{"$f":"IF(V31=\"\",\"\",IF(V31=\"p\",T31,T33))","v":"STAN 5"},{"$f":"IF(V31=\"\",\"\",IF(V31=\"p\",U31,U33))","v":"STAN 5"},null,null,null,null,null,null,null,null,null,null,"Place de 9 à 12"]
["5ème",{"$f":"IF(Q36=\"\",\"\",Q36)","v":"STAN 4"},{"$f":"IF(R36=\"\",\"\",R36)","v":"STAN 4"},null,null,null,null,null,null,null,null,null,null,{"$f":"IF(F3=\"\",\"\",IF(F3=\"p\",H3,H6))","v":"ALMA 4"},{"$f":"IF(F3=\"\",\"\",IF(F3=\"p\",G3,G6))","v":"ALMA 4"},"V","Place de 9-10"]
["6ème",{"$f":"IF(P35=\"\",\"\",IF(P35=\"p\",N35,N37))","v":"STAN 3"},{"$f":"IF(P35=\"\",\"\",IF(P35=\"p\",O35,O37))","v":"STAN 3"},null,null,null,null,null,null,null,null,null,null,null,null,null,{"$f":"IF(P40=\"\",\"\",IF(P40=\"v\",N40,N42))","v":"ALMA 4"},{"$f":"IF(P40=\"\",\"\",IF(P40=\"v\",O40,O42))","v":"ALMA 4"},"V"]
["7ème",{"$f":"IF(Z36=\"\",\"\",Z36)","v":"ALMA 2"},{"$f":"IF(AA36=\"\",\"\",AA36)","v":"ALMA 2"},null,null,null,null,null,null,null,null,null,null,{"$f":"IF(F10=\"\",\"\",IF(F10=\"p\",H10,H13))","v":"STAN 8"},{"$f":"IF(F10=\"\",\"\",IF(F10=\"p\",G10,G13))","v":"STAN 8"},"P"]
["8ème",{"$f":"IF(Y35=\"\",\"\",IF(Y35=\"p\",W35,W37))","v":"ALMA 3"},{"$f":"IF(Y35=\"\",\"\",IF(Y35=\"p\",X35,X37))","v":"ALMA 3"},null,null,null,null,null,null,null,null,null,null,null,null,null,null,null,null,{"$f":"IF(S41=\"\",\"\",IF(S41=\"v\",Q41,Q45))","v":"ALMA 4"},{"$f":"IF(S41=\"\",\"\",IF(S41=\"v\",R41,R45))","v":"ALMA 4"},"9ème"]
["9ème",{"$f":"IF(T43=\"\",\"\",T43)","v":"ALMA 4"},{"$f":"IF(U43=\"\",\"\",U43)","v":"ALMA 4"},null,null,null,null,null,null,null,null,null,null,{"$f":"IF(F18=\"\",\"\",IF(F18=\"p\",H18,H21))","v":"SPF 1"},{"$f":"IF(F18=\"\",\"\",IF(F18=\"p\",G18,G21))","v":"SPF 1"},"V"]
["10ème",{"$f":"IF(S41=\"\",\"\",IF(S41=\"p\",Q41,Q45))","v":"SPF 1"},{"$f":"IF(S41=\"\",\"\",IF(S41=\"p\",R41,R45))","v":"SPF 1"},null,null,null,null,null,null,null,null,null,null,null,null,null,{"$f":"IF(P44=\"\",\"\",IF(P44=\"v\",N44,N46))","v":"SPF 1"},{"$f":"IF(P44=\"\",\"\",IF(P44=\"v\",O44,O46))","v":"SPF 1"},"P"]
["11ème",{"$f":"IF(T49=\"\",\"\",T49)","v":"STAN 6"},{"$f":"IF(U49=\"\",\"\",U49)","v":"STAN 6"},null,null,null,null,null,null,null,null,null,null,{"$f":"IF(F25=\"\",\"\",IF(F25=\"p\",H25,H28))","v":"STAN 6"},{"$f":"IF(F25=\"\",\"\",IF(F25=\"p\",G25,G28))","v":"STAN 6"},"P"]
["12ème",{"$f":"IF(S48=\"\",\"\",IF(S48=\"p\",Q48,Q50))","v":"STAN 8"},{"$f":"IF(S48=\"\",\"\",IF(S48=\"p\",R48,R50))","v":"STAN 8"},null,null,null,null,null,null,null,null,null,null,null,null,null,"Place de 11-12"]
["13ème",{"$f":"IF(T56=\"\",\"\",T56)","v":"STAN 7"},{"$f":"IF(U56=\"\",\"\",U56)","v":"STAN 7"},null,null,null,null,null,null,null,null,null,null,null,null,null,{"$f":"IF(P40=\"\",\"\",IF(P40=\"p\",N40,N42))","v":"STAN 8"},{"$f":"IF(P42=\"\",\"\",IF(P42=\"p\",O42,O40))","v":"STAN 8"},"P"]
["14ème",{"$f":"IF(S54=\"\",\"\",IF(S54=\"p\",Q54,Q58))","v":"ALMA 5"},{"$f":"IF(S54=\"\",\"\",IF(S54=\"p\",R54,R58))","v":"ALMA 5"},null,null,null,null,null,null,null,null,null,null,null,null,null,null,null,null,{"$f":"IF(S48=\"\",\"\",IF(S48=\"v\",Q48,Q50))","v":"STAN 6"},{"$f":"IF(S48=\"\",\"\",IF(S48=\"v\",R48,R50))","v":"STAN 6"},"11ème"]
["15ème",{"$f":"IF(T62=\"\",\"\",T62)","v":"SPF 2"},{"$f":"IF(U62=\"\",\"\",U62)","v":"SPF 2"},null,null,null,null,null,null,null,null,null,null,null,null,null,{"$f":"IF(P44=\"\",\"\",IF(P44=\"p\",N44,N46))","v":"STAN 6"},{"$f":"IF(P44=\"\",\"\",IF(P44=\"p\",O44,O46))","v":"STAN 6"},"V"]
["16ème",{"$f":"IF(S61=\"\",\"\",IF(S61=\"p\",Q61,Q63))","v":"ALMA 6"},{"$f":"IF(S61=\"\",\"\",IF(S61=\"p\",R61,R63))","v":"ALMA 6"}]
[null,null,null,null,null,null,null,null,null,null,null,null,null,"Place de 13 à 16"]
[null,null,null,null,null,null,null,null,null,null,null,null,null,{"$f":"IF(I5=\"\",\"\",IF(I5=\"p\",K5,K7))","v":"ALMA 5"},{"$f":"IF(I5=\"\",\"\",IF(I5=\"p\",J5,J7))","v":"ALMA 5"},"V","Place de 13-14"]
[null,null,null,null,null,null,null,null,null,null,null,null,null,null,null,null,{"$f":"IF(P53=\"\",\"\",IF(P53=\"v\",N53,N55))","v":"ALMA 5"},{"$f":"IF(P53=\"\",\"\",IF(P53=\"v\",O53,O55))","v":"ALMA 5"},"P"]
[null,null,null,null,null,null,null,null,null,null,null,null,null,{"$f":"IF(I12=\"\",\"\",IF(I12=\"p\",K12,K14))","v":"ALMA 6"},{"$f":"IF(I12=\"\",\"\",IF(I12=\"p\",J12,J14))","v":"ALMA 6"},"P"]
[null,null,null,null,null,null,null,null,null,null,null,null,null,null,null,null,null,null,null,{"$f":"IF(S54=\"\",\"\",IF(S54=\"v\",Q54,Q58))","v":"STAN 7"},{"$f":"IF(S54=\"\",\"\",IF(S54=\"v\",R54,R58))","v":"STAN 7"},"13ème"]
[null,null,null,null,null,null,null,null,null,null,null,null,null,{"$f":"IF(I20=\"\",\"\",IF(I20=\"p\",K20,K22))","v":"SPF 2"},{"$f":"IF(I20=\"\",\"\",IF(I20=\"p\",J20,J22))","v":"SPF 2"},"P"]
[null,null,null,null,null,null,null,null,null,null,null,null,null,null,null,null,{"$f":"IF(P57=\"\",\"\",IF(P57=\"v\",N57,N59))","v":"STAN 7"},{"$f":"IF(P57=\"\",\"\",IF(P57=\"v\",O57,O59))","v":"STAN 7"},"V"]
[null,null,null,null,null,null,null,null,null,null,null,null,null,{"$f":"IF(I27=\"\",\"\",IF(I27=\"p\",K27,K29))","v":"STAN 7"},{"$f":"IF(I27=\"\",\"\",IF(I27=\"p\",J27,J29))","v":"STAN 7"},"V"]
[null,null,null,null,null,null,null,null,null,null,null,null,null,null,null,null,"Place de 15-16"]
[null,null,null,null,null,null,null,null,null,null,null,null,null,null,null,null,{"$f":"IF(P53=\"\",\"\",IF(P53=\"p\",N53,N55))","v":"ALMA 6"},{"$f":"IF(P53=\"\",\"\",IF(P53=\"p\",O53,O55))","v":"ALMA 6"},"P"]
[null,null,null,null,null,null,null,null,null,null,null,null,null,null,null,null,null,null,null,{"$f":"IF(S61=\"\",\"\",IF(S61=\"v\",Q61,Q63))","v":"SPF 2"},{"$f":"IF(S61=\"\",\"\",IF(S61=\"v\",R61,R63))","v":"SPF 2"},"15ème"]
[null,null,null,null,null,null,null,null,null,null,null,null,null,null,null,null,{"$f":"IF(P57=\"\",\"\",IF(P57=\"p\",N57,N59))","v":"SPF 2"},{"$f":"IF(P57=\"\",\"\",IF(P57=\"p\",O57,O59))","v":"SPF 2"},"V"]