{"text_format":"1","workbook":"xlsx","n_sheets":8,"sheets":["Calendrier BG","Cls BG","Calendrier MG","Cls MG","Classements","Indispos profs","Listing profs","Installations"],"not_rendered":{"charts":0,"images":0,"macros":0,"external_links":0,"defined_names":1,"comments":0,"pivot_tables":0},"unopened":[],"bounds":{"document_bytes":16777216,"sheet_cells":100000,"rows_first":2000,"rows_last":500,"rows_between":2000,"halvings":0,"cell_chars":16384,"cell_head_chars":4096},"cells_cut":0,"cells_raw":0,"read":"whole","date_system":"1900"}

{"sheet":"Calendrier BG","index":0,"n_rows":42,"n_cols":15,"rows_kept":42,"cut":false,"hidden":false,"merged":[[2,0,5,0],[7,4,8,4],[15,1,17,7],[37,4,41,4],[11,4,13,4],[23,1,23,7],[27,1,27,7],[19,1,19,7],[15,8,17,8],[7,8,9,8],[11,8,13,8],[27,8,31,8],[37,8,41,8],[10,0,13,0],[14,1,14,8],[32,1,32,8],[23,8,25,8],[26,0,31,0],[22,0,25,0],[22,1,22,8],[26,1,26,8],[32,0,35,0],[33,8,35,8],[14,0,17,0],[18,1,18,8],[18,0,21,0],[0,10,0,17],[1,10,1,11],[10,1,10,8],[2,10,2,11],[6,1,6,8],[2,1,2,8],[0,1,0,8],[10,13,10,14],[1,6,1,7],[3,4,5,4],[6,0,9,0],[36,0,41,0],[36,1,36,8]]}
[null," CALENDRIER BENJAMINS ",null,null,null,null,null,null,null,null,"POULES ET MATCHS BENJAMINS"]
["Date","Match","Equipe A","Equipe B","Lieux","Horaires","Résultats",null,"Indisponibilités",null,"DIVISION 1"]
["2 dec","DIVISION 1",null,null,null,null,null,null,null,null,"Etablissements",null,null,"Dates d'occupation de STAN par le Badminton"]
[null,6,{"$f":"VLOOKUP($B4,$K$11:$O$30,4)","v":"NDS 1"},{"$f":"VLOOKUP($B4,$K$11:$O$30,5)","v":"NDS 2"},"NDS","13h30",{"$f":"IFERROR(VLOOKUP($B4,'Cls BG'!$A$3:$G$33,4,FALSE),\"\")","v":0},{"$f":"IFERROR(VLOOKUP($B4,'Cls BG'!$A$3:$G$33,5,FALSE),\"\")","v":0},null,null,1,"AM",null,"16 dec"]
[null,3,"NDS 2","SVI",null,"14h30",{"$f":"IFERROR(VLOOKUP($B5,'Cls BG'!$A$3:$G$33,4,FALSE),\"\")","v":0},{"$f":"IFERROR(VLOOKUP($B5,'Cls BG'!$A$3:$G$33,5,FALSE),\"\")","v":0},null,null,2,"NDS 1",null,"2020-01-27"]
[null,11,"NDS 1","SVI",null,"15h30",{"$f":"IFERROR(VLOOKUP($B6,'Cls BG'!$A$3:$G$33,4,FALSE),\"\")","v":0},{"$f":"IFERROR(VLOOKUP($B6,'Cls BG'!$A$3:$G$33,5,FALSE),\"\")","v":0},null,null,3,"NDS 2",null,"10 fev"]
["9 dec","DIVISION 1",null,null,null,null,null,null,null,null,4,"SVI",null,"2020-03-03"]
[null,15,"SVI","NDS 3","NDS","13h30",{"$f":"IFERROR(VLOOKUP($B8,'Cls BG'!$A$3:$G$33,4,FALSE),\"\")","v":0},{"$f":"IFERROR(VLOOKUP($B8,'Cls BG'!$A$3:$G$33,5,FALSE),\"\")","v":0},null,null,5,"NDS 3"]
[null,8,"NDS 2","NDS 3",null,"14h30",{"$f":"IFERROR(VLOOKUP($B9,'Cls BG'!$A$3:$G$33,4,FALSE),\"\")","v":0},{"$f":"IFERROR(VLOOKUP($B9,'Cls BG'!$A$3:$G$33,5,FALSE),\"\")","v":0},null,null,6,null,null,"Territoire MG 24 mars et MF 10 mars"]
[]
["16 dec","DIVISION 1",null,null,null,null,null,null,null,null,"N° Match","Equipe A","Equipe B","Match"]
[null,10,{"$f":"VLOOKUP($B12,$K$11:$O$30,4)","v":"AM"},{"$f":"VLOOKUP($B12,$K$11:$O$30,5)","v":"NDS 2"},"NDS","14h30",{"$f":"IFERROR(VLOOKUP($B12,'Cls BG'!$A$3:$G$33,4,FALSE),\"\")","v":0},{"$f":"IFERROR(VLOOKUP($B12,'Cls BG'!$A$3:$G$33,5,FALSE),\"\")","v":0},"Gymn STAN Pas dispo / STAN pas dispo",null,1,1,6,{"$f":"VLOOKUP(L12,$K$2:$L$9,2)","v":"AM"},{"$f":"VLOOKUP(M12,$K$2:$L$9,2)","v":0}]
[null,13,"AM","NDS 1",null,"15h30",{"$f":"IFERROR(VLOOKUP($B13,'Cls BG'!$A$3:$G$33,4,FALSE),\"\")","v":0},{"$f":"IFERROR(VLOOKUP($B13,'Cls BG'!$A$3:$G$33,5,FALSE),\"\")","v":0},null,null,2,2,5,"NDS 1","NDS 3"]
[null,null,null,null,null,null,{"$f":"IFERROR(VLOOKUP($B14,'Cls BG'!$A$3:$G$33,4,FALSE),\"\")","v":""},{"$f":"IFERROR(VLOOKUP($B14,'Cls BG'!$A$3:$G$33,5,FALSE),\"\")","v":""},null,null,3,3,4,"NDS 2","SVI"]
["2020-01-06","DIVISION 1",null,null,null,null,null,null,null,null,4,1,5,"AM","NDS 3"]
[null,"ENTRAINEMENT",null,null,null,null,null,null,"STAN Pas dispo",null,5,4,6,"SVI",0]
[null,null,null,null,null,null,null,null,null,null,6,2,3,"NDS 1","NDS 2"]
[null,null,null,null,null,null,null,null,null,null,7,1,4,"AM","SVI"]
["2020-01-13","DIVISION 1",null,null,null,null,null,null,null,null,8,3,5,"NDS 2","NDS 3"]
[null,"TERRITOIRE CJF PROMO : STAN 1 et 2",null,null,null,null,null,null,null,null,9,2,6,"NDS 1",0]
[null,null,null,null,null,null,null,null,null,null,10,1,3,"AM","NDS 2"]
[null,null,null,null,null,null,null,null,null,null,11,2,4,"NDS 1","SVI"]
["2020-01-20","DIVISION 1",null,null,null,null,null,null,null,null,12,5,6,"NDS 3",0]
[null,"TERRITOIRE CG PROMO : STAN / AM",null,null,null,null,null,null,"STAN Pas dispo / AM au Territoire",null,13,1,2,"AM","NDS 1"]
[null,null,null,null,null,null,null,null,null,null,14,3,6,"NDS 2",0]
[null,null,null,null,null,null,null,null,null,null,15,4,5,"SVI","NDS 3"]
["2020-01-27","DIVISION 1",null,null,null,null,null,null,null,null,16,6,1,{"$f":"VLOOKUP(L27,$K$2:$L$9,2)","v":0},"AM"]
[null,"TERRITOIRE JG PROMO : AM",null,null,null,null,null,null,"Gymn STAN Pas dispo / STAN pas dispo / AM au Territoire",null,17,5,2,{"$f":"VLOOKUP(L28,$K$2:$L$9,2)","v":"NDS 3"},{"$f":"VLOOKUP(M28,$K$2:$L$9,2)","v":"NDS 1"}]
[null,null,{"$f":"VLOOKUP($B29,$K$11:$O$40,4)","v":{"$error":"#N/A"}},{"$f":"VLOOKUP($B29,$K$11:$O$40,5)","v":{"$error":"#N/A"}},null,null,{"$f":"IFERROR(VLOOKUP($B29,'Cls BG'!$A$3:$G$33,4,FALSE),\"\")","v":""},{"$f":"IFERROR(VLOOKUP($B29,'Cls BG'!$A$3:$G$33,5,FALSE),\"\")","v":""},null,null,18,4,3,"SVI","NDS 2"]
[null,null,{"$error":"#N/A"},{"$error":"#N/A"},null,null,{"$f":"IFERROR(VLOOKUP($B30,'Cls BG'!$A$3:$G$33,4,FALSE),\"\")","v":""},{"$f":"IFERROR(VLOOKUP($B30,'Cls BG'!$A$3:$G$33,5,FALSE),\"\")","v":""},null,null,19,5,1,"NDS 3","AM"]
[null,null,{"$error":"#N/A"},{"$error":"#N/A"},null,null,{"$f":"IFERROR(VLOOKUP($B31,'Cls BG'!$A$3:$G$33,4,FALSE),\"\")","v":""},{"$f":"IFERROR(VLOOKUP($B31,'Cls BG'!$A$3:$G$33,5,FALSE),\"\")","v":""},null,null,20,6,4,0,"SVI"]
[null,null,{"$error":"#N/A"},{"$error":"#N/A"},null,null,{"$f":"IFERROR(VLOOKUP($B32,'Cls BG'!$A$3:$G$33,4,FALSE),\"\")","v":""},{"$f":"IFERROR(VLOOKUP($B32,'Cls BG'!$A$3:$G$33,5,FALSE),\"\")","v":""},null,null,21,3,2,"NDS 2","NDS 1"]
["3 fev","DIVISION 1",null,null,null,null,null,null,null,null,22,4,1,"SVI","AM"]
[null,null,null,null,null,null,null,null,null,null,23,5,3,"NDS 3","NDS 2"]
[null,null,null,null,null,null,null,null,null,null,24,6,2,0,"NDS 1"]
[null,null,null,null,null,null,null,null,null,null,25,3,1,"NDS 2","AM"]
["10 fev","DIVISION 1",null,null,null,null,null,null,null,null,26,4,2,"SVI","NDS 1"]
[null,null,{"$f":"VLOOKUP($B38,$K$11:$O$40,4)","v":{"$error":"#N/A"}},{"$f":"VLOOKUP($B38,$K$11:$O$40,5)","v":{"$error":"#N/A"}},"NDS",null,null,null,"Gymn STAN Pas dispo",null,27,6,5,0,"NDS 3"]
[null,null,{"$f":"VLOOKUP($B39,$K$11:$O$40,4)","v":{"$error":"#N/A"}},{"$f":"VLOOKUP($B39,$K$11:$O$40,5)","v":{"$error":"#N/A"}},null,null,null,null,null,null,28,2,1,"NDS 1","AM"]
[null,null,{"$error":"#N/A"},{"$error":"#N/A"},null,null,null,null,null,null,29,6,3,0,"NDS 2"]
[null,null,{"$error":"#N/A"},{"$error":"#N/A"},null,null,null,null,null,null,30,5,4,{"$f":"VLOOKUP(L41,$K$2:$L$9,2)","v":"NDS 3"},{"$f":"VLOOKUP(M41,$K$2:$L$9,2)","v":"SVI"}]
[null,null,{"$error":"#N/A"},{"$error":"#N/A"}]

{"sheet":"Cls BG","index":1,"n_rows":33,"n_cols":20,"rows_kept":33,"cut":false,"hidden":false,"merged":[[2,3,2,4],[0,0,1,6]]}
["BENJAMINS DIVISION 1 "]
[]
["N° Match","Equipe A","Equipe B","Scores",null,"Vainqueur","Perdant",null,null,"SIGLE","Etablissement","Matchs joués","Victoires","Nuls","Défaites","Buts Pour","Buts Contre","Différence","Points"]
[1,{"$f":"'Calendrier BG'!N12","v":"AM"},{"$f":"'Calendrier BG'!O12","v":0},null,null,{"$f":"IF(D4<>\"\",IF(D4>E4,B4,IF(D4<E4,C4,\"nul\")),\"\")","v":""},{"$f":"IF(E4<>\"\",IF(E4<D4,C4,IF(E4>D4,B4,\"nul\")),\"\")","v":""},null,{"$f":"RANK(T4,$T$4:$T$9)","v":1},"AM","Albert de Mun",{"$f":"COUNT(D4,D8,D10,D13,D16,E19,E22,E25,E28,E31)","v":0},{"$f":"COUNTIF($F$3:$F$33,J4)","v":0},{"$f":"L4-M4-O4","v":0},{"$f":"COUNTIF(G3:G33,J4)","v":0},{"$f":"SUM(D4,D8,D10,D13,D16,E19,E22,E25,E28,E31)","v":0},{"$f":"SUM(E4,E8,E10,E13,E16,D19,D22,D25,D28,D31)","v":0},{"$f":"P4-Q4","v":0},{"$f":"M4*3+O4*1","v":0},{"$f":"SUM(S4*1000000+R4*10000+P4*100+L4*10)","v":0}]
[2,{"$f":"'Calendrier BG'!N13","v":"NDS 1"},{"$f":"'Calendrier BG'!O13","v":"NDS 3"},null,null,{"$f":"IF(D5<>\"\",IF(D5>E5,B5,IF(D5<E5,C5,\"nul\")),\"\")","v":""},{"$f":"IF(E5<>\"\",IF(E5<D5,C5,IF(E5>D5,B5,\"nul\")),\"\")","v":""},null,{"$f":"RANK(T5,$T$4:$T$9)","v":1},"NDS 1","Notre Dame de Sion 1",{"$f":"COUNT(D5,D9,D12,D14,E16,E20,E24,E27,E29,D31)","v":0},0,{"$f":"L5-M5-O5","v":0},0,{"$f":"SUM(D5,D9,D12,D14,E16,E20,E24,E27,E29,D31)","v":0},{"$f":"SUM(E5,E9,E12,E14,D16,D20,D24,D27,D29,E31)","v":0},{"$f":"P5-Q5","v":0},{"$f":"M5*3+O5*1","v":0},0]
[3,{"$f":"'Calendrier BG'!N14","v":"NDS 2"},{"$f":"'Calendrier BG'!O14","v":"SVI"},null,null,"","",null,1,"NDS 2","Notre Dame de Sion 2",{"$f":"COUNT(D6,E9,D11,E13,D17,E21,D24,E26,D28,E32)","v":0},0,0,0,{"$f":"SUM(D6,E9,D11,E13,D17,E21,D24,E26,D28,E32)","v":0},{"$f":"SUM(E6,D9,E11,D13,E17,D21,E24,D26,E28,D32)","v":0},0,0,0]
[4,{"$f":"'Calendrier BG'!N15","v":"AM"},{"$f":"'Calendrier BG'!O15","v":"NDS 3"},null,null,"","",null,1,"SVI","Saint Vincent ",{"$f":"COUNT(E6,D8,E10,E14,D18,D21,E23,D25,D29,E33)","v":0},0,0,0,{"$f":"SUM(E6,D8,E10,E14,D18,D21,E23,D25,D29,E33)","v":0},{"$f":"SUM(D6,E8,D10,D14,E18,E21,D23,E25,E29,D33)","v":0},0,0,0]
[5,{"$f":"'Calendrier BG'!N16","v":"SVI"},{"$f":"'Calendrier BG'!O16","v":0},null,null,"","",null,1,"NDS 3 ","Notre Dame de Sion 3",{"$f":"COUNT(E5,E7,E11,D15,E18,D20,D22,D26,E30,D33)","v":0},0,0,0,{"$f":"SUM(E5,E7,E11,D15,E18,D20,D22,D26,E30,D33)","v":0},{"$f":"SUM(D5,D7,D11,E15,D18,E20,E22,E26,D30,E33)","v":0},0,0,0]
[6,{"$f":"'Calendrier BG'!N17","v":"NDS 1"},{"$f":"'Calendrier BG'!O17","v":"NDS 2"},null,null,"","",null,1,null,"Saint Vincent 2",{"$f":"COUNT(E4,E8,E12,E15,E17,D19,D23,D27,D30,D32)","v":0},0,0,0,{"$f":"SUM(E4,E8,E12,E15,E17,D19,D23,D27,D30,D32)","v":0},{"$f":"SUM(D4,D8,D12,D15,D17,E19,E23,E27,E30,E32)","v":0},0,0,0]
[7,{"$f":"'Calendrier BG'!N18","v":"AM"},{"$f":"'Calendrier BG'!O18","v":"SVI"},null,null,"",""]
[8,{"$f":"'Calendrier BG'!N19","v":"NDS 2"},{"$f":"'Calendrier BG'!O19","v":"NDS 3"},null,null,"",""]
[9,{"$f":"'Calendrier BG'!N20","v":"NDS 1"},{"$f":"'Calendrier BG'!O20","v":0},null,null,{"$f":"IF(D12<>\"\",IF(D12>E12,B12,IF(D12<E12,C12,\"nul\")),\"\")","v":""},"",null,"Classement","SIGLE","Etablissement","Matchs joués","Victoires","Nuls","Défaites","Buts Pour","Buts Contre","Différence","Points"]
[10,{"$f":"'Calendrier BG'!N21","v":"AM"},{"$f":"'Calendrier BG'!O21","v":"NDS 2"},null,null,"","",null,1,{"$f":"VLOOKUP($I13,$I$3:$S$9,COLUMNS($J12:J12)+1,FALSE)","v":"AM"},{"$f":"VLOOKUP($I13,$I$3:$S$9,COLUMNS($J12:K12)+1,FALSE)","v":"Albert de Mun"},{"$f":"VLOOKUP($I13,$I$3:$S$9,COLUMNS($J12:L12)+1,FALSE)","v":0},{"$f":"VLOOKUP($I13,$I$3:$S$9,COLUMNS($J12:M12)+1,FALSE)","v":0},{"$f":"VLOOKUP($I13,$I$3:$S$9,COLUMNS($J12:N12)+1,FALSE)","v":0},{"$f":"VLOOKUP($I13,$I$3:$S$9,COLUMNS($J12:O12)+1,FALSE)","v":0},{"$f":"VLOOKUP($I13,$I$3:$S$9,COLUMNS($J12:P12)+1,FALSE)","v":0},{"$f":"VLOOKUP($I13,$I$3:$S$9,COLUMNS($J12:Q12)+1,FALSE)","v":0},{"$f":"VLOOKUP($I13,$I$3:$S$9,COLUMNS($J12:R12)+1,FALSE)","v":0},{"$f":"VLOOKUP($I13,$I$3:$S$9,COLUMNS($J12:S12)+1,FALSE)","v":0}]
[11,{"$f":"'Calendrier BG'!N22","v":"NDS 1"},{"$f":"'Calendrier BG'!O22","v":"SVI"},null,null,"","",null,2,{"$f":"VLOOKUP($I14,$I$3:$S$9,COLUMNS($J13:J13)+1,FALSE)","v":{"$error":"#N/A"}},{"$f":"VLOOKUP($I14,$I$3:$S$9,COLUMNS($J13:K13)+1,FALSE)","v":{"$error":"#N/A"}},{"$f":"VLOOKUP($I14,$I$3:$S$9,COLUMNS($J13:L13)+1,FALSE)","v":{"$error":"#N/A"}},{"$f":"VLOOKUP($I14,$I$3:$S$9,COLUMNS($J13:M13)+1,FALSE)","v":{"$error":"#N/A"}},{"$f":"VLOOKUP($I14,$I$3:$S$9,COLUMNS($J13:N13)+1,FALSE)","v":{"$error":"#N/A"}},{"$f":"VLOOKUP($I14,$I$3:$S$9,COLUMNS($J13:O13)+1,FALSE)","v":{"$error":"#N/A"}},{"$f":"VLOOKUP($I14,$I$3:$S$9,COLUMNS($J13:P13)+1,FALSE)","v":{"$error":"#N/A"}},{"$f":"VLOOKUP($I14,$I$3:$S$9,COLUMNS($J13:Q13)+1,FALSE)","v":{"$error":"#N/A"}},{"$f":"VLOOKUP($I14,$I$3:$S$9,COLUMNS($J13:R13)+1,FALSE)","v":{"$error":"#N/A"}},{"$f":"VLOOKUP($I14,$I$3:$S$9,COLUMNS($J13:S13)+1,FALSE)","v":{"$error":"#N/A"}}]
[12,{"$f":"'Calendrier BG'!N23","v":"NDS 3"},{"$f":"'Calendrier BG'!O23","v":0},null,null,"","",null,3,{"$f":"VLOOKUP($I15,$I$3:$S$9,COLUMNS($J14:J14)+1,FALSE)","v":{"$error":"#N/A"}},{"$f":"VLOOKUP($I15,$I$3:$S$9,COLUMNS($J14:K14)+1,FALSE)","v":{"$error":"#N/A"}},{"$f":"VLOOKUP($I15,$I$3:$S$9,COLUMNS($J14:L14)+1,FALSE)","v":{"$error":"#N/A"}},{"$f":"VLOOKUP($I15,$I$3:$S$9,COLUMNS($J14:M14)+1,FALSE)","v":{"$error":"#N/A"}},{"$f":"VLOOKUP($I15,$I$3:$S$9,COLUMNS($J14:N14)+1,FALSE)","v":{"$error":"#N/A"}},{"$f":"VLOOKUP($I15,$I$3:$S$9,COLUMNS($J14:O14)+1,FALSE)","v":{"$error":"#N/A"}},{"$f":"VLOOKUP($I15,$I$3:$S$9,COLUMNS($J14:P14)+1,FALSE)","v":{"$error":"#N/A"}},{"$f":"VLOOKUP($I15,$I$3:$S$9,COLUMNS($J14:Q14)+1,FALSE)","v":{"$error":"#N/A"}},{"$f":"VLOOKUP($I15,$I$3:$S$9,COLUMNS($J14:R14)+1,FALSE)","v":{"$error":"#N/A"}},{"$f":"VLOOKUP($I15,$I$3:$S$9,COLUMNS($J14:S14)+1,FALSE)","v":{"$error":"#N/A"}}]
[13,{"$f":"'Calendrier BG'!N24","v":"AM"},{"$f":"'Calendrier BG'!O24","v":"NDS 1"},null,null,"","",null,4,{"$f":"VLOOKUP($I16,$I$3:$S$9,COLUMNS($J15:J15)+1,FALSE)","v":{"$error":"#N/A"}},{"$f":"VLOOKUP($I16,$I$3:$S$9,COLUMNS($J15:K15)+1,FALSE)","v":{"$error":"#N/A"}},{"$f":"VLOOKUP($I16,$I$3:$S$9,COLUMNS($J15:L15)+1,FALSE)","v":{"$error":"#N/A"}},{"$f":"VLOOKUP($I16,$I$3:$S$9,COLUMNS($J15:M15)+1,FALSE)","v":{"$error":"#N/A"}},{"$f":"VLOOKUP($I16,$I$3:$S$9,COLUMNS($J15:N15)+1,FALSE)","v":{"$error":"#N/A"}},{"$f":"VLOOKUP($I16,$I$3:$S$9,COLUMNS($J15:O15)+1,FALSE)","v":{"$error":"#N/A"}},{"$f":"VLOOKUP($I16,$I$3:$S$9,COLUMNS($J15:P15)+1,FALSE)","v":{"$error":"#N/A"}},{"$f":"VLOOKUP($I16,$I$3:$S$9,COLUMNS($J15:Q15)+1,FALSE)","v":{"$error":"#N/A"}},{"$f":"VLOOKUP($I16,$I$3:$S$9,COLUMNS($J15:R15)+1,FALSE)","v":{"$error":"#N/A"}},{"$f":"VLOOKUP($I16,$I$3:$S$9,COLUMNS($J15:S15)+1,FALSE)","v":{"$error":"#N/A"}}]
[14,{"$f":"'Calendrier BG'!N25","v":"NDS 2"},{"$f":"'Calendrier BG'!O25","v":0},null,null,"","",null,5,{"$f":"VLOOKUP($I17,$I$3:$S$9,COLUMNS($J16:J16)+1,FALSE)","v":{"$error":"#N/A"}},{"$f":"VLOOKUP($I17,$I$3:$S$9,COLUMNS($J16:K16)+1,FALSE)","v":{"$error":"#N/A"}},{"$f":"VLOOKUP($I17,$I$3:$S$9,COLUMNS($J16:L16)+1,FALSE)","v":{"$error":"#N/A"}},{"$f":"VLOOKUP($I17,$I$3:$S$9,COLUMNS($J16:M16)+1,FALSE)","v":{"$error":"#N/A"}},{"$f":"VLOOKUP($I17,$I$3:$S$9,COLUMNS($J16:N16)+1,FALSE)","v":{"$error":"#N/A"}},{"$f":"VLOOKUP($I17,$I$3:$S$9,COLUMNS($J16:O16)+1,FALSE)","v":{"$error":"#N/A"}},{"$f":"VLOOKUP($I17,$I$3:$S$9,COLUMNS($J16:P16)+1,FALSE)","v":{"$error":"#N/A"}},{"$f":"VLOOKUP($I17,$I$3:$S$9,COLUMNS($J16:Q16)+1,FALSE)","v":{"$error":"#N/A"}},{"$f":"VLOOKUP($I17,$I$3:$S$9,COLUMNS($J16:R16)+1,FALSE)","v":{"$error":"#N/A"}},{"$f":"VLOOKUP($I17,$I$3:$S$9,COLUMNS($J16:S16)+1,FALSE)","v":{"$error":"#N/A"}}]
[15,{"$f":"'Calendrier BG'!N26","v":"SVI"},{"$f":"'Calendrier BG'!O26","v":"NDS 3"},null,null,"","",null,6,{"$f":"VLOOKUP($I18,$I$3:$S$9,COLUMNS($J17:J17)+1,FALSE)","v":{"$error":"#N/A"}},{"$f":"VLOOKUP($I18,$I$3:$S$9,COLUMNS($J17:K17)+1,FALSE)","v":{"$error":"#N/A"}},{"$f":"VLOOKUP($I18,$I$3:$S$9,COLUMNS($J17:L17)+1,FALSE)","v":{"$error":"#N/A"}},{"$f":"VLOOKUP($I18,$I$3:$S$9,COLUMNS($J17:M17)+1,FALSE)","v":{"$error":"#N/A"}},{"$f":"VLOOKUP($I18,$I$3:$S$9,COLUMNS($J17:N17)+1,FALSE)","v":{"$error":"#N/A"}},{"$f":"VLOOKUP($I18,$I$3:$S$9,COLUMNS($J17:O17)+1,FALSE)","v":{"$error":"#N/A"}},{"$f":"VLOOKUP($I18,$I$3:$S$9,COLUMNS($J17:P17)+1,FALSE)","v":{"$error":"#N/A"}},{"$f":"VLOOKUP($I18,$I$3:$S$9,COLUMNS($J17:Q17)+1,FALSE)","v":{"$error":"#N/A"}},{"$f":"VLOOKUP($I18,$I$3:$S$9,COLUMNS($J17:R17)+1,FALSE)","v":{"$error":"#N/A"}},{"$f":"VLOOKUP($I18,$I$3:$S$9,COLUMNS($J17:S17)+1,FALSE)","v":{"$error":"#N/A"}}]
[16,{"$f":"'Calendrier BG'!N27","v":0},{"$f":"'Calendrier BG'!O27","v":"AM"},null,null,"",""]
[17,{"$f":"'Calendrier BG'!N28","v":"NDS 3"},{"$f":"'Calendrier BG'!O28","v":"NDS 1"},null,null,"",""]
[18,{"$f":"'Calendrier BG'!N29","v":"SVI"},{"$f":"'Calendrier BG'!O29","v":"NDS 2"},null,null,"",""]
[19,{"$f":"'Calendrier BG'!N30","v":"NDS 3"},{"$f":"'Calendrier BG'!O30","v":"AM"},null,null,"",""]
[20,{"$f":"'Calendrier BG'!N31","v":0},{"$f":"'Calendrier BG'!O31","v":"SVI"},null,null,"",""]
[21,{"$f":"'Calendrier BG'!N32","v":"NDS 2"},{"$f":"'Calendrier BG'!O32","v":"NDS 1"},null,null,"",""]
[22,{"$f":"'Calendrier BG'!N33","v":"SVI"},{"$f":"'Calendrier BG'!O33","v":"AM"},null,null,"",""]
[23,{"$f":"'Calendrier BG'!N34","v":"NDS 3"},{"$f":"'Calendrier BG'!O34","v":"NDS 2"},null,null,"",""]
[24,{"$f":"'Calendrier BG'!N35","v":0},{"$f":"'Calendrier BG'!O35","v":"NDS 1"},null,null,"",""]
[25,{"$f":"'Calendrier BG'!N36","v":"NDS 2"},{"$f":"'Calendrier BG'!O36","v":"AM"},null,null,"",""]
[26,{"$f":"'Calendrier BG'!N37","v":"SVI"},{"$f":"'Calendrier BG'!O37","v":"NDS 1"},null,null,"",""]
[27,{"$f":"'Calendrier BG'!N38","v":0},{"$f":"'Calendrier BG'!O38","v":"NDS 3"},null,null,"",""]
[28,{"$f":"'Calendrier BG'!N39","v":"NDS 1"},{"$f":"'Calendrier BG'!O39","v":"AM"},null,null,"",""]
[29,{"$f":"'Calendrier BG'!N40","v":0},{"$f":"'Calendrier BG'!O40","v":"NDS 2"},null,null,"",""]
[30,{"$f":"'Calendrier BG'!N41","v":"NDS 3"},{"$f":"'Calendrier BG'!O41","v":"SVI"},null,null,"",""]

{"sheet":"Calendrier MG","index":2,"n_rows":48,"n_cols":15,"rows_kept":48,"cut":false,"hidden":false,"merged":[[9,0,15,0],[21,1,23,7],[9,1,9,8],[16,0,19,0],[16,1,16,8],[17,4,19,4],[17,8,19,8],[20,0,23,0],[20,1,20,8],[21,8,23,8],[24,0,27,0],[25,1,25,7],[28,0,31,0],[28,1,28,8],[29,1,29,7],[29,8,31,8],[32,0,37,0],[32,1,32,8],[33,1,33,7],[33,8,37,8],[2,0,8,0],[0,10,0,27],[1,10,1,11],[2,10,2,11],[12,13,12,14],[3,4,6,4],[1,6,1,7],[2,1,2,8],[0,1,0,8],[7,4,8,4],[10,4,11,4],[12,4,15,4],[24,1,24,8],[38,0,41,0],[38,1,38,8],[39,8,41,8],[42,0,47,0],[42,1,42,8],[43,4,47,4],[43,8,47,8]]}
[null," CALENDRIER MINIMES",null,null,null,null,null,null,null,null,"POULES ET MATCHS MINIMES"]
["Date","Match","Equipe A","Equipe B","Lieux","Horaires","Résultats",null,"Indisponibilités",null,"DIVISION 1"]
["2 dec","DIVISION 1",null,null,null,null,null,null,null,null,"Etablissements",null,null,"Dates d'occupation de STAN par le Badminton"]
[null,5,{"$f":"VLOOKUP($B4,$K$13:$O$41,4)","v":"STAN 1"},{"$f":"VLOOKUP($B4,$K$13:$O$41,5)","v":"AM"},"STAN","14h30",{"$f":"IFERROR(VLOOKUP($B4,'Cls MG'!$A$3:$G$31,4,FALSE),\"\")","v":0},{"$f":"IFERROR(VLOOKUP($B4,'Cls MG'!$A$3:$G$31,5,FALSE),\"\")","v":0},null,null,1,"STAN 1",null,"16 dec"]
[null,10,"AM",{"$f":"VLOOKUP($B5,$K$13:$O$41,5)","v":"STAN 2"},null,"15h30",{"$f":"IFERROR(VLOOKUP($B5,'Cls MG'!$A$3:$G$31,4,FALSE),\"\")","v":0},{"$f":"IFERROR(VLOOKUP($B5,'Cls MG'!$A$3:$G$31,5,FALSE),\"\")","v":0},null,null,2,"STAN 2",null,"2020-01-27"]
[null,"CG","STAN","AM",null,"15h",null,null,null,null,3,"AM",null,"10 fev"]
[null,1,"STAN 1","STAN 2",null,"16h",{"$f":"IFERROR(VLOOKUP($B7,'Cls MG'!$A$3:$G$31,4,FALSE),\"\")","v":0},{"$f":"IFERROR(VLOOKUP($B7,'Cls MG'!$A$3:$G$31,5,FALSE),\"\")","v":0},null,null,4,"NDS 1",null,"2020-03-03"]
[null,7,"NDS 2","SVI","NDS","14h",{"$f":"IFERROR(VLOOKUP($B8,'Cls MG'!$A$3:$G$31,4,FALSE),\"\")","v":0},{"$f":"IFERROR(VLOOKUP($B8,'Cls MG'!$A$3:$G$31,5,FALSE),\"\")","v":0},null,null,5,"NDS 2"]
[null,28,"NDS 1","SVI",null,"15h",{"$f":"IFERROR(VLOOKUP($B9,'Cls MG'!$A$3:$G$31,4,FALSE),\"\")","v":0},{"$f":"IFERROR(VLOOKUP($B9,'Cls MG'!$A$3:$G$31,5,FALSE),\"\")","v":0},null,null,6,"NDS 3",null,"Territoire MG 24 mars et MF 10 mars"]
["9 dec","DIVISION 1",null,null,null,null,null,null,null,null,7,"SVI"]
[null,12,"SVI","NDS 3","NDS","14h",{"$f":"IFERROR(VLOOKUP($B11,'Cls MG'!$A$3:$G$31,4,FALSE),\"\")","v":0},{"$f":"IFERROR(VLOOKUP($B11,'Cls MG'!$A$3:$G$31,5,FALSE),\"\")","v":0},null,null,8]
[null,"MF","NDS","SVI",null,"15h"]
[null,6,"STAN 2","NDS 1","STAN","14h30",{"$f":"IFERROR(VLOOKUP($B13,'Cls MG'!$A$3:$G$31,4,FALSE),\"\")","v":0},{"$f":"IFERROR(VLOOKUP($B13,'Cls MG'!$A$3:$G$31,5,FALSE),\"\")","v":0},null,null,"N° Match","Equipe A","Equipe B","Match"]
[null,13,"STAN 1","NDS 2",null,"15h",{"$f":"IFERROR(VLOOKUP($B14,'Cls MG'!$A$3:$G$31,4,FALSE),\"\")","v":0},{"$f":"IFERROR(VLOOKUP($B14,'Cls MG'!$A$3:$G$31,5,FALSE),\"\")","v":0},null,null,1,1,2,{"$f":"VLOOKUP(L14,$K$2:$L$11,2)","v":"STAN 1"},{"$f":"VLOOKUP(M14,$K$2:$L$11,2)","v":"STAN 2"}]
[null,26,"STAN 2","NDS 2",null,"15h30",{"$f":"IFERROR(VLOOKUP($B15,'Cls MG'!$A$3:$G$31,4,FALSE),\"\")","v":0},{"$f":"IFERROR(VLOOKUP($B15,'Cls MG'!$A$3:$G$31,5,FALSE),\"\")","v":0},null,null,2,3,4,{"$f":"VLOOKUP(L15,$K$2:$L$11,2)","v":"AM"},{"$f":"VLOOKUP(M15,$K$2:$L$11,2)","v":"NDS 1"}]
[null,9,"NDS 1","STAN 1",null,"16h",{"$f":"IFERROR(VLOOKUP($B16,'Cls MG'!$A$3:$G$31,4,FALSE),\"\")","v":0},{"$f":"IFERROR(VLOOKUP($B16,'Cls MG'!$A$3:$G$31,5,FALSE),\"\")","v":0},null,null,3,5,6,{"$f":"VLOOKUP(L16,$K$2:$L$11,2)","v":"NDS 2"},{"$f":"VLOOKUP(M16,$K$2:$L$11,2)","v":"NDS 3"}]
["16 dec","DIVISION 1",null,null,null,null,null,null,null,null,4,7,8,{"$f":"VLOOKUP(L17,$K$2:$L$11,2)","v":"SVI"},{"$f":"VLOOKUP(M17,$K$2:$L$11,2)","v":0}]
[null,2,{"$f":"VLOOKUP($B18,$K$13:$O$41,4)","v":"AM"},{"$f":"VLOOKUP($B18,$K$13:$O$41,5)","v":"NDS 1"},"NDS","14h",{"$f":"IFERROR(VLOOKUP($B18,'Cls MG'!$A$3:$G$31,4,FALSE),\"\")","v":0},{"$f":"IFERROR(VLOOKUP($B18,'Cls MG'!$A$3:$G$31,5,FALSE),\"\")","v":0},"Gymn STAN Pas dispo / STAN pas dispo",null,5,1,3,{"$f":"VLOOKUP(L18,$K$2:$L$11,2)","v":"STAN 1"},{"$f":"VLOOKUP(M18,$K$2:$L$11,2)","v":"AM"}]
[null,23,"AM","NDS 2",null,"15h",{"$f":"IFERROR(VLOOKUP($B19,'Cls MG'!$A$3:$G$31,4,FALSE),\"\")","v":0},{"$f":"IFERROR(VLOOKUP($B19,'Cls MG'!$A$3:$G$31,5,FALSE),\"\")","v":0},null,null,6,2,4,{"$f":"VLOOKUP(L19,$K$2:$L$11,2)","v":"STAN 2"},{"$f":"VLOOKUP(M19,$K$2:$L$11,2)","v":"NDS 1"}]
[null,null,null,null,null,null,{"$f":"IFERROR(VLOOKUP($B20,'Cls MG'!$A$3:$G$31,4,FALSE),\"\")","v":""},{"$f":"IFERROR(VLOOKUP($B20,'Cls MG'!$A$3:$G$31,5,FALSE),\"\")","v":""},null,null,7,5,7,{"$f":"VLOOKUP(L20,$K$2:$L$11,2)","v":"NDS 2"},{"$f":"VLOOKUP(M20,$K$2:$L$11,2)","v":"SVI"}]
["2020-01-06","DIVISION 1",null,null,null,null,null,null,null,null,8,6,8,{"$f":"VLOOKUP(L21,$K$2:$L$11,2)","v":"NDS 3"},{"$f":"VLOOKUP(M21,$K$2:$L$11,2)","v":0}]
[null,"ENTRAINEMENT",null,null,null,null,null,null,"STAN Pas dispo",null,9,4,1,{"$f":"VLOOKUP(L22,$K$2:$L$11,2)","v":"NDS 1"},{"$f":"VLOOKUP(M22,$K$2:$L$11,2)","v":"STAN 1"}]
[null,null,null,null,null,null,null,null,null,null,10,3,2,{"$f":"VLOOKUP(L23,$K$2:$L$11,2)","v":"AM"},{"$f":"VLOOKUP(M23,$K$2:$L$11,2)","v":"STAN 2"}]
[null,null,null,null,null,null,null,null,null,null,11,8,5,{"$f":"VLOOKUP(L24,$K$2:$L$11,2)","v":0},{"$f":"VLOOKUP(M24,$K$2:$L$11,2)","v":"NDS 2"}]
["2020-01-13","DIVISION 1",null,null,null,null,null,null,null,null,12,7,6,{"$f":"VLOOKUP(L25,$K$2:$L$11,2)","v":"SVI"},{"$f":"VLOOKUP(M25,$K$2:$L$11,2)","v":"NDS 3"}]
[null,"TERRITOIRE CJF PROMO : STAN 1 et 2",null,null,null,null,null,null,null,null,13,1,5,{"$f":"VLOOKUP(L26,$K$2:$L$11,2)","v":"STAN 1"},{"$f":"VLOOKUP(M26,$K$2:$L$11,2)","v":"NDS 2"}]
[null,null,{"$f":"VLOOKUP($B27,$K$13:$O$41,4)","v":{"$error":"#N/A"}},{"$f":"VLOOKUP($B27,$K$13:$O$41,5)","v":{"$error":"#N/A"}},null,null,{"$f":"IFERROR(VLOOKUP($B27,'Cls MG'!$A$3:$G$23,4,FALSE),\"\")","v":""},{"$f":"IFERROR(VLOOKUP($B27,'Cls MG'!$A$3:$G$23,5,FALSE),\"\")","v":""},null,null,14,2,6,{"$f":"VLOOKUP(L27,$K$2:$L$11,2)","v":"STAN 2"},{"$f":"VLOOKUP(M27,$K$2:$L$11,2)","v":"NDS 3"}]
[null,null,{"$f":"VLOOKUP($B28,$K$13:$O$41,4)","v":{"$error":"#N/A"}},{"$error":"#N/A"},null,null,{"$f":"IFERROR(VLOOKUP($B28,'Cls MG'!$A$3:$G$23,4,FALSE),\"\")","v":""},{"$f":"IFERROR(VLOOKUP($B28,'Cls MG'!$A$3:$G$23,5,FALSE),\"\")","v":""},null,null,15,3,7,{"$f":"VLOOKUP(L28,$K$2:$L$11,2)","v":"AM"},{"$f":"VLOOKUP(M28,$K$2:$L$11,2)","v":"SVI"}]
["2020-01-20","DIVISION 1",null,null,null,null,null,null,null,null,16,4,8,{"$f":"VLOOKUP(L29,$K$2:$L$11,2)","v":"NDS 1"},{"$f":"VLOOKUP(M29,$K$2:$L$11,2)","v":0}]
[null,"TERRITOIRE CG PROMO : STAN / AM",null,null,null,null,null,null,"STAN Pas dispo / AM au Territoire",null,17,1,6,{"$f":"VLOOKUP(L30,$K$2:$L$11,2)","v":"STAN 1"},{"$f":"VLOOKUP(M30,$K$2:$L$11,2)","v":"NDS 3"}]
[null,null,null,null,null,null,null,null,null,null,18,2,7,{"$f":"VLOOKUP(L31,$K$2:$L$11,2)","v":"STAN 2"},{"$f":"VLOOKUP(M31,$K$2:$L$11,2)","v":"SVI"}]
[null,null,null,null,null,null,null,null,null,null,19,3,8,{"$f":"VLOOKUP(L32,$K$2:$L$11,2)","v":"AM"},{"$f":"VLOOKUP(M32,$K$2:$L$11,2)","v":0}]
["2020-01-27","DIVISION 1",null,null,null,null,null,null,null,null,20,4,5,{"$f":"VLOOKUP(L33,$K$2:$L$11,2)","v":"NDS 1"},{"$f":"VLOOKUP(M33,$K$2:$L$11,2)","v":"NDS 2"}]
[null,"TERRITOIRE JG PROMO : AM",null,null,null,null,null,null,"Gymn STAN Pas dispo / STAN pas dispo / AM au Territoire",null,21,1,7,{"$f":"VLOOKUP(L34,$K$2:$L$11,2)","v":"STAN 1"},{"$f":"VLOOKUP(M34,$K$2:$L$11,2)","v":"SVI"}]
[null,null,{"$f":"VLOOKUP($B35,$K$13:$O$41,4)","v":{"$error":"#N/A"}},{"$f":"VLOOKUP($B35,$K$13:$O$41,5)","v":{"$error":"#N/A"}},null,null,{"$f":"IFERROR(VLOOKUP($B35,'Cls MG'!$A$3:$G$23,4,FALSE),\"\")","v":""},{"$f":"IFERROR(VLOOKUP($B35,'Cls MG'!$A$3:$G$23,5,FALSE),\"\")","v":""},null,null,22,2,8,{"$f":"VLOOKUP(L35,$K$2:$L$11,2)","v":"STAN 2"},{"$f":"VLOOKUP(M35,$K$2:$L$11,2)","v":0}]
[null,null,{"$error":"#N/A"},{"$error":"#N/A"},null,null,{"$f":"IFERROR(VLOOKUP($B36,'Cls MG'!$A$3:$G$23,4,FALSE),\"\")","v":""},{"$f":"IFERROR(VLOOKUP($B36,'Cls MG'!$A$3:$G$23,5,FALSE),\"\")","v":""},null,null,23,3,5,{"$f":"VLOOKUP(L36,$K$2:$L$11,2)","v":"AM"},{"$f":"VLOOKUP(M36,$K$2:$L$11,2)","v":"NDS 2"}]
[null,null,{"$error":"#N/A"},{"$error":"#N/A"},null,null,{"$f":"IFERROR(VLOOKUP($B37,'Cls MG'!$A$3:$G$23,4,FALSE),\"\")","v":""},{"$f":"IFERROR(VLOOKUP($B37,'Cls MG'!$A$3:$G$23,5,FALSE),\"\")","v":""},null,null,24,4,6,{"$f":"VLOOKUP(L37,$K$2:$L$11,2)","v":"NDS 1"},{"$f":"VLOOKUP(M37,$K$2:$L$11,2)","v":"NDS 3"}]
[null,null,{"$f":"VLOOKUP($B38,$K$13:$O$41,4)","v":{"$error":"#N/A"}},{"$error":"#N/A"},null,null,{"$f":"IFERROR(VLOOKUP($B38,'Cls MG'!$A$3:$G$23,4,FALSE),\"\")","v":""},{"$f":"IFERROR(VLOOKUP($B38,'Cls MG'!$A$3:$G$23,5,FALSE),\"\")","v":""},null,null,25,1,8,{"$f":"VLOOKUP(L38,$K$2:$L$11,2)","v":"STAN 1"},{"$f":"VLOOKUP(M38,$K$2:$L$11,2)","v":0}]
["3 fev","DIVISION 1",null,null,null,null,null,null,null,null,26,2,5,{"$f":"VLOOKUP(L39,$K$2:$L$11,2)","v":"STAN 2"},{"$f":"VLOOKUP(M39,$K$2:$L$11,2)","v":"NDS 2"}]
[null,null,null,null,null,null,null,null,null,null,27,3,6,{"$f":"VLOOKUP(L40,$K$2:$L$11,2)","v":"AM"},{"$f":"VLOOKUP(M40,$K$2:$L$11,2)","v":"NDS 3"}]
[null,null,null,null,null,null,null,null,null,null,28,4,7,{"$f":"VLOOKUP(L41,$K$2:$L$11,2)","v":"NDS 1"},{"$f":"VLOOKUP(M41,$K$2:$L$11,2)","v":"SVI"}]
[]
["10 fev","DIVISION 1"]
[null,null,{"$f":"VLOOKUP($B44,$K$11:$O$38,4)","v":{"$error":"#N/A"}},{"$f":"VLOOKUP($B44,$K$11:$O$38,5)","v":{"$error":"#N/A"}},"NDS",null,{"$f":"IFERROR(VLOOKUP($B44,'Cls MG'!$A$3:$G$23,4,FALSE),\"\")","v":""},{"$f":"IFERROR(VLOOKUP($B44,'Cls MG'!$A$3:$G$23,5,FALSE),\"\")","v":""},"Gymn STAN Pas dispo"]
[null,null,{"$f":"VLOOKUP($B45,$K$11:$O$38,4)","v":{"$error":"#N/A"}},{"$f":"VLOOKUP($B45,$K$11:$O$38,5)","v":{"$error":"#N/A"}},null,null,{"$f":"IFERROR(VLOOKUP($B45,'Cls MG'!$A$3:$G$23,4,FALSE),\"\")","v":""},{"$f":"IFERROR(VLOOKUP($B45,'Cls MG'!$A$3:$G$23,5,FALSE),\"\")","v":""}]
[null,null,{"$f":"VLOOKUP($B46,$K$11:$O$38,4)","v":{"$error":"#N/A"}},{"$f":"VLOOKUP($B46,$K$11:$O$38,5)","v":{"$error":"#N/A"}},null,null,{"$f":"IFERROR(VLOOKUP($B46,'Cls MG'!$A$3:$G$23,4,FALSE),\"\")","v":""},{"$f":"IFERROR(VLOOKUP($B46,'Cls MG'!$A$3:$G$23,5,FALSE),\"\")","v":""}]
[null,null,{"$f":"VLOOKUP($B47,$K$11:$O$38,4)","v":{"$error":"#N/A"}},{"$f":"VLOOKUP($B47,$K$11:$O$38,5)","v":{"$error":"#N/A"}},null,null,{"$f":"IFERROR(VLOOKUP($B47,'Cls MG'!$A$3:$G$23,4,FALSE),\"\")","v":""},{"$f":"IFERROR(VLOOKUP($B47,'Cls MG'!$A$3:$G$23,5,FALSE),\"\")","v":""}]
[null,null,{"$f":"VLOOKUP($B48,$K$11:$O$38,4)","v":{"$error":"#N/A"}},{"$f":"VLOOKUP($B48,$K$11:$O$38,5)","v":{"$error":"#N/A"}},null,null,{"$f":"IFERROR(VLOOKUP($B48,'Cls MG'!$A$3:$G$23,4,FALSE),\"\")","v":""},{"$f":"IFERROR(VLOOKUP($B48,'Cls MG'!$A$3:$G$23,5,FALSE),\"\")","v":""}]

{"sheet":"Cls MG","index":3,"n_rows":31,"n_cols":20,"rows_kept":31,"cut":false,"hidden":false,"merged":[[0,0,1,6],[2,3,2,4]]}
["MINIMES DIVISION 1"]
[]
["N° Match","Equipe A","Equipe B","Scores",null,"Vainqueur","Perdant",null,null,"SIGLE","Etablissement","Matchs joués","Victoires","Nuls","Défaites","Buts Pour","Buts Contre","Différence","Points"]
[1,{"$f":"'Calendrier MG'!N14","v":"STAN 1"},{"$f":"'Calendrier MG'!O14","v":"STAN 2"},null,null,{"$f":"IF(D4<>\"\",IF(D4>E4,B4,IF(D4<E4,C4,\"nul\")),\"\")","v":""},{"$f":"IF(E4<>\"\",IF(E4<D4,C4,IF(E4>D4,B4,\"nul\")),\"\")","v":""},null,{"$f":"RANK(T4,$T$4:$T$13)","v":{"$error":"#REF!"}},"STAN 1","Stanislas 1",{"$f":"COUNT(D4,D8,E12,D16,D20,D24,D28,#REF!,#REF!)","v":0},{"$f":"COUNTIF($F$3:$F$31,J4)","v":0},{"$f":"L4-M4-O4","v":0},{"$f":"COUNTIF(G3:G31,J4)","v":0},{"$f":"SUM(D4,D8,E12,D16,D20,D24,D28)","v":0},{"$f":"SUM(E4,E8,D12,E16,E20,E24,E28,#REF!,#REF!)","v":{"$error":"#REF!"}},{"$f":"P4-Q4","v":{"$error":"#REF!"}},{"$f":"M4*3+O4*1","v":0},{"$f":"SUM(S4*1000000+R4*10000+P4*100+L4*10)","v":{"$error":"#REF!"}}]
[2,{"$f":"'Calendrier MG'!N15","v":"AM"},{"$f":"'Calendrier MG'!O15","v":"NDS 1"},null,null,{"$f":"IF(D5<>\"\",IF(D5>E5,B5,IF(D5<E5,C5,\"nul\")),\"\")","v":""},{"$f":"IF(E5<>\"\",IF(E5<D5,C5,IF(E5>D5,B5,\"nul\")),\"\")","v":""},null,{"$f":"RANK(T5,$T$4:$T$13)","v":{"$error":"#REF!"}},"STAN 2","Stanislas 2",{"$f":"COUNT(E4,D9,E13,D17,D21,D25,D29,#REF!,#REF!)","v":0},{"$f":"COUNTIF($F$3:$F$31,J5)","v":0},{"$f":"L5-M5-O5","v":0},{"$f":"COUNTIF(G4:G31,J5)","v":0},{"$f":"SUM(E4,D9,E13,D17,D21,D25,D29,#REF!,#REF!)","v":{"$error":"#REF!"}},{"$f":"SUM(D4,E9,D13,E17,E21,E25,E29,#REF!,#REF!)","v":{"$error":"#REF!"}},{"$f":"P5-Q5","v":{"$error":"#REF!"}},{"$f":"M5*3+O5*1","v":0},{"$error":"#REF!"}]
[3,{"$f":"'Calendrier MG'!N16","v":"NDS 2"},{"$f":"'Calendrier MG'!O16","v":"NDS 3"},null,null,"","",null,{"$error":"#REF!"},"AM","Albert de Mun",{"$f":"COUNT(D5,E8,D13,D18,D22,D26,D30,#REF!,#REF!)","v":0},{"$f":"COUNTIF($F$3:$F$31,J6)","v":0},{"$f":"L6-M6-O6","v":0},{"$f":"COUNTIF(G5:G31,J6)","v":0},{"$f":"SUM(D5,E8,D13,D18,D22,D26,D30,#REF!,#REF!)","v":{"$error":"#REF!"}},{"$f":"SUM(E5,D8,E13,E18,E22,E26,E30,#REF!,#REF!)","v":{"$error":"#REF!"}},{"$f":"P6-Q6","v":{"$error":"#REF!"}},0,{"$error":"#REF!"}]
[4,{"$f":"'Calendrier MG'!N17","v":"SVI"},{"$f":"'Calendrier MG'!O17","v":0},null,null,"","",null,{"$error":"#REF!"},"NDS 1","Notre Dame de Sion 1",{"$f":"COUNT(E5,E9,D12,D19,D23,D27,D31,#REF!,#REF!)","v":0},{"$f":"COUNTIF($F$3:$F$31,J7)","v":0},0,{"$f":"COUNTIF(G6:G31,J7)","v":0},{"$f":"SUM(E5,E9,D12,D19,D23,D27,D31,#REF!,#REF!)","v":{"$error":"#REF!"}},{"$f":"SUM(D5,D9,E12,E19,E23,E27,E31,#REF!,#REF!)","v":{"$error":"#REF!"}},{"$error":"#REF!"},0,{"$error":"#REF!"}]
[5,{"$f":"'Calendrier MG'!N18","v":"STAN 1"},{"$f":"'Calendrier MG'!O18","v":"AM"},null,null,"","",null,{"$error":"#REF!"},"NDS 2","Notre Dame de Sion 2",{"$f":"COUNT(D6,D10,E14,E16,E23,E26,E29,#REF!,#REF!)","v":0},{"$f":"COUNTIF($F$3:$F$31,J8)","v":0},0,{"$f":"COUNTIF(G7:G31,J8)","v":0},{"$f":"SUM(D6,D10,E14,E16,E23,E26,E29,#REF!,#REF!)","v":{"$error":"#REF!"}},{"$f":"SUM(E6,E10,D14,D16,D23,D26,D29,#REF!,#REF!)","v":{"$error":"#REF!"}},{"$error":"#REF!"},0,{"$error":"#REF!"}]
[6,{"$f":"'Calendrier MG'!N19","v":"STAN 2"},{"$f":"'Calendrier MG'!O19","v":"NDS 1"},null,null,"","",null,{"$error":"#REF!"},"NDS 3","Notre Dame de Sion 3",{"$f":"COUNT(E6,D11,E15,E17,E20,E27,E30,#REF!,#REF!)","v":0},{"$f":"COUNTIF($F$3:$F$31,J9)","v":0},0,{"$f":"COUNTIF(G8:G31,J9)","v":0},{"$f":"SUM(E6,D11,E15,E17,E20,E27,E30,#REF!,#REF!)","v":{"$error":"#REF!"}},{"$f":"SUM(D6,E11,D15,D17,D20,D27,D30,#REF!,#REF!)","v":{"$error":"#REF!"}},{"$error":"#REF!"},0,{"$error":"#REF!"}]
[7,{"$f":"'Calendrier MG'!N20","v":"NDS 2"},{"$f":"'Calendrier MG'!O20","v":"SVI"},null,null,"","",null,{"$error":"#REF!"},"SVI","Saint Vincent",{"$f":"COUNT(D7,E10,D15,E18,E21,E24,E31,#REF!,#REF!)","v":0},{"$f":"COUNTIF($F$3:$F$31,J10)","v":0},0,{"$f":"COUNTIF(G9:G31,J10)","v":0},{"$f":"SUM(D7,E10,D15,E18,E21,E24,E31,#REF!,#REF!)","v":{"$error":"#REF!"}},{"$f":"SUM(E7,D10,E15,D18,D21,D24,D31,#REF!,#REF!)","v":{"$error":"#REF!"}},{"$error":"#REF!"},0,{"$error":"#REF!"}]
[8,{"$f":"'Calendrier MG'!N21","v":"NDS 3"},{"$f":"'Calendrier MG'!O21","v":0},null,null,"","",null,{"$error":"#REF!"},null,null,{"$f":"COUNT(E7,E11,D14,E19,E22,E25,E28,#REF!,#REF!)","v":0},{"$f":"COUNTIF($F$3:$F$31,J11)","v":0},0,{"$f":"COUNTIF(G10:G31,J11)","v":0},{"$f":"SUM(E7,E11,D14,E19,E22,E25,E28,#REF!,#REF!)","v":{"$error":"#REF!"}},{"$f":"SUM(D7,D11,E14,D19,D22,D25,D28,#REF!,#REF!)","v":{"$error":"#REF!"}},{"$error":"#REF!"},0,{"$error":"#REF!"}]
[9,{"$f":"'Calendrier MG'!N22","v":"NDS 1"},{"$f":"'Calendrier MG'!O22","v":"STAN 1"},null,null,{"$f":"IF(D12<>\"\",IF(D12>E12,B12,IF(D12<E12,C12,\"nul\")),\"\")","v":""},"",null,{"$error":"#REF!"},null,null,{"$f":"COUNT(#REF!,#REF!,#REF!,#REF!,#REF!,#REF!,#REF!,#REF!,#REF!)","v":0},{"$f":"COUNTIF($F$3:$F$31,J12)","v":0},0,{"$f":"COUNTIF(G11:G31,J12)","v":0},{"$f":"SUM(#REF!,#REF!,#REF!,#REF!,#REF!,#REF!,#REF!,#REF!,#REF!)","v":{"$error":"#REF!"}},{"$f":"SUM(#REF!,#REF!,#REF!,#REF!,#REF!,#REF!,#REF!,#REF!,#REF!)","v":{"$error":"#REF!"}},{"$error":"#REF!"},0,{"$error":"#REF!"}]
[10,{"$f":"'Calendrier MG'!N23","v":"AM"},{"$f":"'Calendrier MG'!O23","v":"STAN 2"},null,null,"","",null,{"$f":"RANK(T13,$T$4:$T$13)","v":{"$error":"#REF!"}},null,null,{"$f":"COUNT(#REF!,#REF!,#REF!,#REF!,#REF!,#REF!,#REF!,#REF!,#REF!)","v":0},{"$f":"COUNTIF($F$3:$F$31,J13)","v":0},{"$f":"L13-M13-O13","v":0},{"$f":"COUNTIF(G12:G31,J13)","v":0},{"$f":"SUM(#REF!,#REF!,#REF!,#REF!,#REF!,#REF!,#REF!,#REF!,#REF!)","v":{"$error":"#REF!"}},{"$f":"SUM(#REF!,#REF!,#REF!,#REF!,#REF!,#REF!,#REF!,#REF!,#REF!)","v":{"$error":"#REF!"}},{"$f":"P13-Q13","v":{"$error":"#REF!"}},{"$f":"M13*3+O13*1","v":0},{"$f":"SUM(S13*1000000+R13*10000+P13*100+L13*10)","v":{"$error":"#REF!"}}]
[11,{"$f":"'Calendrier MG'!N24","v":0},{"$f":"'Calendrier MG'!O24","v":"NDS 2"},null,null,"",""]
[12,{"$f":"'Calendrier MG'!N25","v":"SVI"},{"$f":"'Calendrier MG'!O25","v":"NDS 3"},null,null,"","",null,"Classement","SIGLE","Etablissement","Matchs joués","Victoires","Nuls","Défaites","Buts Pour","Buts Contre","Différence","Points"]
[13,{"$f":"'Calendrier MG'!N26","v":"STAN 1"},{"$f":"'Calendrier MG'!O26","v":"NDS 2"},null,null,"","",null,1,{"$f":"VLOOKUP($I16,$I$3:$S$13,COLUMNS($J15:J15)+1,FALSE)","v":{"$error":"#N/A"}},{"$f":"VLOOKUP($I16,$I$3:$S$13,COLUMNS($J15:K15)+1,FALSE)","v":{"$error":"#N/A"}},{"$f":"VLOOKUP($I16,$I$3:$S$13,COLUMNS($J15:L15)+1,FALSE)","v":{"$error":"#N/A"}},{"$f":"VLOOKUP($I16,$I$3:$S$13,COLUMNS($J15:M15)+1,FALSE)","v":{"$error":"#N/A"}},{"$f":"VLOOKUP($I16,$I$3:$S$13,COLUMNS($J15:N15)+1,FALSE)","v":{"$error":"#N/A"}},{"$f":"VLOOKUP($I16,$I$3:$S$13,COLUMNS($J15:O15)+1,FALSE)","v":{"$error":"#N/A"}},{"$f":"VLOOKUP($I16,$I$3:$S$13,COLUMNS($J15:P15)+1,FALSE)","v":{"$error":"#N/A"}},{"$f":"VLOOKUP($I16,$I$3:$S$13,COLUMNS($J15:Q15)+1,FALSE)","v":{"$error":"#N/A"}},{"$f":"VLOOKUP($I16,$I$3:$S$13,COLUMNS($J15:R15)+1,FALSE)","v":{"$error":"#N/A"}},{"$f":"VLOOKUP($I16,$I$3:$S$13,COLUMNS($J15:S15)+1,FALSE)","v":{"$error":"#N/A"}}]
[14,{"$f":"'Calendrier MG'!N27","v":"STAN 2"},{"$f":"'Calendrier MG'!O27","v":"NDS 3"},null,null,"","",null,2,{"$f":"VLOOKUP($I17,$I$3:$S$13,COLUMNS($J16:J16)+1,FALSE)","v":{"$error":"#N/A"}},{"$f":"VLOOKUP($I17,$I$3:$S$13,COLUMNS($J16:K16)+1,FALSE)","v":{"$error":"#N/A"}},{"$f":"VLOOKUP($I17,$I$3:$S$13,COLUMNS($J16:L16)+1,FALSE)","v":{"$error":"#N/A"}},{"$f":"VLOOKUP($I17,$I$3:$S$13,COLUMNS($J16:M16)+1,FALSE)","v":{"$error":"#N/A"}},{"$f":"VLOOKUP($I17,$I$3:$S$13,COLUMNS($J16:N16)+1,FALSE)","v":{"$error":"#N/A"}},{"$f":"VLOOKUP($I17,$I$3:$S$13,COLUMNS($J16:O16)+1,FALSE)","v":{"$error":"#N/A"}},{"$f":"VLOOKUP($I17,$I$3:$S$13,COLUMNS($J16:P16)+1,FALSE)","v":{"$error":"#N/A"}},{"$f":"VLOOKUP($I17,$I$3:$S$13,COLUMNS($J16:Q16)+1,FALSE)","v":{"$error":"#N/A"}},{"$f":"VLOOKUP($I17,$I$3:$S$13,COLUMNS($J16:R16)+1,FALSE)","v":{"$error":"#N/A"}},{"$f":"VLOOKUP($I17,$I$3:$S$13,COLUMNS($J16:S16)+1,FALSE)","v":{"$error":"#N/A"}}]
[15,{"$f":"'Calendrier MG'!N28","v":"AM"},{"$f":"'Calendrier MG'!O28","v":"SVI"},null,null,"","",null,3,{"$f":"VLOOKUP($I18,$I$3:$S$13,COLUMNS($J17:J17)+1,FALSE)","v":{"$error":"#N/A"}},{"$f":"VLOOKUP($I18,$I$3:$S$13,COLUMNS($J17:K17)+1,FALSE)","v":{"$error":"#N/A"}},{"$f":"VLOOKUP($I18,$I$3:$S$13,COLUMNS($J17:L17)+1,FALSE)","v":{"$error":"#N/A"}},{"$f":"VLOOKUP($I18,$I$3:$S$13,COLUMNS($J17:M17)+1,FALSE)","v":{"$error":"#N/A"}},{"$f":"VLOOKUP($I18,$I$3:$S$13,COLUMNS($J17:N17)+1,FALSE)","v":{"$error":"#N/A"}},{"$f":"VLOOKUP($I18,$I$3:$S$13,COLUMNS($J17:O17)+1,FALSE)","v":{"$error":"#N/A"}},{"$f":"VLOOKUP($I18,$I$3:$S$13,COLUMNS($J17:P17)+1,FALSE)","v":{"$error":"#N/A"}},{"$f":"VLOOKUP($I18,$I$3:$S$13,COLUMNS($J17:Q17)+1,FALSE)","v":{"$error":"#N/A"}},{"$f":"VLOOKUP($I18,$I$3:$S$13,COLUMNS($J17:R17)+1,FALSE)","v":{"$error":"#N/A"}},{"$f":"VLOOKUP($I18,$I$3:$S$13,COLUMNS($J17:S17)+1,FALSE)","v":{"$error":"#N/A"}}]
[16,{"$f":"'Calendrier MG'!N29","v":"NDS 1"},{"$f":"'Calendrier MG'!O29","v":0},null,null,"","",null,4,{"$f":"VLOOKUP($I19,$I$3:$S$13,COLUMNS($J18:J18)+1,FALSE)","v":{"$error":"#N/A"}},{"$f":"VLOOKUP($I19,$I$3:$S$13,COLUMNS($J18:K18)+1,FALSE)","v":{"$error":"#N/A"}},{"$f":"VLOOKUP($I19,$I$3:$S$13,COLUMNS($J18:L18)+1,FALSE)","v":{"$error":"#N/A"}},{"$f":"VLOOKUP($I19,$I$3:$S$13,COLUMNS($J18:M18)+1,FALSE)","v":{"$error":"#N/A"}},{"$f":"VLOOKUP($I19,$I$3:$S$13,COLUMNS($J18:N18)+1,FALSE)","v":{"$error":"#N/A"}},{"$f":"VLOOKUP($I19,$I$3:$S$13,COLUMNS($J18:O18)+1,FALSE)","v":{"$error":"#N/A"}},{"$f":"VLOOKUP($I19,$I$3:$S$13,COLUMNS($J18:P18)+1,FALSE)","v":{"$error":"#N/A"}},{"$f":"VLOOKUP($I19,$I$3:$S$13,COLUMNS($J18:Q18)+1,FALSE)","v":{"$error":"#N/A"}},{"$f":"VLOOKUP($I19,$I$3:$S$13,COLUMNS($J18:R18)+1,FALSE)","v":{"$error":"#N/A"}},{"$f":"VLOOKUP($I19,$I$3:$S$13,COLUMNS($J18:S18)+1,FALSE)","v":{"$error":"#N/A"}}]
[17,{"$f":"'Calendrier MG'!N30","v":"STAN 1"},{"$f":"'Calendrier MG'!O30","v":"NDS 3"},null,null,"","",null,5,{"$f":"VLOOKUP($I20,$I$3:$S$13,COLUMNS($J19:J19)+1,FALSE)","v":{"$error":"#N/A"}},{"$f":"VLOOKUP($I20,$I$3:$S$13,COLUMNS($J19:K19)+1,FALSE)","v":{"$error":"#N/A"}},{"$f":"VLOOKUP($I20,$I$3:$S$13,COLUMNS($J19:L19)+1,FALSE)","v":{"$error":"#N/A"}},{"$f":"VLOOKUP($I20,$I$3:$S$13,COLUMNS($J19:M19)+1,FALSE)","v":{"$error":"#N/A"}},{"$f":"VLOOKUP($I20,$I$3:$S$13,COLUMNS($J19:N19)+1,FALSE)","v":{"$error":"#N/A"}},{"$f":"VLOOKUP($I20,$I$3:$S$13,COLUMNS($J19:O19)+1,FALSE)","v":{"$error":"#N/A"}},{"$f":"VLOOKUP($I20,$I$3:$S$13,COLUMNS($J19:P19)+1,FALSE)","v":{"$error":"#N/A"}},{"$f":"VLOOKUP($I20,$I$3:$S$13,COLUMNS($J19:Q19)+1,FALSE)","v":{"$error":"#N/A"}},{"$f":"VLOOKUP($I20,$I$3:$S$13,COLUMNS($J19:R19)+1,FALSE)","v":{"$error":"#N/A"}},{"$f":"VLOOKUP($I20,$I$3:$S$13,COLUMNS($J19:S19)+1,FALSE)","v":{"$error":"#N/A"}}]
[18,{"$f":"'Calendrier MG'!N31","v":"STAN 2"},{"$f":"'Calendrier MG'!O31","v":"SVI"},null,null,"","",null,6,{"$f":"VLOOKUP($I21,$I$3:$S$13,COLUMNS($J20:J20)+1,FALSE)","v":{"$error":"#N/A"}},{"$f":"VLOOKUP($I21,$I$3:$S$13,COLUMNS($J20:K20)+1,FALSE)","v":{"$error":"#N/A"}},{"$f":"VLOOKUP($I21,$I$3:$S$13,COLUMNS($J20:L20)+1,FALSE)","v":{"$error":"#N/A"}},{"$f":"VLOOKUP($I21,$I$3:$S$13,COLUMNS($J20:M20)+1,FALSE)","v":{"$error":"#N/A"}},{"$f":"VLOOKUP($I21,$I$3:$S$13,COLUMNS($J20:N20)+1,FALSE)","v":{"$error":"#N/A"}},{"$f":"VLOOKUP($I21,$I$3:$S$13,COLUMNS($J20:O20)+1,FALSE)","v":{"$error":"#N/A"}},{"$f":"VLOOKUP($I21,$I$3:$S$13,COLUMNS($J20:P20)+1,FALSE)","v":{"$error":"#N/A"}},{"$f":"VLOOKUP($I21,$I$3:$S$13,COLUMNS($J20:Q20)+1,FALSE)","v":{"$error":"#N/A"}},{"$f":"VLOOKUP($I21,$I$3:$S$13,COLUMNS($J20:R20)+1,FALSE)","v":{"$error":"#N/A"}},{"$f":"VLOOKUP($I21,$I$3:$S$13,COLUMNS($J20:S20)+1,FALSE)","v":{"$error":"#N/A"}}]
[19,{"$f":"'Calendrier MG'!N32","v":"AM"},{"$f":"'Calendrier MG'!O32","v":0},null,null,"","",null,7,{"$f":"VLOOKUP($I22,$I$3:$S$13,COLUMNS($J21:J21)+1,FALSE)","v":{"$error":"#N/A"}},{"$f":"VLOOKUP($I22,$I$3:$S$13,COLUMNS($J21:K21)+1,FALSE)","v":{"$error":"#N/A"}},{"$f":"VLOOKUP($I22,$I$3:$S$13,COLUMNS($J21:L21)+1,FALSE)","v":{"$error":"#N/A"}},{"$f":"VLOOKUP($I22,$I$3:$S$13,COLUMNS($J21:M21)+1,FALSE)","v":{"$error":"#N/A"}},{"$f":"VLOOKUP($I22,$I$3:$S$13,COLUMNS($J21:N21)+1,FALSE)","v":{"$error":"#N/A"}},{"$f":"VLOOKUP($I22,$I$3:$S$13,COLUMNS($J21:O21)+1,FALSE)","v":{"$error":"#N/A"}},{"$f":"VLOOKUP($I22,$I$3:$S$13,COLUMNS($J21:P21)+1,FALSE)","v":{"$error":"#N/A"}},{"$f":"VLOOKUP($I22,$I$3:$S$13,COLUMNS($J21:Q21)+1,FALSE)","v":{"$error":"#N/A"}},{"$f":"VLOOKUP($I22,$I$3:$S$13,COLUMNS($J21:R21)+1,FALSE)","v":{"$error":"#N/A"}},{"$f":"VLOOKUP($I22,$I$3:$S$13,COLUMNS($J21:S21)+1,FALSE)","v":{"$error":"#N/A"}}]
[20,{"$f":"'Calendrier MG'!N33","v":"NDS 1"},{"$f":"'Calendrier MG'!O33","v":"NDS 2"},null,null,"","",null,8,{"$f":"VLOOKUP($I23,$I$3:$S$13,COLUMNS($J22:J22)+1,FALSE)","v":{"$error":"#N/A"}},{"$f":"VLOOKUP($I23,$I$3:$S$13,COLUMNS($J22:K22)+1,FALSE)","v":{"$error":"#N/A"}},{"$f":"VLOOKUP($I23,$I$3:$S$13,COLUMNS($J22:L22)+1,FALSE)","v":{"$error":"#N/A"}},{"$f":"VLOOKUP($I23,$I$3:$S$13,COLUMNS($J22:M22)+1,FALSE)","v":{"$error":"#N/A"}},{"$f":"VLOOKUP($I23,$I$3:$S$13,COLUMNS($J22:N22)+1,FALSE)","v":{"$error":"#N/A"}},{"$f":"VLOOKUP($I23,$I$3:$S$13,COLUMNS($J22:O22)+1,FALSE)","v":{"$error":"#N/A"}},{"$f":"VLOOKUP($I23,$I$3:$S$13,COLUMNS($J22:P22)+1,FALSE)","v":{"$error":"#N/A"}},{"$f":"VLOOKUP($I23,$I$3:$S$13,COLUMNS($J22:Q22)+1,FALSE)","v":{"$error":"#N/A"}},{"$f":"VLOOKUP($I23,$I$3:$S$13,COLUMNS($J22:R22)+1,FALSE)","v":{"$error":"#N/A"}},{"$f":"VLOOKUP($I23,$I$3:$S$13,COLUMNS($J22:S22)+1,FALSE)","v":{"$error":"#N/A"}}]
[21,{"$f":"'Calendrier MG'!N34","v":"STAN 1"},{"$f":"'Calendrier MG'!O34","v":"SVI"},null,null,"","",null,9,{"$f":"VLOOKUP($I24,$I$3:$S$13,COLUMNS($J23:J23)+1,FALSE)","v":{"$error":"#N/A"}},{"$f":"VLOOKUP($I24,$I$3:$S$13,COLUMNS($J23:K23)+1,FALSE)","v":{"$error":"#N/A"}},{"$f":"VLOOKUP($I24,$I$3:$S$13,COLUMNS($J23:L23)+1,FALSE)","v":{"$error":"#N/A"}},{"$f":"VLOOKUP($I24,$I$3:$S$13,COLUMNS($J23:M23)+1,FALSE)","v":{"$error":"#N/A"}},{"$f":"VLOOKUP($I24,$I$3:$S$13,COLUMNS($J23:N23)+1,FALSE)","v":{"$error":"#N/A"}},{"$f":"VLOOKUP($I24,$I$3:$S$13,COLUMNS($J23:O23)+1,FALSE)","v":{"$error":"#N/A"}},{"$f":"VLOOKUP($I24,$I$3:$S$13,COLUMNS($J23:P23)+1,FALSE)","v":{"$error":"#N/A"}},{"$f":"VLOOKUP($I24,$I$3:$S$13,COLUMNS($J23:Q23)+1,FALSE)","v":{"$error":"#N/A"}},{"$f":"VLOOKUP($I24,$I$3:$S$13,COLUMNS($J23:R23)+1,FALSE)","v":{"$error":"#N/A"}},{"$f":"VLOOKUP($I24,$I$3:$S$13,COLUMNS($J23:S23)+1,FALSE)","v":{"$error":"#N/A"}}]
[22,{"$f":"'Calendrier MG'!N35","v":"STAN 2"},{"$f":"'Calendrier MG'!O35","v":0},null,null,"","",null,10,{"$f":"VLOOKUP($I25,$I$3:$S$13,COLUMNS($J24:J24)+1,FALSE)","v":{"$error":"#N/A"}},{"$f":"VLOOKUP($I25,$I$3:$S$13,COLUMNS($J24:K24)+1,FALSE)","v":{"$error":"#N/A"}},{"$f":"VLOOKUP($I25,$I$3:$S$13,COLUMNS($J24:L24)+1,FALSE)","v":{"$error":"#N/A"}},{"$f":"VLOOKUP($I25,$I$3:$S$13,COLUMNS($J24:M24)+1,FALSE)","v":{"$error":"#N/A"}},{"$f":"VLOOKUP($I25,$I$3:$S$13,COLUMNS($J24:N24)+1,FALSE)","v":{"$error":"#N/A"}},{"$f":"VLOOKUP($I25,$I$3:$S$13,COLUMNS($J24:O24)+1,FALSE)","v":{"$error":"#N/A"}},{"$f":"VLOOKUP($I25,$I$3:$S$13,COLUMNS($J24:P24)+1,FALSE)","v":{"$error":"#N/A"}},{"$f":"VLOOKUP($I25,$I$3:$S$13,COLUMNS($J24:Q24)+1,FALSE)","v":{"$error":"#N/A"}},{"$f":"VLOOKUP($I25,$I$3:$S$13,COLUMNS($J24:R24)+1,FALSE)","v":{"$error":"#N/A"}},{"$f":"VLOOKUP($I25,$I$3:$S$13,COLUMNS($J24:S24)+1,FALSE)","v":{"$error":"#N/A"}}]
[23,{"$f":"'Calendrier MG'!N36","v":"AM"},{"$f":"'Calendrier MG'!O36","v":"NDS 2"},null,null,"",""]
[24,{"$f":"'Calendrier MG'!N37","v":"NDS 1"},{"$f":"'Calendrier MG'!O37","v":"NDS 3"},null,null,"",""]
[25,{"$f":"'Calendrier MG'!N38","v":"STAN 1"},{"$f":"'Calendrier MG'!O38","v":0},null,null,"",""]
[26,{"$f":"'Calendrier MG'!N39","v":"STAN 2"},{"$f":"'Calendrier MG'!O39","v":"NDS 2"},null,null,"",""]
[27,{"$f":"'Calendrier MG'!N40","v":"AM"},{"$f":"'Calendrier MG'!O40","v":"NDS 3"},null,null,"",""]
[28,{"$f":"'Calendrier MG'!N41","v":"NDS 1"},{"$f":"'Calendrier MG'!O41","v":"SVI"},null,null,{"$f":"IF(D31<>\"\",IF(D31>E31,B31,IF(D31<E31,C31,\"nul\")),\"\")","v":""},{"$f":"IF(E31<>\"\",IF(E31<D31,C31,IF(E31>D31,B31,\"nul\")),\"\")","v":""}]

{"sheet":"Classements","index":4,"n_rows":13,"n_cols":23,"rows_kept":13,"cut":false,"hidden":false,"merged":[[0,0,1,10],[2,0,2,2],[0,12,1,22],[2,12,2,14]]}
["CLASSEMENT PROMO BENJAMINS 2019-2020",null,null,null,null,null,null,null,null,null,null,null,"CLASSEMENT PROMO MINIMES 2019-2020"]
[]
["DIVISION 1",null,null,null,null,null,null,null,null,null,null,null,"DIVISION 1"]
["CLASSEMENT","SIGLE","Etablissement","Matchs joués","Victoires","Nuls","Défaites","Buts Pour","Buts Contre","Différence","Points",null,"CLASSEMENT","SIGLE","Etablissement","Matchs joués","Victoires","Nuls","Défaites","Buts Pour","Buts Contre","Différence","Points"]
[1,{"$f":"'Cls BG'!J13","v":"AM"},{"$f":"'Cls BG'!K13","v":"Albert de Mun"},{"$f":"'Cls BG'!L13","v":0},{"$f":"'Cls BG'!M13","v":0},{"$f":"'Cls BG'!N13","v":0},{"$f":"'Cls BG'!O13","v":0},{"$f":"'Cls BG'!P13","v":0},{"$f":"'Cls BG'!Q13","v":0},{"$f":"'Cls BG'!R13","v":0},{"$f":"'Cls BG'!S13","v":0},null,1,{"$f":"'Cls MG'!J16","v":{"$error":"#N/A"}},{"$f":"'Cls MG'!K16","v":{"$error":"#N/A"}},{"$f":"'Cls MG'!L16","v":{"$error":"#N/A"}},{"$f":"'Cls MG'!M16","v":{"$error":"#N/A"}},{"$f":"'Cls MG'!N16","v":{"$error":"#N/A"}},{"$f":"'Cls MG'!O16","v":{"$error":"#N/A"}},{"$f":"'Cls MG'!P16","v":{"$error":"#N/A"}},{"$f":"'Cls MG'!Q16","v":{"$error":"#N/A"}},{"$f":"'Cls MG'!R16","v":{"$error":"#N/A"}},{"$f":"'Cls MG'!S16","v":{"$error":"#N/A"}}]
[2,{"$f":"'Cls BG'!J14","v":{"$error":"#N/A"}},{"$f":"'Cls BG'!K14","v":{"$error":"#N/A"}},{"$f":"'Cls BG'!L14","v":{"$error":"#N/A"}},{"$f":"'Cls BG'!M14","v":{"$error":"#N/A"}},{"$f":"'Cls BG'!N14","v":{"$error":"#N/A"}},{"$f":"'Cls BG'!O14","v":{"$error":"#N/A"}},{"$f":"'Cls BG'!P14","v":{"$error":"#N/A"}},{"$f":"'Cls BG'!Q14","v":{"$error":"#N/A"}},{"$f":"'Cls BG'!R14","v":{"$error":"#N/A"}},{"$f":"'Cls BG'!S14","v":{"$error":"#N/A"}},null,2,{"$f":"'Cls MG'!J17","v":{"$error":"#N/A"}},{"$f":"'Cls MG'!K17","v":{"$error":"#N/A"}},{"$f":"'Cls MG'!L17","v":{"$error":"#N/A"}},{"$f":"'Cls MG'!M17","v":{"$error":"#N/A"}},{"$f":"'Cls MG'!N17","v":{"$error":"#N/A"}},{"$f":"'Cls MG'!O17","v":{"$error":"#N/A"}},{"$f":"'Cls MG'!P17","v":{"$error":"#N/A"}},{"$f":"'Cls MG'!Q17","v":{"$error":"#N/A"}},{"$f":"'Cls MG'!R17","v":{"$error":"#N/A"}},{"$f":"'Cls MG'!S17","v":{"$error":"#N/A"}}]
[3,{"$f":"'Cls BG'!J15","v":{"$error":"#N/A"}},{"$f":"'Cls BG'!K15","v":{"$error":"#N/A"}},{"$f":"'Cls BG'!L15","v":{"$error":"#N/A"}},{"$f":"'Cls BG'!M15","v":{"$error":"#N/A"}},{"$f":"'Cls BG'!N15","v":{"$error":"#N/A"}},{"$f":"'Cls BG'!O15","v":{"$error":"#N/A"}},{"$f":"'Cls BG'!P15","v":{"$error":"#N/A"}},{"$f":"'Cls BG'!Q15","v":{"$error":"#N/A"}},{"$f":"'Cls BG'!R15","v":{"$error":"#N/A"}},{"$f":"'Cls BG'!S15","v":{"$error":"#N/A"}},null,3,{"$f":"'Cls MG'!J18","v":{"$error":"#N/A"}},{"$f":"'Cls MG'!K18","v":{"$error":"#N/A"}},{"$f":"'Cls MG'!L18","v":{"$error":"#N/A"}},{"$f":"'Cls MG'!M18","v":{"$error":"#N/A"}},{"$f":"'Cls MG'!N18","v":{"$error":"#N/A"}},{"$f":"'Cls MG'!O18","v":{"$error":"#N/A"}},{"$f":"'Cls MG'!P18","v":{"$error":"#N/A"}},{"$f":"'Cls MG'!Q18","v":{"$error":"#N/A"}},{"$f":"'Cls MG'!R18","v":{"$error":"#N/A"}},{"$f":"'Cls MG'!S18","v":{"$error":"#N/A"}}]
[4,{"$f":"'Cls BG'!J16","v":{"$error":"#N/A"}},{"$f":"'Cls BG'!K16","v":{"$error":"#N/A"}},{"$f":"'Cls BG'!L16","v":{"$error":"#N/A"}},{"$f":"'Cls BG'!M16","v":{"$error":"#N/A"}},{"$f":"'Cls BG'!N16","v":{"$error":"#N/A"}},{"$f":"'Cls BG'!O16","v":{"$error":"#N/A"}},{"$f":"'Cls BG'!P16","v":{"$error":"#N/A"}},{"$f":"'Cls BG'!Q16","v":{"$error":"#N/A"}},{"$f":"'Cls BG'!R16","v":{"$error":"#N/A"}},{"$f":"'Cls BG'!S16","v":{"$error":"#N/A"}},null,4,{"$f":"'Cls MG'!J19","v":{"$error":"#N/A"}},{"$f":"'Cls MG'!K19","v":{"$error":"#N/A"}},{"$f":"'Cls MG'!L19","v":{"$error":"#N/A"}},{"$f":"'Cls MG'!M19","v":{"$error":"#N/A"}},{"$f":"'Cls MG'!N19","v":{"$error":"#N/A"}},{"$f":"'Cls MG'!O19","v":{"$error":"#N/A"}},{"$f":"'Cls MG'!P19","v":{"$error":"#N/A"}},{"$f":"'Cls MG'!Q19","v":{"$error":"#N/A"}},{"$f":"'Cls MG'!R19","v":{"$error":"#N/A"}},{"$f":"'Cls MG'!S19","v":{"$error":"#N/A"}}]
[5,{"$f":"'Cls BG'!J17","v":{"$error":"#N/A"}},{"$f":"'Cls BG'!K17","v":{"$error":"#N/A"}},{"$f":"'Cls BG'!L17","v":{"$error":"#N/A"}},{"$f":"'Cls BG'!M17","v":{"$error":"#N/A"}},{"$f":"'Cls BG'!N17","v":{"$error":"#N/A"}},{"$f":"'Cls BG'!O17","v":{"$error":"#N/A"}},{"$f":"'Cls BG'!P17","v":{"$error":"#N/A"}},{"$f":"'Cls BG'!Q17","v":{"$error":"#N/A"}},{"$f":"'Cls BG'!R17","v":{"$error":"#N/A"}},{"$f":"'Cls BG'!S17","v":{"$error":"#N/A"}},null,5,{"$f":"'Cls MG'!J20","v":{"$error":"#N/A"}},{"$f":"'Cls MG'!K20","v":{"$error":"#N/A"}},{"$f":"'Cls MG'!L20","v":{"$error":"#N/A"}},{"$f":"'Cls MG'!M20","v":{"$error":"#N/A"}},{"$f":"'Cls MG'!N20","v":{"$error":"#N/A"}},{"$f":"'Cls MG'!O20","v":{"$error":"#N/A"}},{"$f":"'Cls MG'!P20","v":{"$error":"#N/A"}},{"$f":"'Cls MG'!Q20","v":{"$error":"#N/A"}},{"$f":"'Cls MG'!R20","v":{"$error":"#N/A"}},{"$f":"'Cls MG'!S20","v":{"$error":"#N/A"}}]
[6,{"$f":"'Cls BG'!J18","v":{"$error":"#N/A"}},{"$f":"'Cls BG'!K18","v":{"$error":"#N/A"}},{"$f":"'Cls BG'!L18","v":{"$error":"#N/A"}},{"$f":"'Cls BG'!M18","v":{"$error":"#N/A"}},{"$f":"'Cls BG'!N18","v":{"$error":"#N/A"}},{"$f":"'Cls BG'!O18","v":{"$error":"#N/A"}},{"$f":"'Cls BG'!P18","v":{"$error":"#N/A"}},{"$f":"'Cls BG'!Q18","v":{"$error":"#N/A"}},{"$f":"'Cls BG'!R18","v":{"$error":"#N/A"}},{"$f":"'Cls BG'!S18","v":{"$error":"#N/A"}},null,6,{"$f":"'Cls MG'!J21","v":{"$error":"#N/A"}},{"$f":"'Cls MG'!K21","v":{"$error":"#N/A"}},{"$f":"'Cls MG'!L21","v":{"$error":"#N/A"}},{"$f":"'Cls MG'!M21","v":{"$error":"#N/A"}},{"$f":"'Cls MG'!N21","v":{"$error":"#N/A"}},{"$f":"'Cls MG'!O21","v":{"$error":"#N/A"}},{"$f":"'Cls MG'!P21","v":{"$error":"#N/A"}},{"$f":"'Cls MG'!Q21","v":{"$error":"#N/A"}},{"$f":"'Cls MG'!R21","v":{"$error":"#N/A"}},{"$f":"'Cls MG'!S21","v":{"$error":"#N/A"}}]
[null,null,null,null,null,null,null,null,null,null,null,null,7,{"$f":"'Cls MG'!J22","v":{"$error":"#N/A"}},{"$f":"'Cls MG'!K22","v":{"$error":"#N/A"}},{"$f":"'Cls MG'!L22","v":{"$error":"#N/A"}},{"$f":"'Cls MG'!M22","v":{"$error":"#N/A"}},{"$f":"'Cls MG'!N22","v":{"$error":"#N/A"}},{"$f":"'Cls MG'!O22","v":{"$error":"#N/A"}},{"$f":"'Cls MG'!P22","v":{"$error":"#N/A"}},{"$f":"'Cls MG'!Q22","v":{"$error":"#N/A"}},{"$f":"'Cls MG'!R22","v":{"$error":"#N/A"}},{"$f":"'Cls MG'!S22","v":{"$error":"#N/A"}}]
[null,null,null,null,null,null,null,null,null,null,null,null,8,{"$f":"'Cls MG'!J23","v":{"$error":"#N/A"}},{"$f":"'Cls MG'!K23","v":{"$error":"#N/A"}},{"$f":"'Cls MG'!L23","v":{"$error":"#N/A"}},{"$f":"'Cls MG'!M23","v":{"$error":"#N/A"}},{"$f":"'Cls MG'!N23","v":{"$error":"#N/A"}},{"$f":"'Cls MG'!O23","v":{"$error":"#N/A"}},{"$f":"'Cls MG'!P23","v":{"$error":"#N/A"}},{"$f":"'Cls MG'!Q23","v":{"$error":"#N/A"}},{"$f":"'Cls MG'!R23","v":{"$error":"#N/A"}},{"$f":"'Cls MG'!S23","v":{"$error":"#N/A"}}]
[null,null,null,null,null,null,null,null,null,null,null,null,9,{"$f":"'Cls MG'!J24","v":{"$error":"#N/A"}},{"$f":"'Cls MG'!K24","v":{"$error":"#N/A"}},{"$f":"'Cls MG'!L24","v":{"$error":"#N/A"}},{"$f":"'Cls MG'!M24","v":{"$error":"#N/A"}},{"$f":"'Cls MG'!N24","v":{"$error":"#N/A"}},{"$f":"'Cls MG'!O24","v":{"$error":"#N/A"}},{"$f":"'Cls MG'!P24","v":{"$error":"#N/A"}},{"$f":"'Cls MG'!Q24","v":{"$error":"#N/A"}},{"$f":"'Cls MG'!R24","v":{"$error":"#N/A"}},{"$f":"'Cls MG'!S24","v":{"$error":"#N/A"}}]

{"sheet":"Indispos profs","index":5,"n_rows":6,"n_cols":16,"rows_kept":6,"cut":false,"hidden":false,"merged":[[0,0,0,15],[1,1,1,5],[1,6,1,10],[1,11,1,15]]}
["DATES D'INDISPONIBILITES DES ETABLISSEMENTS"]
["SIGLES","Benjamins",null,null,null,null,"Minimes",null,null,null,null,"Lycée"]
["STAN","2020-12-02","2020-12-16","2020-01-06","2020-01-20","2020-01-27","2020-12-02","2020-12-16","2020-01-06","2020-01-20","2020-01-27","2020-12-02","2020-12-16","2020-01-06","2020-01-20","2020-01-27"]
["AM"]
["NDS"]
["SVI"]

{"sheet":"Listing profs","index":6,"n_rows":7,"n_cols":5,"rows_kept":7,"cut":false,"hidden":false,"merged":[[0,0,0,4],[3,0,4,0],[3,1,4,1]]}
["LISTING HANDBALL 2020-2021"]
["NOM D'ETABLISSEMENT","SIGLE","NOM et PRENOM","N° MOBILE","MAIL "]
["STANISLAS","STAN","GALLY Fabien","06 83 60 10 11","fabiengally78@gmail.com"]
["NOTRE DAME DE SION","NDS","SOUFFLARD Camille","06 80 75 21 65","soufflard.camille@gmail.com"]
[null,null,"BOUZOU Baptiste","06 06 48 56 09","baptistebouzou95@gmail.com"]
["ALBERT DE MUN","AM","MEDINA Pierre-Alexis","07 60 89 73 77","medina.p-a@hotmail.fr"]
["SAINT VINCENT","SVI","SANDRI Fiona","06 65 35 16 48","sandri.fiona@icloud.com"]

{"sheet":"Installations","index":7,"n_rows":5,"n_cols":4,"rows_kept":5,"cut":false,"hidden":false,"merged":[[0,0,0,3]]}
["INSTALLATIONS HANDBALL 2020-2021"]
["NOM DU TERRAIN","COORDONNEES","MOYENS D'ACCES","HORAIRES"]
[]
["GYMNASE STANISLAS","22 rue Notre Dame des Champs 75006 Paris","Métro 12 Notre Dame des Champs","14h30 à 16h30"]
["GYMNASE NOTRE DAME DE SION","61 rue Notre Dame des Champs 75006 Paris","Métro 12 Notre Dame des Champs","13h30-16h"]