{"text_format":"1","workbook":"xlsx","n_sheets":8,"sheets":["Calendrier BG","Cls BG","Calendrier MG","Cls MG","Classements","Indispos profs","Listing profs","Installations"],"not_rendered":{"charts":0,"images":0,"macros":0,"external_links":0,"defined_names":1,"comments":0,"pivot_tables":0},"unopened":[],"bounds":{"document_bytes":16777216,"sheet_cells":100000,"rows_first":2000,"rows_last":500,"rows_between":2000,"halvings":0,"cell_chars":16384,"cell_head_chars":4096},"cells_cut":0,"cells_raw":0,"read":"whole","date_system":"1900"}

{"sheet":"Calendrier BG","index":0,"n_rows":42,"n_cols":15,"rows_kept":42,"cut":false,"hidden":false,"merged":[[2,0,5,0],[7,4,8,4],[15,1,17,7],[37,4,41,4],[11,4,13,4],[23,1,23,7],[27,1,27,7],[19,1,19,7],[15,8,17,8],[7,8,9,8],[11,8,13,8],[27,8,31,8],[37,8,41,8],[10,0,13,0],[14,1,14,8],[32,1,32,8],[23,8,25,8],[26,0,31,0],[22,0,25,0],[22,1,22,8],[26,1,26,8],[32,0,35,0],[33,8,35,8],[14,0,17,0],[18,1,18,8],[18,0,21,0],[0,10,0,17],[1,10,1,11],[10,1,10,8],[2,10,2,11],[6,1,6,8],[2,1,2,8],[0,1,0,8],[10,13,10,14],[1,6,1,7],[3,4,5,4],[6,0,9,0],[36,0,41,0],[36,1,36,8]]}
[null," CALENDRIER BENJAMINS ",null,null,null,null,null,null,null,null,"POULES ET MATCHS BENJAMINS"]
["Date","Match","Equipe A","Equipe B","Lieux","Horaires","Résultats",null,"Indisponibilités",null,"DIVISION 1"]
["2 dec","DIVISION 1",null,null,null,null,null,null,null,null,"Etablissements",null,null,"Dates d'occupation de STAN par le Badminton"]
[null,6,{"$f":"VLOOKUP($B4,$K$11:$O$30,4)","v":"NDS 1"},{"$f":"VLOOKUP($B4,$K$11:$O$30,5)","v":"NDS 2"},"NDS","13h30",{"$f":"IFERROR(VLOOKUP($B4,'Cls BG'!$A$3:$G$33,4,FALSE),\"\")","v":0},{"$f":"IFERROR(VLOOKUP($B4,'Cls BG'!$A$3:$G$33,5,FALSE),\"\")","v":0},null,null,1,"AM",null,"16 dec"]
[null,3,"NDS 2","SVI",null,"14h30",{"$f":"IFERROR(VLOOKUP($B5,'Cls BG'!$A$3:$G$33,4,FALSE),\"\")","v":0},{"$f":"IFERROR(VLOOKUP($B5,'Cls BG'!$A$3:$G$33,5,FALSE),\"\")","v":0},null,null,2,"NDS 1",null,"2020-01-27"]
[null,11,"NDS 1","SVI",null,"15h30",{"$f":"IFERROR(VLOOKUP($B6,'Cls BG'!$A$3:$G$33,4,FALSE),\"\")","v":0},{"$f":"IFERROR(VLOOKUP($B6,'Cls BG'!$A$3:$G$33,5,FALSE),\"\")","v":0},null,null,3,"NDS 2",null,"10 fev"]
["9 dec","DIVISION 1",null,null,null,null,null,null,null,null,4,"SVI",null,"2020-03-03"]
[null,15,"SVI","NDS 3","NDS","13h30",{"$f":"IFERROR(VLOOKUP($B8,'Cls BG'!$A$3:$G$33,4,FALSE),\"\")","v":0},{"$f":"IFERROR(VLOOKUP($B8,'Cls BG'!$A$3:$G$33,5,FALSE),\"\")","v":0},null,null,5,"NDS 3"]
[null,8,"NDS 2","NDS 3",null,"14h30",{"$f":"IFERROR(VLOOKUP($B9,'Cls BG'!$A$3:$G$33,4,FALSE),\"\")","v":0},{"$f":"IFERROR(VLOOKUP($B9,'Cls BG'!$A$3:$G$33,5,FALSE),\"\")","v":0},null,null,6,null,null,"Territoire MG 24 mars et MF 10 mars"]
[]
{"$rows_left_out":33}
{"sheet":"Cls BG","index":1,"n_rows":33,"n_cols":20,"rows_kept":33,"cut":false,"hidden":false,"merged":[[2,3,2,4],[0,0,1,6]]}
["BENJAMINS DIVISION 1 "]
[]
["N° Match","Equipe A","Equipe B","Scores",null,"Vainqueur","Perdant",null,null,"SIGLE","Etablissement","Matchs joués","Victoires","Nuls","Défaites","Buts Pour","Buts Contre","Différence","Points"]
[1,{"$f":"'Calendrier BG'!N12","v":"AM"},{"$f":"'Calendrier BG'!O12","v":0},null,null,{"$f":"IF(D4<>\"\",IF(D4>E4,B4,IF(D4<E4,C4,\"nul\")),\"\")","v":""},{"$f":"IF(E4<>\"\",IF(E4<D4,C4,IF(E4>D4,B4,\"nul\")),\"\")","v":""},null,{"$f":"RANK(T4,$T$4:$T$9)","v":1},"AM","Albert de Mun",{"$f":"COUNT(D4,D8,D10,D13,D16,E19,E22,E25,E28,E31)","v":0},{"$f":"COUNTIF($F$3:$F$33,J4)","v":0},{"$f":"L4-M4-O4","v":0},{"$f":"COUNTIF(G3:G33,J4)","v":0},{"$f":"SUM(D4,D8,D10,D13,D16,E19,E22,E25,E28,E31)","v":0},{"$f":"SUM(E4,E8,E10,E13,E16,D19,D22,D25,D28,D31)","v":0},{"$f":"P4-Q4","v":0},{"$f":"M4*3+O4*1","v":0},{"$f":"SUM(S4*1000000+R4*10000+P4*100+L4*10)","v":0}]
[2,{"$f":"'Calendrier BG'!N13","v":"NDS 1"},{"$f":"'Calendrier BG'!O13","v":"NDS 3"},null,null,{"$f":"IF(D5<>\"\",IF(D5>E5,B5,IF(D5<E5,C5,\"nul\")),\"\")","v":""},{"$f":"IF(E5<>\"\",IF(E5<D5,C5,IF(E5>D5,B5,\"nul\")),\"\")","v":""},null,{"$f":"RANK(T5,$T$4:$T$9)","v":1},"NDS 1","Notre Dame de Sion 1",{"$f":"COUNT(D5,D9,D12,D14,E16,E20,E24,E27,E29,D31)","v":0},0,{"$f":"L5-M5-O5","v":0},0,{"$f":"SUM(D5,D9,D12,D14,E16,E20,E24,E27,E29,D31)","v":0},{"$f":"SUM(E5,E9,E12,E14,D16,D20,D24,D27,D29,E31)","v":0},{"$f":"P5-Q5","v":0},{"$f":"M5*3+O5*1","v":0},0]
[3,{"$f":"'Calendrier BG'!N14","v":"NDS 2"},{"$f":"'Calendrier BG'!O14","v":"SVI"},null,null,"","",null,1,"NDS 2","Notre Dame de Sion 2",{"$f":"COUNT(D6,E9,D11,E13,D17,E21,D24,E26,D28,E32)","v":0},0,0,0,{"$f":"SUM(D6,E9,D11,E13,D17,E21,D24,E26,D28,E32)","v":0},{"$f":"SUM(E6,D9,E11,D13,E17,D21,E24,D26,E28,D32)","v":0},0,0,0]
[4,{"$f":"'Calendrier BG'!N15","v":"AM"},{"$f":"'Calendrier BG'!O15","v":"NDS 3"},null,null,"","",null,1,"SVI","Saint Vincent ",{"$f":"COUNT(E6,D8,E10,E14,D18,D21,E23,D25,D29,E33)","v":0},0,0,0,{"$f":"SUM(E6,D8,E10,E14,D18,D21,E23,D25,D29,E33)","v":0},{"$f":"SUM(D6,E8,D10,D14,E18,E21,D23,E25,E29,D33)","v":0},0,0,0]
[5,{"$f":"'Calendrier BG'!N16","v":"SVI"},{"$f":"'Calendrier BG'!O16","v":0},null,null,"","",null,1,"NDS 3 ","Notre Dame de Sion 3",{"$f":"COUNT(E5,E7,E11,D15,E18,D20,D22,D26,E30,D33)","v":0},0,0,0,{"$f":"SUM(E5,E7,E11,D15,E18,D20,D22,D26,E30,D33)","v":0},{"$f":"SUM(D5,D7,D11,E15,D18,E20,E22,E26,D30,E33)","v":0},0,0,0]
[6,{"$f":"'Calendrier BG'!N17","v":"NDS 1"},{"$f":"'Calendrier BG'!O17","v":"NDS 2"},null,null,"","",null,1,null,"Saint Vincent 2",{"$f":"COUNT(E4,E8,E12,E15,E17,D19,D23,D27,D30,D32)","v":0},0,0,0,{"$f":"SUM(E4,E8,E12,E15,E17,D19,D23,D27,D30,D32)","v":0},{"$f":"SUM(D4,D8,D12,D15,D17,E19,E23,E27,E30,E32)","v":0},0,0,0]
[7,{"$f":"'Calendrier BG'!N18","v":"AM"},{"$f":"'Calendrier BG'!O18","v":"SVI"},null,null,"",""]
{"$rows_left_out":24}
{"sheet":"Calendrier MG","index":2,"n_rows":48,"n_cols":15,"rows_kept":48,"cut":false,"hidden":false,"merged":[[9,0,15,0],[21,1,23,7],[9,1,9,8],[16,0,19,0],[16,1,16,8],[17,4,19,4],[17,8,19,8],[20,0,23,0],[20,1,20,8],[21,8,23,8],[24,0,27,0],[25,1,25,7],[28,0,31,0],[28,1,28,8],[29,1,29,7],[29,8,31,8],[32,0,37,0],[32,1,32,8],[33,1,33,7],[33,8,37,8],[2,0,8,0],[0,10,0,27],[1,10,1,11],[2,10,2,11],[12,13,12,14],[3,4,6,4],[1,6,1,7],[2,1,2,8],[0,1,0,8],[7,4,8,4],[10,4,11,4],[12,4,15,4],[24,1,24,8],[38,0,41,0],[38,1,38,8],[39,8,41,8],[42,0,47,0],[42,1,42,8],[43,4,47,4],[43,8,47,8]]}
[null," CALENDRIER MINIMES",null,null,null,null,null,null,null,null,"POULES ET MATCHS MINIMES"]
["Date","Match","Equipe A","Equipe B","Lieux","Horaires","Résultats",null,"Indisponibilités",null,"DIVISION 1"]
["2 dec","DIVISION 1",null,null,null,null,null,null,null,null,"Etablissements",null,null,"Dates d'occupation de STAN par le Badminton"]
[null,5,{"$f":"VLOOKUP($B4,$K$13:$O$41,4)","v":"STAN 1"},{"$f":"VLOOKUP($B4,$K$13:$O$41,5)","v":"AM"},"STAN","14h30",{"$f":"IFERROR(VLOOKUP($B4,'Cls MG'!$A$3:$G$31,4,FALSE),\"\")","v":0},{"$f":"IFERROR(VLOOKUP($B4,'Cls MG'!$A$3:$G$31,5,FALSE),\"\")","v":0},null,null,1,"STAN 1",null,"16 dec"]
[null,10,"AM",{"$f":"VLOOKUP($B5,$K$13:$O$41,5)","v":"STAN 2"},null,"15h30",{"$f":"IFERROR(VLOOKUP($B5,'Cls MG'!$A$3:$G$31,4,FALSE),\"\")","v":0},{"$f":"IFERROR(VLOOKUP($B5,'Cls MG'!$A$3:$G$31,5,FALSE),\"\")","v":0},null,null,2,"STAN 2",null,"2020-01-27"]
[null,"CG","STAN","AM",null,"15h",null,null,null,null,3,"AM",null,"10 fev"]
[null,1,"STAN 1","STAN 2",null,"16h",{"$f":"IFERROR(VLOOKUP($B7,'Cls MG'!$A$3:$G$31,4,FALSE),\"\")","v":0},{"$f":"IFERROR(VLOOKUP($B7,'Cls MG'!$A$3:$G$31,5,FALSE),\"\")","v":0},null,null,4,"NDS 1",null,"2020-03-03"]
[null,7,"NDS 2","SVI","NDS","14h",{"$f":"IFERROR(VLOOKUP($B8,'Cls MG'!$A$3:$G$31,4,FALSE),\"\")","v":0},{"$f":"IFERROR(VLOOKUP($B8,'Cls MG'!$A$3:$G$31,5,FALSE),\"\")","v":0},null,null,5,"NDS 2"]
[null,28,"NDS 1","SVI",null,"15h",{"$f":"IFERROR(VLOOKUP($B9,'Cls MG'!$A$3:$G$31,4,FALSE),\"\")","v":0},{"$f":"IFERROR(VLOOKUP($B9,'Cls MG'!$A$3:$G$31,5,FALSE),\"\")","v":0},null,null,6,"NDS 3",null,"Territoire MG 24 mars et MF 10 mars"]
["9 dec","DIVISION 1",null,null,null,null,null,null,null,null,7,"SVI"]
{"$rows_left_out":39}
{"sheet":"Cls MG","index":3,"n_rows":31,"n_cols":20,"rows_kept":31,"cut":false,"hidden":false,"merged":[[0,0,1,6],[2,3,2,4]]}
["MINIMES DIVISION 1"]
[]
["N° Match","Equipe A","Equipe B","Scores",null,"Vainqueur","Perdant",null,null,"SIGLE","Etablissement","Matchs joués","Victoires","Nuls","Défaites","Buts Pour","Buts Contre","Différence","Points"]
[1,{"$f":"'Calendrier MG'!N14","v":"STAN 1"},{"$f":"'Calendrier MG'!O14","v":"STAN 2"},null,null,{"$f":"IF(D4<>\"\",IF(D4>E4,B4,IF(D4<E4,C4,\"nul\")),\"\")","v":""},{"$f":"IF(E4<>\"\",IF(E4<D4,C4,IF(E4>D4,B4,\"nul\")),\"\")","v":""},null,{"$f":"RANK(T4,$T$4:$T$13)","v":{"$error":"#REF!"}},"STAN 1","Stanislas 1",{"$f":"COUNT(D4,D8,E12,D16,D20,D24,D28,#REF!,#REF!)","v":0},{"$f":"COUNTIF($F$3:$F$31,J4)","v":0},{"$f":"L4-M4-O4","v":0},{"$f":"COUNTIF(G3:G31,J4)","v":0},{"$f":"SUM(D4,D8,E12,D16,D20,D24,D28)","v":0},{"$f":"SUM(E4,E8,D12,E16,E20,E24,E28,#REF!,#REF!)","v":{"$error":"#REF!"}},{"$f":"P4-Q4","v":{"$error":"#REF!"}},{"$f":"M4*3+O4*1","v":0},{"$f":"SUM(S4*1000000+R4*10000+P4*100+L4*10)","v":{"$error":"#REF!"}}]
[2,{"$f":"'Calendrier MG'!N15","v":"AM"},{"$f":"'Calendrier MG'!O15","v":"NDS 1"},null,null,{"$f":"IF(D5<>\"\",IF(D5>E5,B5,IF(D5<E5,C5,\"nul\")),\"\")","v":""},{"$f":"IF(E5<>\"\",IF(E5<D5,C5,IF(E5>D5,B5,\"nul\")),\"\")","v":""},null,{"$f":"RANK(T5,$T$4:$T$13)","v":{"$error":"#REF!"}},"STAN 2","Stanislas 2",{"$f":"COUNT(E4,D9,E13,D17,D21,D25,D29,#REF!,#REF!)","v":0},{"$f":"COUNTIF($F$3:$F$31,J5)","v":0},{"$f":"L5-M5-O5","v":0},{"$f":"COUNTIF(G4:G31,J5)","v":0},{"$f":"SUM(E4,D9,E13,D17,D21,D25,D29,#REF!,#REF!)","v":{"$error":"#REF!"}},{"$f":"SUM(D4,E9,D13,E17,E21,E25,E29,#REF!,#REF!)","v":{"$error":"#REF!"}},{"$f":"P5-Q5","v":{"$error":"#REF!"}},{"$f":"M5*3+O5*1","v":0},{"$error":"#REF!"}]
[3,{"$f":"'Calendrier MG'!N16","v":"NDS 2"},{"$f":"'Calendrier MG'!O16","v":"NDS 3"},null,null,"","",null,{"$error":"#REF!"},"AM","Albert de Mun",{"$f":"COUNT(D5,E8,D13,D18,D22,D26,D30,#REF!,#REF!)","v":0},{"$f":"COUNTIF($F$3:$F$31,J6)","v":0},{"$f":"L6-M6-O6","v":0},{"$f":"COUNTIF(G5:G31,J6)","v":0},{"$f":"SUM(D5,E8,D13,D18,D22,D26,D30,#REF!,#REF!)","v":{"$error":"#REF!"}},{"$f":"SUM(E5,D8,E13,E18,E22,E26,E30,#REF!,#REF!)","v":{"$error":"#REF!"}},{"$f":"P6-Q6","v":{"$error":"#REF!"}},0,{"$error":"#REF!"}]
[4,{"$f":"'Calendrier MG'!N17","v":"SVI"},{"$f":"'Calendrier MG'!O17","v":0},null,null,"","",null,{"$error":"#REF!"},"NDS 1","Notre Dame de Sion 1",{"$f":"COUNT(E5,E9,D12,D19,D23,D27,D31,#REF!,#REF!)","v":0},{"$f":"COUNTIF($F$3:$F$31,J7)","v":0},0,{"$f":"COUNTIF(G6:G31,J7)","v":0},{"$f":"SUM(E5,E9,D12,D19,D23,D27,D31,#REF!,#REF!)","v":{"$error":"#REF!"}},{"$f":"SUM(D5,D9,E12,E19,E23,E27,E31,#REF!,#REF!)","v":{"$error":"#REF!"}},{"$error":"#REF!"},0,{"$error":"#REF!"}]
[5,{"$f":"'Calendrier MG'!N18","v":"STAN 1"},{"$f":"'Calendrier MG'!O18","v":"AM"},null,null,"","",null,{"$error":"#REF!"},"NDS 2","Notre Dame de Sion 2",{"$f":"COUNT(D6,D10,E14,E16,E23,E26,E29,#REF!,#REF!)","v":0},{"$f":"COUNTIF($F$3:$F$31,J8)","v":0},0,{"$f":"COUNTIF(G7:G31,J8)","v":0},{"$f":"SUM(D6,D10,E14,E16,E23,E26,E29,#REF!,#REF!)","v":{"$error":"#REF!"}},{"$f":"SUM(E6,E10,D14,D16,D23,D26,D29,#REF!,#REF!)","v":{"$error":"#REF!"}},{"$error":"#REF!"},0,{"$error":"#REF!"}]
[6,{"$f":"'Calendrier MG'!N19","v":"STAN 2"},{"$f":"'Calendrier MG'!O19","v":"NDS 1"},null,null,"","",null,{"$error":"#REF!"},"NDS 3","Notre Dame de Sion 3",{"$f":"COUNT(E6,D11,E15,E17,E20,E27,E30,#REF!,#REF!)","v":0},{"$f":"COUNTIF($F$3:$F$31,J9)","v":0},0,{"$f":"COUNTIF(G8:G31,J9)","v":0},{"$f":"SUM(E6,D11,E15,E17,E20,E27,E30,#REF!,#REF!)","v":{"$error":"#REF!"}},{"$f":"SUM(D6,E11,D15,D17,D20,D27,D30,#REF!,#REF!)","v":{"$error":"#REF!"}},{"$error":"#REF!"},0,{"$error":"#REF!"}]
[7,{"$f":"'Calendrier MG'!N20","v":"NDS 2"},{"$f":"'Calendrier MG'!O20","v":"SVI"},null,null,"","",null,{"$error":"#REF!"},"SVI","Saint Vincent",{"$f":"COUNT(D7,E10,D15,E18,E21,E24,E31,#REF!,#REF!)","v":0},{"$f":"COUNTIF($F$3:$F$31,J10)","v":0},0,{"$f":"COUNTIF(G9:G31,J10)","v":0},{"$f":"SUM(D7,E10,D15,E18,E21,E24,E31,#REF!,#REF!)","v":{"$error":"#REF!"}},{"$f":"SUM(E7,D10,E15,D18,D21,D24,D31,#REF!,#REF!)","v":{"$error":"#REF!"}},{"$error":"#REF!"},0,{"$error":"#REF!"}]
{"$rows_left_out":22}
{"sheet":"Classements","index":4,"n_rows":13,"n_cols":23,"rows_kept":13,"cut":false,"hidden":false,"merged":[[0,0,1,10],[2,0,2,2],[0,12,1,22],[2,12,2,14]]}
["CLASSEMENT PROMO BENJAMINS 2019-2020",null,null,null,null,null,null,null,null,null,null,null,"CLASSEMENT PROMO MINIMES 2019-2020"]
[]
["DIVISION 1",null,null,null,null,null,null,null,null,null,null,null,"DIVISION 1"]
["CLASSEMENT","SIGLE","Etablissement","Matchs joués","Victoires","Nuls","Défaites","Buts Pour","Buts Contre","Différence","Points",null,"CLASSEMENT","SIGLE","Etablissement","Matchs joués","Victoires","Nuls","Défaites","Buts Pour","Buts Contre","Différence","Points"]
[1,{"$f":"'Cls BG'!J13","v":"AM"},{"$f":"'Cls BG'!K13","v":"Albert de Mun"},{"$f":"'Cls BG'!L13","v":0},{"$f":"'Cls BG'!M13","v":0},{"$f":"'Cls BG'!N13","v":0},{"$f":"'Cls BG'!O13","v":0},{"$f":"'Cls BG'!P13","v":0},{"$f":"'Cls BG'!Q13","v":0},{"$f":"'Cls BG'!R13","v":0},{"$f":"'Cls BG'!S13","v":0},null,1,{"$f":"'Cls MG'!J16","v":{"$error":"#N/A"}},{"$f":"'Cls MG'!K16","v":{"$error":"#N/A"}},{"$f":"'Cls MG'!L16","v":{"$error":"#N/A"}},{"$f":"'Cls MG'!M16","v":{"$error":"#N/A"}},{"$f":"'Cls MG'!N16","v":{"$error":"#N/A"}},{"$f":"'Cls MG'!O16","v":{"$error":"#N/A"}},{"$f":"'Cls MG'!P16","v":{"$error":"#N/A"}},{"$f":"'Cls MG'!Q16","v":{"$error":"#N/A"}},{"$f":"'Cls MG'!R16","v":{"$error":"#N/A"}},{"$f":"'Cls MG'!S16","v":{"$error":"#N/A"}}]
[2,{"$f":"'Cls BG'!J14","v":{"$error":"#N/A"}},{"$f":"'Cls BG'!K14","v":{"$error":"#N/A"}},{"$f":"'Cls BG'!L14","v":{"$error":"#N/A"}},{"$f":"'Cls BG'!M14","v":{"$error":"#N/A"}},{"$f":"'Cls BG'!N14","v":{"$error":"#N/A"}},{"$f":"'Cls BG'!O14","v":{"$error":"#N/A"}},{"$f":"'Cls BG'!P14","v":{"$error":"#N/A"}},{"$f":"'Cls BG'!Q14","v":{"$error":"#N/A"}},{"$f":"'Cls BG'!R14","v":{"$error":"#N/A"}},{"$f":"'Cls BG'!S14","v":{"$error":"#N/A"}},null,2,{"$f":"'Cls MG'!J17","v":{"$error":"#N/A"}},{"$f":"'Cls MG'!K17","v":{"$error":"#N/A"}},{"$f":"'Cls MG'!L17","v":{"$error":"#N/A"}},{"$f":"'Cls MG'!M17","v":{"$error":"#N/A"}},{"$f":"'Cls MG'!N17","v":{"$error":"#N/A"}},{"$f":"'Cls MG'!O17","v":{"$error":"#N/A"}},{"$f":"'Cls MG'!P17","v":{"$error":"#N/A"}},{"$f":"'Cls MG'!Q17","v":{"$error":"#N/A"}},{"$f":"'Cls MG'!R17","v":{"$error":"#N/A"}},{"$f":"'Cls MG'!S17","v":{"$error":"#N/A"}}]
[3,{"$f":"'Cls BG'!J15","v":{"$error":"#N/A"}},{"$f":"'Cls BG'!K15","v":{"$error":"#N/A"}},{"$f":"'Cls BG'!L15","v":{"$error":"#N/A"}},{"$f":"'Cls BG'!M15","v":{"$error":"#N/A"}},{"$f":"'Cls BG'!N15","v":{"$error":"#N/A"}},{"$f":"'Cls BG'!O15","v":{"$error":"#N/A"}},{"$f":"'Cls BG'!P15","v":{"$error":"#N/A"}},{"$f":"'Cls BG'!Q15","v":{"$error":"#N/A"}},{"$f":"'Cls BG'!R15","v":{"$error":"#N/A"}},{"$f":"'Cls BG'!S15","v":{"$error":"#N/A"}},null,3,{"$f":"'Cls MG'!J18","v":{"$error":"#N/A"}},{"$f":"'Cls MG'!K18","v":{"$error":"#N/A"}},{"$f":"'Cls MG'!L18","v":{"$error":"#N/A"}},{"$f":"'Cls MG'!M18","v":{"$error":"#N/A"}},{"$f":"'Cls MG'!N18","v":{"$error":"#N/A"}},{"$f":"'Cls MG'!O18","v":{"$error":"#N/A"}},{"$f":"'Cls MG'!P18","v":{"$error":"#N/A"}},{"$f":"'Cls MG'!Q18","v":{"$error":"#N/A"}},{"$f":"'Cls MG'!R18","v":{"$error":"#N/A"}},{"$f":"'Cls MG'!S18","v":{"$error":"#N/A"}}]
[4,{"$f":"'Cls BG'!J16","v":{"$error":"#N/A"}},{"$f":"'Cls BG'!K16","v":{"$error":"#N/A"}},{"$f":"'Cls BG'!L16","v":{"$error":"#N/A"}},{"$f":"'Cls BG'!M16","v":{"$error":"#N/A"}},{"$f":"'Cls BG'!N16","v":{"$error":"#N/A"}},{"$f":"'Cls BG'!O16","v":{"$error":"#N/A"}},{"$f":"'Cls BG'!P16","v":{"$error":"#N/A"}},{"$f":"'Cls BG'!Q16","v":{"$error":"#N/A"}},{"$f":"'Cls BG'!R16","v":{"$error":"#N/A"}},{"$f":"'Cls BG'!S16","v":{"$error":"#N/A"}},null,4,{"$f":"'Cls MG'!J19","v":{"$error":"#N/A"}},{"$f":"'Cls MG'!K19","v":{"$error":"#N/A"}},{"$f":"'Cls MG'!L19","v":{"$error":"#N/A"}},{"$f":"'Cls MG'!M19","v":{"$error":"#N/A"}},{"$f":"'Cls MG'!N19","v":{"$error":"#N/A"}},{"$f":"'Cls MG'!O19","v":{"$error":"#N/A"}},{"$f":"'Cls MG'!P19","v":{"$error":"#N/A"}},{"$f":"'Cls MG'!Q19","v":{"$error":"#N/A"}},{"$f":"'Cls MG'!R19","v":{"$error":"#N/A"}},{"$f":"'Cls MG'!S19","v":{"$error":"#N/A"}}]
[5,{"$f":"'Cls BG'!J17","v":{"$error":"#N/A"}},{"$f":"'Cls BG'!K17","v":{"$error":"#N/A"}},{"$f":"'Cls BG'!L17","v":{"$error":"#N/A"}},{"$f":"'Cls BG'!M17","v":{"$error":"#N/A"}},{"$f":"'Cls BG'!N17","v":{"$error":"#N/A"}},{"$f":"'Cls BG'!O17","v":{"$error":"#N/A"}},{"$f":"'Cls BG'!P17","v":{"$error":"#N/A"}},{"$f":"'Cls BG'!Q17","v":{"$error":"#N/A"}},{"$f":"'Cls BG'!R17","v":{"$error":"#N/A"}},{"$f":"'Cls BG'!S17","v":{"$error":"#N/A"}},null,5,{"$f":"'Cls MG'!J20","v":{"$error":"#N/A"}},{"$f":"'Cls MG'!K20","v":{"$error":"#N/A"}},{"$f":"'Cls MG'!L20","v":{"$error":"#N/A"}},{"$f":"'Cls MG'!M20","v":{"$error":"#N/A"}},{"$f":"'Cls MG'!N20","v":{"$error":"#N/A"}},{"$f":"'Cls MG'!O20","v":{"$error":"#N/A"}},{"$f":"'Cls MG'!P20","v":{"$error":"#N/A"}},{"$f":"'Cls MG'!Q20","v":{"$error":"#N/A"}},{"$f":"'Cls MG'!R20","v":{"$error":"#N/A"}},{"$f":"'Cls MG'!S20","v":{"$error":"#N/A"}}]
[6,{"$f":"'Cls BG'!J18","v":{"$error":"#N/A"}},{"$f":"'Cls BG'!K18","v":{"$error":"#N/A"}},{"$f":"'Cls BG'!L18","v":{"$error":"#N/A"}},{"$f":"'Cls BG'!M18","v":{"$error":"#N/A"}},{"$f":"'Cls BG'!N18","v":{"$error":"#N/A"}},{"$f":"'Cls BG'!O18","v":{"$error":"#N/A"}},{"$f":"'Cls BG'!P18","v":{"$error":"#N/A"}},{"$f":"'Cls BG'!Q18","v":{"$error":"#N/A"}},{"$f":"'Cls BG'!R18","v":{"$error":"#N/A"}},{"$f":"'Cls BG'!S18","v":{"$error":"#N/A"}},null,6,{"$f":"'Cls MG'!J21","v":{"$error":"#N/A"}},{"$f":"'Cls MG'!K21","v":{"$error":"#N/A"}},{"$f":"'Cls MG'!L21","v":{"$error":"#N/A"}},{"$f":"'Cls MG'!M21","v":{"$error":"#N/A"}},{"$f":"'Cls MG'!N21","v":{"$error":"#N/A"}},{"$f":"'Cls MG'!O21","v":{"$error":"#N/A"}},{"$f":"'Cls MG'!P21","v":{"$error":"#N/A"}},{"$f":"'Cls MG'!Q21","v":{"$error":"#N/A"}},{"$f":"'Cls MG'!R21","v":{"$error":"#N/A"}},{"$f":"'Cls MG'!S21","v":{"$error":"#N/A"}}]
{"$rows_left_out":4}
{"sheet":"Indispos profs","index":5,"n_rows":6,"n_cols":16,"rows_kept":6,"cut":false,"hidden":false,"merged":[[0,0,0,15],[1,1,1,5],[1,6,1,10],[1,11,1,15]]}
["DATES D'INDISPONIBILITES DES ETABLISSEMENTS"]
["SIGLES","Benjamins",null,null,null,null,"Minimes",null,null,null,null,"Lycée"]
["STAN","2020-12-02","2020-12-16","2020-01-06","2020-01-20","2020-01-27","2020-12-02","2020-12-16","2020-01-06","2020-01-20","2020-01-27","2020-12-02","2020-12-16","2020-01-06","2020-01-20","2020-01-27"]
["AM"]
["NDS"]
["SVI"]

{"sheet":"Listing profs","index":6,"n_rows":7,"n_cols":5,"rows_kept":7,"cut":false,"hidden":false,"merged":[[0,0,0,4],[3,0,4,0],[3,1,4,1]]}
["LISTING HANDBALL 2020-2021"]
["NOM D'ETABLISSEMENT","SIGLE","NOM et PRENOM","N° MOBILE","MAIL "]
["STANISLAS","STAN","GALLY Fabien","06 83 60 10 11","fabiengally78@gmail.com"]
["NOTRE DAME DE SION","NDS","SOUFFLARD Camille","06 80 75 21 65","soufflard.camille@gmail.com"]
[null,null,"BOUZOU Baptiste","06 06 48 56 09","baptistebouzou95@gmail.com"]
["ALBERT DE MUN","AM","MEDINA Pierre-Alexis","07 60 89 73 77","medina.p-a@hotmail.fr"]
["SAINT VINCENT","SVI","SANDRI Fiona","06 65 35 16 48","sandri.fiona@icloud.com"]

{"sheet":"Installations","index":7,"n_rows":5,"n_cols":4,"rows_kept":5,"cut":false,"hidden":false,"merged":[[0,0,0,3]]}
["INSTALLATIONS HANDBALL 2020-2021"]
["NOM DU TERRAIN","COORDONNEES","MOYENS D'ACCES","HORAIRES"]
[]
["GYMNASE STANISLAS","22 rue Notre Dame des Champs 75006 Paris","Métro 12 Notre Dame des Champs","14h30 à 16h30"]
["GYMNASE NOTRE DAME DE SION","61 rue Notre Dame des Champs 75006 Paris","Métro 12 Notre Dame des Champs","13h30-16h"]